<?xml version="1.0" encoding="UTF-8" standalone="no"?>
<!-- Created with Inkscape (http://www.inkscape.org/) -->
<svg
   xmlns:dc="http://purl.org/dc/elements/1.1/"
   xmlns:cc="http://creativecommons.org/ns#"
   xmlns:rdf="http://www.w3.org/1999/02/22-rdf-syntax-ns#"
   xmlns:svg="http://www.w3.org/2000/svg"
   xmlns="http://www.w3.org/2000/svg"
   xmlns:sodipodi="http://sodipodi.sourceforge.net/DTD/sodipodi-0.dtd"
   xmlns:inkscape="http://www.inkscape.org/namespaces/inkscape"
   width="941.23578"
   height="98.51062"
   id="svg2"
   sodipodi:version="0.32"
   inkscape:version="0.46"
   sodipodi:docname="design-gateway.svg"
   inkscape:output_extension="org.inkscape.output.svg.inkscape"
   inkscape:export-filename="D:\Baudin\ProjetScilabNisp\svn-opus\trunk\doc\Documents\Talks\JourneeIncerteo.17.09.2009.MB\design-toolbox.png"
   inkscape:export-xdpi="423"
   inkscape:export-ydpi="423"
   version="1.0">
  <defs
     id="defs4">
    <marker
       inkscape:stockid="Arrow1Lend"
       orient="auto"
       refY="0"
       refX="0"
       id="Arrow1Lend"
       style="overflow:visible">
      <path
         id="path3314"
         d="M 0,0 L 5,-5 L -12.5,0 L 5,5 L 0,0 z"
         style="fill-rule:evenodd;stroke:#000000;stroke-width:1pt;marker-start:none"
         transform="matrix(-0.8,0,0,-0.8,-10,0)" />
    </marker>
    <inkscape:perspective
       sodipodi:type="inkscape:persp3d"
       inkscape:vp_x="0 : 526.18109 : 1"
       inkscape:vp_y="0 : 1000 : 0"
       inkscape:vp_z="744.09448 : 526.18109 : 1"
       inkscape:persp3d-origin="372.04724 : 350.78739 : 1"
       id="perspective10" />
    <inkscape:perspective
       id="perspective2484"
       inkscape:persp3d-origin="372.04724 : 350.78739 : 1"
       inkscape:vp_z="744.09448 : 526.18109 : 1"
       inkscape:vp_y="0 : 1000 : 0"
       inkscape:vp_x="0 : 526.18109 : 1"
       sodipodi:type="inkscape:persp3d" />
  </defs>
  <sodipodi:namedview
     id="base"
     pagecolor="#ffffff"
     bordercolor="#666666"
     borderopacity="1.0"
     inkscape:pageopacity="0.0"
     inkscape:pageshadow="2"
     inkscape:zoom="0.49497475"
     inkscape:cx="326.57595"
     inkscape:cy="382.09165"
     inkscape:document-units="px"
     inkscape:current-layer="layer1"
     showgrid="false"
     inkscape:window-width="1412"
     inkscape:window-height="949"
     inkscape:window-x="1883"
     inkscape:window-y="25" />
  <metadata
     id="metadata7">
    <rdf:RDF>
      <cc:Work
         rdf:about="">
        <dc:format>image/svg+xml</dc:format>
        <dc:type
           rdf:resource="http://purl.org/dc/dcmitype/StillImage" />
      </cc:Work>
    </rdf:RDF>
  </metadata>
  <g
     inkscape:label="Calque 1"
     inkscape:groupmode="layer"
     id="layer1"
     transform="translate(27.624727,-172.38261)">
    <g
       id="g2531"
       transform="matrix(0.7719298,0,0,0.7719298,74.385414,80.886061)">
      <g
         id="g2467">
        <rect
           style="fill:none;fill-opacity:1;stroke:#000000;stroke-width:1.25;stroke-miterlimit:4;stroke-dasharray:none;stroke-opacity:1"
           id="rect2512"
           width="172.56802"
           height="119.198"
           x="-131.52451"
           y="123.02184" />
        <text
           xml:space="preserve"
           style="font-size:40px;font-style:normal;font-weight:normal;fill:#000000;fill-opacity:1;stroke:none;stroke-width:1px;stroke-linecap:butt;stroke-linejoin:miter;stroke-opacity:1;font-family:Bitstream Vera Sans"
           x="-97.174088"
           y="192.97241"
           id="text2514"><tspan
             sodipodi:role="line"
             id="tspan2516"
             x="-97.174088"
             y="192.97241">Script</tspan></text>
      </g>
    </g>
    <path
       style="fill:none;fill-rule:evenodd;stroke:#000000;stroke-width:1.5438596;stroke-linecap:butt;stroke-linejoin:miter;marker-end:url(#Arrow1Lend);stroke-miterlimit:4;stroke-dasharray:none;stroke-opacity:1"
       d="M 122.64456,219.08993 L 173.32941,219.08993"
       id="path2536" />
    <g
       id="g2452"
       transform="translate(410.81028,-364.32433)">
      <rect
         y="537.18939"
         x="67.572296"
         height="92.012489"
         width="187.49608"
         id="rect2490"
         style="fill:none;fill-opacity:1;stroke:#000000;stroke-width:0.96491224;stroke-miterlimit:4;stroke-dasharray:none;stroke-opacity:1" />
      <text
         id="text2492"
         y="591.18634"
         x="99.694107"
         style="font-size:30.87719154px;font-style:normal;font-weight:normal;fill:#000000;fill-opacity:1;stroke:none;stroke-width:1px;stroke-linecap:butt;stroke-linejoin:miter;stroke-opacity:1;font-family:Bitstream Vera Sans"
         xml:space="preserve"><tspan
           y="591.18634"
           x="99.694107"
           id="tspan2494"
           sodipodi:role="line">Gateway</tspan></text>
    </g>
    <g
       id="g2457"
       transform="translate(669.38786,-523.25903)">
      <rect
         y="696.65173"
         x="80.328514"
         height="92.012489"
         width="163.4122"
         id="rect2503"
         style="fill:none;fill-opacity:1;stroke:#000000;stroke-width:0.96491224;stroke-miterlimit:4;stroke-dasharray:none;stroke-opacity:1" />
      <text
         id="text2505"
         y="750.64868"
         x="113.789"
         style="font-size:30.87719154px;font-style:normal;font-weight:normal;fill:#000000;fill-opacity:1;stroke:none;stroke-width:1px;stroke-linecap:butt;stroke-linejoin:miter;stroke-opacity:1;font-family:Bitstream Vera Sans"
         xml:space="preserve"><tspan
           y="750.64868"
           x="113.789"
           id="tspan2507"
           sodipodi:role="line">Library</tspan></text>
    </g>
    <g
       id="g2462"
       transform="translate(116.51103,-190.81479)">
      <rect
         y="369.21307"
         x="73.394829"
         height="92.012489"
         width="204.63901"
         id="rect2428"
         style="fill:none;fill-opacity:1;stroke:#000000;stroke-width:0.96491224;stroke-miterlimit:4;stroke-dasharray:none;stroke-opacity:1" />
      <text
         id="text2430"
         y="423.21002"
         x="102.79562"
         style="font-size:30.87719154px;font-style:normal;font-weight:normal;fill:#000000;fill-opacity:1;stroke:none;stroke-width:1px;stroke-linecap:butt;stroke-linejoin:miter;stroke-opacity:1;font-family:Bitstream Vera Sans"
         xml:space="preserve"><tspan
           y="423.21002"
           x="102.79562"
           id="tspan2432"
           sodipodi:role="line">Interpreter</tspan></text>
    </g>
    <path
       style="fill:none;fill-rule:evenodd;stroke:#000000;stroke-width:1.5438596;stroke-linecap:butt;stroke-linejoin:miter;marker-end:url(#Arrow1Lend);stroke-miterlimit:4;stroke-dasharray:none;stroke-opacity:1"
       d="M 411.1213,217.97618 L 461.80615,217.97618"
       id="path2402" />
    <path
       style="fill:none;fill-rule:evenodd;stroke:#000000;stroke-width:1.5438596;stroke-linecap:butt;stroke-linejoin:miter;marker-end:url(#Arrow1Lend);stroke-miterlimit:4;stroke-dasharray:none;stroke-opacity:1"
       d="M 682.45507,213.93557 L 733.13993,213.93557"
       id="path2404" />
  </g>
</svg>
