<?xml version="1.0" encoding="UTF-8" standalone="no"?>
<!-- Created with Inkscape (http://www.inkscape.org/) -->
<svg
   xmlns:dc="http://purl.org/dc/elements/1.1/"
   xmlns:cc="http://creativecommons.org/ns#"
   xmlns:rdf="http://www.w3.org/1999/02/22-rdf-syntax-ns#"
   xmlns:svg="http://www.w3.org/2000/svg"
   xmlns="http://www.w3.org/2000/svg"
   xmlns:sodipodi="http://sodipodi.sourceforge.net/DTD/sodipodi-0.dtd"
   xmlns:inkscape="http://www.inkscape.org/namespaces/inkscape"
   width="787.05383"
   height="787.43475"
   id="svg3333"
   sodipodi:version="0.32"
   inkscape:version="0.46"
   version="1.0"
   sodipodi:docname="scidoublematrix.svg"
   inkscape:output_extension="org.inkscape.output.svg.inkscape">
  <defs
     id="defs3335">
    <inkscape:perspective
       sodipodi:type="inkscape:persp3d"
       inkscape:vp_x="0 : 526.18109 : 1"
       inkscape:vp_y="0 : 1000 : 0"
       inkscape:vp_z="744.09448 : 526.18109 : 1"
       inkscape:persp3d-origin="372.04724 : 350.78739 : 1"
       id="perspective3341" />
  </defs>
  <sodipodi:namedview
     id="base"
     pagecolor="#ffffff"
     bordercolor="#666666"
     borderopacity="1.0"
     inkscape:pageopacity="0.0"
     inkscape:pageshadow="2"
     inkscape:zoom="0.35"
     inkscape:cx="-16.559366"
     inkscape:cy="99.974462"
     inkscape:document-units="px"
     inkscape:current-layer="layer1"
     showgrid="true"
     inkscape:window-width="1415"
     inkscape:window-height="860"
     inkscape:window-x="1773"
     inkscape:window-y="65">
    <inkscape:grid
       type="xygrid"
       id="grid2400"
       visible="true"
       enabled="true" />
  </sodipodi:namedview>
  <metadata
     id="metadata3338">
    <rdf:RDF>
      <cc:Work
         rdf:about="">
        <dc:format>image/svg+xml</dc:format>
        <dc:type
           rdf:resource="http://purl.org/dc/dcmitype/StillImage" />
      </cc:Work>
    </rdf:RDF>
  </metadata>
  <g
     inkscape:label="Calque 1"
     inkscape:groupmode="layer"
     id="layer1"
     transform="translate(74.357503,-74.359075)">
    <rect
       style="fill:none;fill-opacity:1;stroke:#000000;stroke-width:4.98564577;stroke-miterlimit:4;stroke-dasharray:none;stroke-dashoffset:0;stroke-opacity:1"
       id="rect2507"
       width="527.01672"
       height="782.4491"
       x="183.18677"
       y="76.851898"
       ry="0" />
    <path
       style="fill:none;fill-rule:evenodd;stroke:#000000;stroke-width:4.98564577;stroke-linecap:butt;stroke-linejoin:miter;stroke-miterlimit:4;stroke-dasharray:none;stroke-opacity:1"
       d="M 184.58439,445.82635 L 709.56339,445.82635"
       id="path3281"
       sodipodi:nodetypes="cc" />
    <text
       xml:space="preserve"
       style="font-size:99.71292114px;font-style:normal;font-weight:normal;fill:#000000;fill-opacity:1;stroke:none;stroke-width:1px;stroke-linecap:butt;stroke-linejoin:miter;stroke-opacity:1;font-family:Bitstream Vera Sans"
       x="-78.20385"
       y="689.13599"
       id="text3283"><tspan
         sodipodi:role="line"
         id="tspan3285"
         x="-78.20385"
         y="689.13599"
         style="font-size:49.85646057px">Data</tspan></text>
    <path
       style="fill:none;fill-rule:evenodd;stroke:#000000;stroke-width:2;stroke-linecap:butt;stroke-linejoin:miter;stroke-miterlimit:4;stroke-dasharray:none;stroke-opacity:1"
       d="M 183.88558,169.0955 L 709.77575,169.0955"
       id="path3287"
       sodipodi:nodetypes="cc" />
    <path
       style="fill:none;fill-rule:evenodd;stroke:#000000;stroke-width:2;stroke-linecap:butt;stroke-linejoin:miter;stroke-miterlimit:4;stroke-dasharray:none;stroke-opacity:1"
       d="M 182.48795,261.33913 L 709.59748,261.33913"
       id="path3289"
       sodipodi:nodetypes="cc" />
    <path
       style="fill:none;fill-rule:evenodd;stroke:#000000;stroke-width:2;stroke-linecap:butt;stroke-linejoin:miter;stroke-miterlimit:4;stroke-dasharray:none;stroke-opacity:1"
       d="M 182.48795,353.58275 L 709.89335,353.58275"
       id="path3291"
       sodipodi:nodetypes="cc" />
    <path
       style="fill:none;fill-rule:evenodd;stroke:#000000;stroke-width:2.49282289;stroke-linecap:butt;stroke-linejoin:miter;stroke-miterlimit:4;stroke-dasharray:none;stroke-opacity:1"
       d="M 182.48795,76.851904 L 661.87521,76.851904"
       id="path3297" />
    <text
       xml:space="preserve"
       style="font-size:99.71292114px;font-style:normal;font-weight:normal;fill:#000000;fill-opacity:1;stroke:none;stroke-width:1px;stroke-linecap:butt;stroke-linejoin:miter;stroke-opacity:1;font-family:Bitstream Vera Sans"
       x="250.65871"
       y="143.321"
       id="text3299"><tspan
         sodipodi:role="line"
         id="tspan3301"
         x="250.65871"
         y="143.321"
         style="font-size:49.85646057px">Type</tspan></text>
    <text
       xml:space="preserve"
       style="font-size:99.71292114px;font-style:normal;font-weight:normal;fill:#000000;fill-opacity:1;stroke:none;stroke-width:1px;stroke-linecap:butt;stroke-linejoin:miter;stroke-opacity:1;font-family:Bitstream Vera Sans"
       x="248.02956"
       y="236.20113"
       id="text3303"><tspan
         sodipodi:role="line"
         id="tspan3305"
         x="248.02956"
         y="236.20113"
         style="font-size:49.85646057px">Number of rows</tspan></text>
    <text
       xml:space="preserve"
       style="font-size:99.71292114px;font-style:normal;font-weight:normal;fill:#000000;fill-opacity:1;stroke:none;stroke-width:1px;stroke-linecap:butt;stroke-linejoin:miter;stroke-opacity:1;font-family:Bitstream Vera Sans"
       x="248.02956"
       y="324.95743"
       id="text3307"><tspan
         sodipodi:role="line"
         id="tspan3309"
         x="248.02956"
         y="324.95743"
         style="font-size:49.85646057px">Number of columns</tspan></text>
    <text
       xml:space="preserve"
       style="font-size:99.71292114px;font-style:normal;font-weight:normal;fill:#000000;fill-opacity:1;stroke:none;stroke-width:1px;stroke-linecap:butt;stroke-linejoin:miter;stroke-opacity:1;font-family:Bitstream Vera Sans"
       x="247.17751"
       y="413.93542"
       id="text3311"><tspan
         sodipodi:role="line"
         id="tspan3313"
         x="247.17751"
         y="413.93542"
         style="font-size:49.85646057px">IsReal</tspan></text>
    <path
       style="fill:none;fill-rule:evenodd;stroke:#000000;stroke-width:2;stroke-linecap:butt;stroke-linejoin:miter;stroke-miterlimit:4;stroke-dasharray:none;stroke-opacity:1"
       d="M -22.889321,360.2919 L -74.285714,360.2919 L -74.285714,10.291896 L -22.857143,10.291896"
       id="path2398"
       transform="translate(180.69394,74.359077)"
       sodipodi:nodetypes="cccc" />
    <text
       xml:space="preserve"
       style="font-size:99.71292114px;font-style:normal;font-weight:normal;fill:#000000;fill-opacity:1;stroke:none;stroke-width:1px;stroke-linecap:butt;stroke-linejoin:miter;stroke-opacity:1;font-family:Bitstream Vera Sans"
       x="-78.349915"
       y="274.36124"
       id="text2418"><tspan
         sodipodi:role="line"
         id="tspan2420"
         x="-78.349915"
         y="274.36124"
         style="font-size:49.85646057px">Header</tspan></text>
    <path
       style="fill:none;fill-rule:evenodd;stroke:#000000;stroke-width:2;stroke-linecap:butt;stroke-linejoin:miter;stroke-miterlimit:4;stroke-dasharray:none;stroke-opacity:1"
       d="M 156.37604,848.93669 L 104.97965,848.93669 L 104.97965,458.93669 L 156.40822,458.93669"
       id="path3192"
       sodipodi:nodetypes="cccc" />
    <path
       sodipodi:type="arc"
       style="opacity:1;fill:#000000;fill-opacity:1;stroke:#000000;stroke-width:2;stroke-miterlimit:4;stroke-dasharray:none;stroke-dashoffset:0;stroke-opacity:1"
       id="path3194"
       sodipodi:cx="297.93658"
       sodipodi:cy="55.015743"
       sodipodi:rx="12.063415"
       sodipodi:ry="12.063415"
       d="M 310,55.015743 A 12.063415,12.063415 0 1 1 285.87317,55.015743 A 12.063415,12.063415 0 1 1 310,55.015743 z"
       transform="translate(-76.319392,75.707249)" />
    <path
       sodipodi:type="arc"
       style="opacity:1;fill:#000000;fill-opacity:1;stroke:#000000;stroke-width:2;stroke-miterlimit:4;stroke-dasharray:none;stroke-dashoffset:0;stroke-opacity:1"
       id="path3196"
       sodipodi:cx="297.93658"
       sodipodi:cy="55.015743"
       sodipodi:rx="12.063415"
       sodipodi:ry="12.063415"
       d="M 310,55.015743 A 12.063415,12.063415 0 1 1 285.87317,55.015743 A 12.063415,12.063415 0 1 1 310,55.015743 z"
       transform="translate(-76.319392,163.32908)" />
    <path
       sodipodi:type="arc"
       style="opacity:1;fill:#000000;fill-opacity:1;stroke:#000000;stroke-width:2;stroke-miterlimit:4;stroke-dasharray:none;stroke-dashoffset:0;stroke-opacity:1"
       id="path3198"
       sodipodi:cx="297.93658"
       sodipodi:cy="55.015743"
       sodipodi:rx="12.063415"
       sodipodi:ry="12.063415"
       d="M 310,55.015743 A 12.063415,12.063415 0 1 1 285.87317,55.015743 A 12.063415,12.063415 0 1 1 310,55.015743 z"
       transform="translate(-76.319392,252.08538)" />
    <path
       sodipodi:type="arc"
       style="opacity:1;fill:#000000;fill-opacity:1;stroke:#000000;stroke-width:2;stroke-miterlimit:4;stroke-dasharray:none;stroke-dashoffset:0;stroke-opacity:1"
       id="path3200"
       sodipodi:cx="297.93658"
       sodipodi:cy="55.015743"
       sodipodi:rx="12.063415"
       sodipodi:ry="12.063415"
       d="M 310,55.015743 A 12.063415,12.063415 0 1 1 285.87317,55.015743 A 12.063415,12.063415 0 1 1 310,55.015743 z"
       transform="translate(-76.319392,341.36768)" />
  </g>
</svg>
