<?xml version="1.0" encoding="UTF-8" standalone="no"?>
<!-- Created with Inkscape (http://www.inkscape.org/) -->
<svg
   xmlns:dc="http://purl.org/dc/elements/1.1/"
   xmlns:cc="http://creativecommons.org/ns#"
   xmlns:rdf="http://www.w3.org/1999/02/22-rdf-syntax-ns#"
   xmlns:svg="http://www.w3.org/2000/svg"
   xmlns="http://www.w3.org/2000/svg"
   xmlns:sodipodi="http://sodipodi.sourceforge.net/DTD/sodipodi-0.dtd"
   xmlns:inkscape="http://www.inkscape.org/namespaces/inkscape"
   width="550.45746"
   height="262.25528"
   id="svg3333"
   sodipodi:version="0.32"
   inkscape:version="0.46"
   version="1.0"
   sodipodi:docname="linearindexing.svg"
   inkscape:output_extension="org.inkscape.output.svg.inkscape">
  <defs
     id="defs3335">
    <marker
       inkscape:stockid="Arrow1Lend"
       orient="auto"
       refY="0"
       refX="0"
       id="Arrow1Lend"
       style="overflow:visible">
      <path
         id="path3384"
         d="M 0,0 L 5,-5 L -12.5,0 L 5,5 L 0,0 z"
         style="fill-rule:evenodd;stroke:#000000;stroke-width:1pt;marker-start:none"
         transform="matrix(-0.8,0,0,-0.8,-10,0)" />
    </marker>
    <inkscape:perspective
       sodipodi:type="inkscape:persp3d"
       inkscape:vp_x="0 : 526.18109 : 1"
       inkscape:vp_y="0 : 1000 : 0"
       inkscape:vp_z="744.09448 : 526.18109 : 1"
       inkscape:persp3d-origin="372.04724 : 350.78739 : 1"
       id="perspective3341" />
  </defs>
  <sodipodi:namedview
     id="base"
     pagecolor="#ffffff"
     bordercolor="#666666"
     borderopacity="1.0"
     inkscape:pageopacity="0.0"
     inkscape:pageshadow="2"
     inkscape:zoom="1.4"
     inkscape:cx="299.83122"
     inkscape:cy="117.17807"
     inkscape:document-units="px"
     inkscape:current-layer="layer1"
     showgrid="true"
     inkscape:window-width="1398"
     inkscape:window-height="860"
     inkscape:window-x="1747"
     inkscape:window-y="36"
     inkscape:window-maximized="0">
    <inkscape:grid
       type="xygrid"
       id="grid2400"
       visible="true"
       enabled="true" />
  </sodipodi:namedview>
  <metadata
     id="metadata3338">
    <rdf:RDF>
      <cc:Work
         rdf:about="">
        <dc:format>image/svg+xml</dc:format>
        <dc:type
           rdf:resource="http://purl.org/dc/dcmitype/StillImage" />
      </cc:Work>
    </rdf:RDF>
  </metadata>
  <g
     inkscape:label="Calque 1"
     inkscape:groupmode="layer"
     id="layer1"
     transform="translate(-192.84375,-239.91725)">
    <g
       id="g2408"
       transform="translate(238.99467,35)">
      <text
         id="text2418"
         y="173.79068"
         x="6.9697294"
         style="font-size:347.86447144px;font-style:normal;font-weight:normal;fill:#000000;fill-opacity:1;stroke:none;stroke-width:1px;stroke-linecap:butt;stroke-linejoin:miter;stroke-opacity:1;font-family:Bitstream Vera Sans"
         xml:space="preserve"><tspan
           style="font-size:41.86392212px"
           y="173.79068"
           x="6.9697294"
           id="tspan2420"
           sodipodi:role="line" /></text>
      <text
         id="text2404"
         y="193.71602"
         x="45.642498"
         style="font-size:75.08444214px;font-style:normal;font-weight:normal;fill:#000000;fill-opacity:1;stroke:none;stroke-width:1px;stroke-linecap:butt;stroke-linejoin:miter;stroke-opacity:1;font-family:Bitstream Vera Sans"
         xml:space="preserve"><tspan
           style="font-size:37.54222107px"
           y="193.71602"
           x="45.642498"
           id="tspan2406"
           sodipodi:role="line" /></text>
    </g>
    <rect
       style="fill:none;fill-opacity:1;stroke:#000000;stroke-width:5;stroke-miterlimit:4;stroke-dasharray:none;stroke-dashoffset:0;stroke-opacity:1"
       id="rect2507"
       width="515.15308"
       height="252.21028"
       x="214.53665"
       y="245.15492"
       ry="0" />
    <path
       style="fill:none;fill-rule:evenodd;stroke:#000000;stroke-width:5;stroke-linecap:butt;stroke-linejoin:miter;stroke-miterlimit:4;stroke-dasharray:none;stroke-opacity:1"
       d="M 214.11491,330.22835 L 727.8474,330.22835"
       id="path2501"
       sodipodi:nodetypes="cc" />
    <text
       xml:space="preserve"
       style="font-size:36.26542664px;font-style:normal;font-weight:normal;fill:#000000;fill-opacity:1;stroke:none;stroke-width:1px;stroke-linecap:butt;stroke-linejoin:miter;stroke-opacity:1;font-family:Bitstream Vera Sans"
       x="228.99649"
       y="296.04312"
       id="text2503"
       sodipodi:linespacing="100%"><tspan
         sodipodi:role="line"
         id="tspan2505"
         x="228.99649"
         y="296.04312">11 <tspan
   style="-inkscape-font-specification:Arial Italic;font-family:Arial;font-weight:normal;font-style:italic;font-stretch:normal;font-variant:normal;font-size:36px;text-anchor:start;text-align:start;writing-mode:lr;line-height:100%"
   id="tspan2425">(1)</tspan></tspan></text>
    <path
       style="fill:none;fill-rule:evenodd;stroke:#000000;stroke-width:5;stroke-linecap:butt;stroke-linejoin:miter;stroke-miterlimit:4;stroke-dasharray:none;stroke-opacity:1"
       d="M 214.11491,414.31209 L 729.86771,414.31209"
       id="path2519"
       sodipodi:nodetypes="cc" />
    <text
       xml:space="preserve"
       style="font-size:36.26542664px;font-style:normal;font-weight:normal;fill:#000000;fill-opacity:1;stroke:none;stroke-width:1px;stroke-linecap:butt;stroke-linejoin:miter;stroke-opacity:1;font-family:Bitstream Vera Sans"
       x="228.99649"
       y="381.17325"
       id="text3315"
       sodipodi:linespacing="125%"><tspan
         sodipodi:role="line"
         id="tspan3317"
         x="228.99649"
         y="381.17325">12 <tspan
   style="-inkscape-font-specification:Arial Italic;font-family:Arial;font-weight:normal;font-style:italic;font-stretch:normal;font-variant:normal;font-size:36px;text-anchor:start;text-align:start;writing-mode:lr;line-height:125%"
   id="tspan2427">(2)</tspan></tspan></text>
    <text
       xml:space="preserve"
       style="font-size:36.26542664px;font-style:normal;font-weight:normal;fill:#000000;fill-opacity:1;stroke:none;stroke-width:1px;stroke-linecap:butt;stroke-linejoin:miter;stroke-opacity:1;font-family:Bitstream Vera Sans"
       x="228.99649"
       y="464.86606"
       id="text3319"
       sodipodi:linespacing="125%"><tspan
         sodipodi:role="line"
         id="tspan3321"
         x="228.99649"
         y="464.86606">13 <tspan
   style="-inkscape-font-specification:Arial Italic;font-family:Arial;font-weight:normal;font-style:italic;font-stretch:normal;font-variant:normal;font-size:36px;text-anchor:start;text-align:start;writing-mode:lr;line-height:125%"
   id="tspan2429">(3)</tspan></tspan></text>
    <text
       xml:space="preserve"
       style="font-size:36.26542664px;font-style:normal;font-weight:normal;fill:#000000;fill-opacity:1;stroke:none;stroke-width:1px;stroke-linecap:butt;stroke-linejoin:miter;stroke-opacity:1;font-family:Bitstream Vera Sans"
       x="354.63123"
       y="296.04312"
       id="text3323"
       sodipodi:linespacing="125%"><tspan
         sodipodi:role="line"
         id="tspan3325"
         x="354.63123"
         y="296.04312">14 <tspan
   style="-inkscape-font-specification:Arial Italic;font-family:Arial;font-weight:normal;font-style:italic;font-stretch:normal;font-variant:normal;font-size:36px;text-anchor:start;text-align:start;writing-mode:lr;line-height:125%"
   id="tspan2431">(4)</tspan></tspan></text>
    <text
       xml:space="preserve"
       style="font-size:36.26542664px;font-style:normal;font-weight:normal;fill:#000000;fill-opacity:1;stroke:none;stroke-width:1px;stroke-linecap:butt;stroke-linejoin:miter;stroke-opacity:1;font-family:Bitstream Vera Sans"
       x="354.63123"
       y="381.17325"
       id="text3327"
       sodipodi:linespacing="125%"><tspan
         sodipodi:role="line"
         id="tspan3329"
         x="354.63123"
         y="381.17325">15 <tspan
   style="-inkscape-font-specification:Arial Italic;font-family:Arial;font-weight:normal;font-style:italic;font-stretch:normal;font-variant:normal;font-size:36px;text-anchor:start;text-align:start;writing-mode:lr;line-height:125%"
   id="tspan2433">(5)</tspan></tspan></text>
    <text
       xml:space="preserve"
       style="font-size:36.26542664px;font-style:normal;font-weight:normal;fill:#000000;fill-opacity:1;stroke:none;stroke-width:1px;stroke-linecap:butt;stroke-linejoin:miter;stroke-opacity:1;font-family:Bitstream Vera Sans"
       x="354.63123"
       y="464.86606"
       id="text3331"
       sodipodi:linespacing="125%"><tspan
         sodipodi:role="line"
         id="tspan3333"
         x="354.63123"
         y="464.86606">16 <tspan
   style="-inkscape-font-specification:Arial Italic;font-family:Arial;font-weight:normal;font-style:italic;font-stretch:normal;font-variant:normal;font-size:36px;text-anchor:start;text-align:start;writing-mode:lr;line-height:125%"
   id="tspan2435">(6)</tspan></tspan></text>
    <text
       xml:space="preserve"
       style="font-size:36.26542664px;font-style:normal;font-weight:normal;fill:#000000;fill-opacity:1;stroke:none;stroke-width:1px;stroke-linecap:butt;stroke-linejoin:miter;stroke-opacity:1;font-family:Bitstream Vera Sans"
       x="480.92505"
       y="296.04312"
       id="text3335"
       sodipodi:linespacing="125%"><tspan
         sodipodi:role="line"
         id="tspan3337"
         x="480.92505"
         y="296.04312">17 <tspan
   style="-inkscape-font-specification:Arial Italic;font-family:Arial;font-weight:normal;font-style:italic;font-stretch:normal;font-variant:normal;font-size:36px;text-anchor:start;text-align:start;writing-mode:lr;line-height:125%"
   id="tspan2437">(7)</tspan></tspan></text>
    <text
       xml:space="preserve"
       style="font-size:36.26542664px;font-style:normal;font-weight:normal;fill:#000000;fill-opacity:1;stroke:none;stroke-width:1px;stroke-linecap:butt;stroke-linejoin:miter;stroke-opacity:1;font-family:Bitstream Vera Sans"
       x="480.92505"
       y="381.17325"
       id="text3339"
       sodipodi:linespacing="125%"><tspan
         sodipodi:role="line"
         id="tspan3341"
         x="480.92505"
         y="381.17325">18 <tspan
   style="-inkscape-font-specification:Arial Italic;font-family:Arial;font-weight:normal;font-style:italic;font-stretch:normal;font-variant:normal;font-size:36px;text-anchor:start;text-align:start;writing-mode:lr;line-height:125%"
   id="tspan2439">(8)</tspan></tspan></text>
    <text
       xml:space="preserve"
       style="font-size:36.26542664px;font-style:normal;font-weight:normal;fill:#000000;fill-opacity:1;stroke:none;stroke-width:1px;stroke-linecap:butt;stroke-linejoin:miter;stroke-opacity:1;font-family:Bitstream Vera Sans"
       x="480.92505"
       y="464.86606"
       id="text3343"
       sodipodi:linespacing="125%"><tspan
         sodipodi:role="line"
         id="tspan3345"
         x="480.92505"
         y="464.86606">19 <tspan
   style="-inkscape-font-specification:Arial Italic;font-family:Arial;font-weight:normal;font-style:italic;font-stretch:normal;font-variant:normal;font-size:36px;text-anchor:start;text-align:start;writing-mode:lr;line-height:125%"
   id="tspan2441">(9)</tspan></tspan></text>
    <text
       xml:space="preserve"
       style="font-size:36.26542664px;font-style:normal;font-weight:normal;fill:#000000;fill-opacity:1;stroke:none;stroke-width:1px;stroke-linecap:butt;stroke-linejoin:miter;stroke-opacity:1;font-family:Bitstream Vera Sans"
       x="606.5741"
       y="296.04312"
       id="text3347"
       sodipodi:linespacing="125%"><tspan
         sodipodi:role="line"
         id="tspan3349"
         x="606.5741"
         y="296.04312">20 <tspan
   style="-inkscape-font-specification:Arial Italic;font-family:Arial;font-weight:normal;font-style:italic;font-stretch:normal;font-variant:normal;font-size:36px;text-anchor:start;text-align:start;writing-mode:lr;line-height:125%"
   id="tspan2443">(10)</tspan></tspan></text>
    <text
       xml:space="preserve"
       style="font-size:36.26542664px;font-style:normal;font-weight:normal;fill:#000000;fill-opacity:1;stroke:none;stroke-width:1px;stroke-linecap:butt;stroke-linejoin:miter;stroke-opacity:1;font-family:Bitstream Vera Sans"
       x="606.5741"
       y="381.17325"
       id="text3351"
       sodipodi:linespacing="125%"><tspan
         sodipodi:role="line"
         id="tspan3353"
         x="606.5741"
         y="381.17325">21 <tspan
   style="-inkscape-font-specification:Arial Italic;font-family:Arial;font-weight:normal;font-style:italic;font-stretch:normal;font-variant:normal;font-size:36px;text-anchor:start;text-align:start;writing-mode:lr;line-height:125%"
   id="tspan2445">(11)</tspan></tspan></text>
    <text
       xml:space="preserve"
       style="font-size:36.26542664px;font-style:normal;font-weight:normal;fill:#000000;fill-opacity:1;stroke:none;stroke-width:1px;stroke-linecap:butt;stroke-linejoin:miter;stroke-opacity:1;font-family:Bitstream Vera Sans"
       x="606.5741"
       y="464.86606"
       id="text3355"
       sodipodi:linespacing="125%"><tspan
         sodipodi:role="line"
         id="tspan3357"
         x="606.5741"
         y="464.86606">22 <tspan
   style="-inkscape-font-specification:Arial Italic;font-family:Arial;font-weight:normal;font-style:italic;font-stretch:normal;font-variant:normal;font-size:36px;text-anchor:start;text-align:start;writing-mode:lr;line-height:125%"
   id="tspan2447">(12)</tspan></tspan></text>
    <path
       style="fill:none;fill-rule:evenodd;stroke:#000000;stroke-width:5;stroke-linecap:butt;stroke-linejoin:miter;stroke-miterlimit:4;stroke-dasharray:none;stroke-opacity:1"
       d="M 342.35579,498.94733 L 342.35579,245.83419"
       id="path3363"
       sodipodi:nodetypes="cc" />
    <path
       style="fill:none;fill-rule:evenodd;stroke:#000000;stroke-width:5;stroke-linecap:butt;stroke-linejoin:miter;stroke-miterlimit:4;stroke-dasharray:none;stroke-opacity:1"
       d="M 594.89393,499.571 L 594.89393,242.41725"
       id="path3365"
       sodipodi:nodetypes="cc" />
    <path
       style="fill:none;fill-rule:evenodd;stroke:#000000;stroke-width:5;stroke-linecap:butt;stroke-linejoin:miter;stroke-miterlimit:4;stroke-dasharray:none;stroke-opacity:1"
       d="M 464.58425,499.67253 L 464.58425,244.7335"
       id="path3367"
       sodipodi:nodetypes="cc" />
  </g>
</svg>
