<?xml version="1.0" encoding="UTF-8" standalone="no"?>
<svg
   xmlns:dc="http://purl.org/dc/elements/1.1/"
   xmlns:cc="http://creativecommons.org/ns#"
   xmlns:rdf="http://www.w3.org/1999/02/22-rdf-syntax-ns#"
   xmlns:svg="http://www.w3.org/2000/svg"
   xmlns="http://www.w3.org/2000/svg"
   xmlns:sodipodi="http://sodipodi.sourceforge.net/DTD/sodipodi-0.dtd"
   xmlns:inkscape="http://www.inkscape.org/namespaces/inkscape"
   width="610"
   height="460"
   viewBox="0 0 610 460"
   id="svg2"
   sodipodi:version="0.32"
   inkscape:version="0.46"
   sodipodi:docname="xyplot.svg"
   inkscape:output_extension="org.inkscape.output.svg.inkscape"
   version="1.0">
  <metadata
     id="metadata265">
    <rdf:RDF>
      <cc:Work
         rdf:about="">
        <dc:format>image/svg+xml</dc:format>
        <dc:type
           rdf:resource="http://purl.org/dc/dcmitype/StillImage" />
      </cc:Work>
    </rdf:RDF>
  </metadata>
  <sodipodi:namedview
     inkscape:window-height="675"
     inkscape:window-width="640"
     inkscape:pageshadow="2"
     inkscape:pageopacity="0.0"
     guidetolerance="10.0"
     gridtolerance="10.0"
     objecttolerance="10.0"
     borderopacity="1.0"
     bordercolor="#666666"
     pagecolor="#ffffff"
     id="base"
     showgrid="false"
     inkscape:zoom="0.44590164"
     inkscape:cx="240.19001"
     inkscape:cy="189.37528"
     inkscape:window-x="66"
     inkscape:window-y="66"
     inkscape:current-layer="svg2" />
  <title
     id="title4">Graphic window number 0</title>
  <desc
     id="desc6">
Creator: GL2PS 1.3.2, (C) 1999-2006 Christophe Geuzaine (geuz@geuz.org)
For: Scilab
CreationDate: Fri Nov 27 19:41:29 2009
</desc>
  <defs
     id="defs8">
    <inkscape:perspective
       sodipodi:type="inkscape:persp3d"
       inkscape:vp_x="0 : 230 : 1"
       inkscape:vp_y="0 : 1000 : 0"
       inkscape:vp_z="610 : 230 : 1"
       inkscape:persp3d-origin="305 : 153.33333 : 1"
       id="perspective267" />
  </defs>
  <polygon
     points="0,0 610,0 610,460 0,460 0,0 "
     id="polygon10"
     style="fill:#ffffff" />
  <g
     id="g12">
    <polygon
       points="76.25,402.5 533.75,57.5 76.25,57.5 76.25,402.5 "
       id="polygon14"
       style="fill:#ffffff" />
    <polygon
       points="76.25,402.5 533.75,402.5 533.75,57.5 76.25,402.5 "
       id="polygon16"
       style="fill:#ffffff" />
    <polygon
       points="76.25,402.5 76.25,57.5 76.25,57.5 76.25,402.5 "
       id="polygon18"
       style="fill:#ffffff" />
    <polygon
       points="76.25,402.5 533.75,402.5 533.75,402.5 76.25,402.5 "
       id="polygon20"
       style="fill:#ffffff" />
    <polygon
       points="76.25,402.5 76.25,57.5 76.25,402.5 "
       id="polygon22"
       style="fill:#ffffff" />
    <polygon
       points="76.25,402.5 533.75,402.5 76.25,402.5 "
       id="polygon24"
       style="fill:#ffffff" />
    <text
       x="479"
       y="419"
       font-size="10"
       font-style="normal"
       font-weight="normal"
       id="text26"
       style="font-size:10px;font-style:normal;font-weight:normal;fill:#000000;font-family:SansSerif">9</text>
    <text
       x="74"
       y="419"
       font-size="10"
       font-style="normal"
       font-weight="normal"
       id="text28"
       style="font-size:10px;font-style:normal;font-weight:normal;fill:#000000;font-family:SansSerif">1</text>
    <text
       x="124"
       y="419"
       font-size="10"
       font-style="normal"
       font-weight="normal"
       id="text30"
       style="font-size:10px;font-style:normal;font-weight:normal;fill:#000000;font-family:SansSerif">2</text>
    <text
       x="174"
       y="419"
       font-size="10"
       font-style="normal"
       font-weight="normal"
       id="text32"
       style="font-size:10px;font-style:normal;font-weight:normal;fill:#000000;font-family:SansSerif">3</text>
    <text
       x="276"
       y="419"
       font-size="10"
       font-style="normal"
       font-weight="normal"
       id="text34"
       style="font-size:10px;font-style:normal;font-weight:normal;fill:#000000;font-family:SansSerif">5</text>
    <text
       x="429"
       y="419"
       font-size="10"
       font-style="normal"
       font-weight="normal"
       id="text36"
       style="font-size:10px;font-style:normal;font-weight:normal;fill:#000000;font-family:SansSerif">8</text>
    <text
       x="225"
       y="419"
       font-size="10"
       font-style="normal"
       font-weight="normal"
       id="text38"
       style="font-size:10px;font-style:normal;font-weight:normal;fill:#000000;font-family:SansSerif">4</text>
    <text
       x="378"
       y="419"
       font-size="10"
       font-style="normal"
       font-weight="normal"
       id="text40"
       style="font-size:10px;font-style:normal;font-weight:normal;fill:#000000;font-family:SansSerif">7</text>
    <text
       x="528"
       y="419"
       font-size="10"
       font-style="normal"
       font-weight="normal"
       id="text42"
       style="font-size:10px;font-style:normal;font-weight:normal;fill:#000000;font-family:SansSerif">10</text>
    <text
       x="50"
       y="63"
       font-size="10"
       font-style="normal"
       font-weight="normal"
       id="text44"
       style="font-size:10px;font-style:normal;font-weight:normal;fill:#000000;font-family:SansSerif">100</text>
    <text
       x="55"
       y="97"
       font-size="10"
       font-style="normal"
       font-weight="normal"
       id="text46"
       style="font-size:10px;font-style:normal;font-weight:normal;fill:#000000;font-family:SansSerif">90</text>
    <text
       x="55"
       y="132"
       font-size="10"
       font-style="normal"
       font-weight="normal"
       id="text48"
       style="font-size:10px;font-style:normal;font-weight:normal;fill:#000000;font-family:SansSerif">80</text>
    <text
       x="55"
       y="166"
       font-size="10"
       font-style="normal"
       font-weight="normal"
       id="text50"
       style="font-size:10px;font-style:normal;font-weight:normal;fill:#000000;font-family:SansSerif">70</text>
    <text
       x="55"
       y="201"
       font-size="10"
       font-style="normal"
       font-weight="normal"
       id="text52"
       style="font-size:10px;font-style:normal;font-weight:normal;fill:#000000;font-family:SansSerif">60</text>
    <text
       x="55"
       y="235"
       font-size="10"
       font-style="normal"
       font-weight="normal"
       id="text54"
       style="font-size:10px;font-style:normal;font-weight:normal;fill:#000000;font-family:SansSerif">50</text>
    <text
       x="55"
       y="270"
       font-size="10"
       font-style="normal"
       font-weight="normal"
       id="text56"
       style="font-size:10px;font-style:normal;font-weight:normal;fill:#000000;font-family:SansSerif">40</text>
    <text
       x="55"
       y="304"
       font-size="10"
       font-style="normal"
       font-weight="normal"
       id="text58"
       style="font-size:10px;font-style:normal;font-weight:normal;fill:#000000;font-family:SansSerif">30</text>
    <text
       x="55"
       y="339"
       font-size="10"
       font-style="normal"
       font-weight="normal"
       id="text60"
       style="font-size:10px;font-style:normal;font-weight:normal;fill:#000000;font-family:SansSerif">20</text>
    <text
       x="56"
       y="373"
       font-size="10"
       font-style="normal"
       font-weight="normal"
       id="text62"
       style="font-size:10px;font-style:normal;font-weight:normal;fill:#000000;font-family:SansSerif">10</text>
    <text
       x="61"
       y="407"
       font-size="10"
       font-style="normal"
       font-weight="normal"
       id="text64"
       style="font-size:10px;font-style:normal;font-weight:normal;fill:#000000;font-family:SansSerif">0</text>
    <text
       x="327"
       y="419"
       font-size="10"
       font-style="normal"
       font-weight="normal"
       id="text66"
       style="font-size:10px;font-style:normal;font-weight:normal;fill:#000000;font-family:SansSerif">6</text>
    <polyline
       points="76.25,57.5 69.395,57.5"
       id="polyline68"
       style="fill:none;stroke:#000000;stroke-width:1" />
    <polyline
       points="76.25,57.5 533.75,57.5 533.75,402.5"
       id="polyline70"
       style="fill:none;stroke:#000000;stroke-width:1" />
    <polyline
       points="508.333,402.5 508.333,405.605"
       id="polyline72"
       style="fill:none;stroke:#000000;stroke-width:1" />
    <polyline
       points="457.5,402.5 457.5,405.605"
       id="polyline74"
       style="fill:none;stroke:#000000;stroke-width:1" />
    <polyline
       points="406.667,402.5 406.667,405.605"
       id="polyline76"
       style="fill:none;stroke:#000000;stroke-width:1" />
    <polyline
       points="355.833,402.5 355.833,405.605"
       id="polyline78"
       style="fill:none;stroke:#000000;stroke-width:1" />
    <polyline
       points="305,402.5 305,405.605"
       id="polyline80"
       style="fill:none;stroke:#000000;stroke-width:1" />
    <polyline
       points="254.167,402.5 254.167,405.605"
       id="polyline82"
       style="fill:none;stroke:#000000;stroke-width:1" />
    <polyline
       points="203.333,402.5 203.333,405.605"
       id="polyline84"
       style="fill:none;stroke:#000000;stroke-width:1" />
    <polyline
       points="152.5,402.5 152.5,405.605"
       id="polyline86"
       style="fill:none;stroke:#000000;stroke-width:1" />
    <polyline
       points="101.667,402.5 101.667,405.605"
       id="polyline88"
       style="fill:none;stroke:#000000;stroke-width:1" />
    <polyline
       points="533.75,402.5 533.75,407.675"
       id="polyline90"
       style="fill:none;stroke:#000000;stroke-width:1" />
    <polyline
       points="482.917,402.5 482.917,407.675"
       id="polyline92"
       style="fill:none;stroke:#000000;stroke-width:1" />
    <polyline
       points="432.083,402.5 432.083,407.675"
       id="polyline94"
       style="fill:none;stroke:#000000;stroke-width:1" />
    <polyline
       points="381.25,402.5 381.25,407.675"
       id="polyline96"
       style="fill:none;stroke:#000000;stroke-width:1" />
    <polyline
       points="330.417,402.5 330.417,407.675"
       id="polyline98"
       style="fill:none;stroke:#000000;stroke-width:1" />
    <polyline
       points="279.583,402.5 279.583,407.675"
       id="polyline100"
       style="fill:none;stroke:#000000;stroke-width:1" />
    <polyline
       points="228.75,402.5 228.75,407.675"
       id="polyline102"
       style="fill:none;stroke:#000000;stroke-width:1" />
    <polyline
       points="177.917,402.5 177.917,407.675"
       id="polyline104"
       style="fill:none;stroke:#000000;stroke-width:1" />
    <polyline
       points="127.083,402.5 127.083,407.675"
       id="polyline106"
       style="fill:none;stroke:#000000;stroke-width:1" />
    <polyline
       points="76.25,402.5 76.25,407.675"
       id="polyline108"
       style="fill:none;stroke:#000000;stroke-width:1" />
    <polyline
       points="76.25,402.5 533.75,402.5"
       id="polyline110"
       style="fill:none;stroke:#000000;stroke-width:1" />
    <polyline
       points="76.25,74.75 72.1372,74.75"
       id="polyline112"
       style="fill:none;stroke:#000000;stroke-width:1" />
    <polyline
       points="76.25,109.25 72.1372,109.25"
       id="polyline114"
       style="fill:none;stroke:#000000;stroke-width:1" />
    <polyline
       points="76.25,143.75 72.1372,143.75"
       id="polyline116"
       style="fill:none;stroke:#000000;stroke-width:1" />
    <polyline
       points="76.25,178.25 72.1372,178.25"
       id="polyline118"
       style="fill:none;stroke:#000000;stroke-width:1" />
    <polyline
       points="76.25,212.75 72.1372,212.75"
       id="polyline120"
       style="fill:none;stroke:#000000;stroke-width:1" />
    <polyline
       points="76.25,247.25 72.1372,247.25"
       id="polyline122"
       style="fill:none;stroke:#000000;stroke-width:1" />
    <polyline
       points="76.25,281.75 72.1372,281.75"
       id="polyline124"
       style="fill:none;stroke:#000000;stroke-width:1" />
    <polyline
       points="76.25,316.25 72.1372,316.25"
       id="polyline126"
       style="fill:none;stroke:#000000;stroke-width:1" />
    <polyline
       points="76.25,350.75 72.1372,350.75"
       id="polyline128"
       style="fill:none;stroke:#000000;stroke-width:1" />
    <polyline
       points="76.25,385.25 72.1372,385.25"
       id="polyline130"
       style="fill:none;stroke:#000000;stroke-width:1" />
    <polyline
       points="76.25,92 69.395,92"
       id="polyline132"
       style="fill:none;stroke:#000000;stroke-width:1" />
    <polyline
       points="76.25,126.5 69.395,126.5"
       id="polyline134"
       style="fill:none;stroke:#000000;stroke-width:1" />
    <polyline
       points="76.25,161 69.395,161"
       id="polyline136"
       style="fill:none;stroke:#000000;stroke-width:1" />
    <polyline
       points="76.25,195.5 69.395,195.5"
       id="polyline138"
       style="fill:none;stroke:#000000;stroke-width:1" />
    <polyline
       points="76.25,402.5 76.25,57.5"
       id="polyline140"
       style="fill:none;stroke:#000000;stroke-width:1" />
    <polyline
       points="76.25,402.5 69.395,402.5"
       id="polyline142"
       style="fill:none;stroke:#000000;stroke-width:1" />
    <polyline
       points="76.25,368 69.395,368"
       id="polyline144"
       style="fill:none;stroke:#000000;stroke-width:1" />
    <polyline
       points="76.25,333.5 69.395,333.5"
       id="polyline146"
       style="fill:none;stroke:#000000;stroke-width:1" />
    <polyline
       points="76.25,299 69.395,299"
       id="polyline148"
       style="fill:none;stroke:#000000;stroke-width:1" />
    <polyline
       points="76.25,264.5 69.395,264.5"
       id="polyline150"
       style="fill:none;stroke:#000000;stroke-width:1" />
    <polyline
       points="76.25,230 69.395,230"
       id="polyline152"
       style="fill:none;stroke:#000000;stroke-width:1" />
    <polyline
       points="76.25,57.5 76.25,57.5"
       id="polyline154"
       style="fill:none;stroke:#000000;stroke-width:1" />
    <polyline
       points="533.75,57.5 533.75,57.5"
       id="polyline156"
       style="fill:none;stroke:#000000;stroke-width:1" />
    <polyline
       points="533.75,402.5 533.75,402.5"
       id="polyline158"
       style="fill:none;stroke:#000000;stroke-width:1" />
    <polyline
       points="496.403,106.332 505.74,94.4727"
       id="polyline160"
       style="fill:none;stroke:#0000ff;stroke-width:1" />
    <polyline
       points="188.291,367.082 197.627,362.905"
       id="polyline162"
       style="fill:none;stroke:#0000ff;stroke-width:1" />
    <polyline
       points="487.066,117.958 496.403,106.332"
       id="polyline164"
       style="fill:none;stroke:#0000ff;stroke-width:1" />
    <polyline
       points="477.729,129.351 487.066,117.958"
       id="polyline166"
       style="fill:none;stroke:#0000ff;stroke-width:1" />
    <polyline
       points="468.393,140.511 477.729,129.351"
       id="polyline168"
       style="fill:none;stroke:#0000ff;stroke-width:1" />
    <polyline
       points="459.056,151.439 468.393,140.511"
       id="polyline170"
       style="fill:none;stroke:#0000ff;stroke-width:1" />
    <polyline
       points="449.719,162.134 459.056,151.439"
       id="polyline172"
       style="fill:none;stroke:#0000ff;stroke-width:1" />
    <polyline
       points="440.383,172.596 449.719,162.134"
       id="polyline174"
       style="fill:none;stroke:#0000ff;stroke-width:1" />
    <polyline
       points="431.046,182.825 440.383,172.596"
       id="polyline176"
       style="fill:none;stroke:#0000ff;stroke-width:1" />
    <polyline
       points="421.709,192.822 431.046,182.825"
       id="polyline178"
       style="fill:none;stroke:#0000ff;stroke-width:1" />
    <polyline
       points="412.373,202.585 421.709,192.822"
       id="polyline180"
       style="fill:none;stroke:#0000ff;stroke-width:1" />
    <polyline
       points="403.036,212.116 412.373,202.585"
       id="polyline182"
       style="fill:none;stroke:#0000ff;stroke-width:1" />
    <polyline
       points="169.617,374.738 178.954,371.026"
       id="polyline184"
       style="fill:none;stroke:#0000ff;stroke-width:1" />
    <polyline
       points="160.281,378.216 169.617,374.738"
       id="polyline186"
       style="fill:none;stroke:#0000ff;stroke-width:1" />
    <polyline
       points="150.944,381.462 160.281,378.216"
       id="polyline188"
       style="fill:none;stroke:#0000ff;stroke-width:1" />
    <polyline
       points="141.607,384.476 150.944,381.462"
       id="polyline190"
       style="fill:none;stroke:#0000ff;stroke-width:1" />
    <polyline
       points="132.271,387.256 141.607,384.476"
       id="polyline192"
       style="fill:none;stroke:#0000ff;stroke-width:1" />
    <polyline
       points="122.934,389.804 132.271,387.256"
       id="polyline194"
       style="fill:none;stroke:#0000ff;stroke-width:1" />
    <polyline
       points="113.597,392.118 122.934,389.804"
       id="polyline196"
       style="fill:none;stroke:#0000ff;stroke-width:1" />
    <polyline
       points="104.26,394.201 113.597,392.118"
       id="polyline198"
       style="fill:none;stroke:#0000ff;stroke-width:1" />
    <polyline
       points="94.9233,396.05 104.26,394.201"
       id="polyline200"
       style="fill:none;stroke:#0000ff;stroke-width:1" />
    <polyline
       points="178.954,371.026 188.291,367.082"
       id="polyline202"
       style="fill:none;stroke:#0000ff;stroke-width:1" />
    <polyline
       points="76.25,399.05 85.5869,397.667"
       id="polyline204"
       style="fill:none;stroke:#0000ff;stroke-width:1" />
    <polyline
       points="393.699,221.415 403.036,212.116"
       id="polyline206"
       style="fill:none;stroke:#0000ff;stroke-width:1" />
    <polyline
       points="384.362,230.48 393.699,221.415"
       id="polyline208"
       style="fill:none;stroke:#0000ff;stroke-width:1" />
    <polyline
       points="375.025,239.313 384.362,230.48"
       id="polyline210"
       style="fill:none;stroke:#0000ff;stroke-width:1" />
    <polyline
       points="365.689,247.913 375.025,239.313"
       id="polyline212"
       style="fill:none;stroke:#0000ff;stroke-width:1" />
    <polyline
       points="356.352,256.279 365.689,247.913"
       id="polyline214"
       style="fill:none;stroke:#0000ff;stroke-width:1" />
    <polyline
       points="347.015,264.414 356.352,256.279"
       id="polyline216"
       style="fill:none;stroke:#0000ff;stroke-width:1" />
    <polyline
       points="337.679,272.315 347.015,264.414"
       id="polyline218"
       style="fill:none;stroke:#0000ff;stroke-width:1" />
    <polyline
       points="328.342,279.984 337.679,272.315"
       id="polyline220"
       style="fill:none;stroke:#0000ff;stroke-width:1" />
    <polyline
       points="319.005,287.42 328.342,279.984"
       id="polyline222"
       style="fill:none;stroke:#0000ff;stroke-width:1" />
    <polyline
       points="309.668,294.623 319.005,287.42"
       id="polyline224"
       style="fill:none;stroke:#0000ff;stroke-width:1" />
    <polyline
       points="300.332,301.594 309.668,294.623"
       id="polyline226"
       style="fill:none;stroke:#0000ff;stroke-width:1" />
    <polyline
       points="290.995,308.331 300.332,301.594"
       id="polyline228"
       style="fill:none;stroke:#0000ff;stroke-width:1" />
    <polyline
       points="281.658,314.836 290.995,308.331"
       id="polyline230"
       style="fill:none;stroke:#0000ff;stroke-width:1" />
    <polyline
       points="272.321,321.108 281.658,314.836"
       id="polyline232"
       style="fill:none;stroke:#0000ff;stroke-width:1" />
    <polyline
       points="262.985,327.147 272.321,321.108"
       id="polyline234"
       style="fill:none;stroke:#0000ff;stroke-width:1" />
    <polyline
       points="253.648,332.954 262.985,327.147"
       id="polyline236"
       style="fill:none;stroke:#0000ff;stroke-width:1" />
    <polyline
       points="244.311,338.528 253.648,332.954"
       id="polyline238"
       style="fill:none;stroke:#0000ff;stroke-width:1" />
    <polyline
       points="234.975,343.869 244.311,338.528"
       id="polyline240"
       style="fill:none;stroke:#0000ff;stroke-width:1" />
    <polyline
       points="225.638,348.977 234.975,343.869"
       id="polyline242"
       style="fill:none;stroke:#0000ff;stroke-width:1" />
    <polyline
       points="216.301,353.852 225.638,348.977"
       id="polyline244"
       style="fill:none;stroke:#0000ff;stroke-width:1" />
    <polyline
       points="515.077,82.3813 524.413,70.0571"
       id="polyline246"
       style="fill:none;stroke:#0000ff;stroke-width:1" />
    <polyline
       points="85.5869,397.667 94.9233,396.05"
       id="polyline248"
       style="fill:none;stroke:#0000ff;stroke-width:1" />
    <polyline
       points="206.964,358.495 216.301,353.852"
       id="polyline250"
       style="fill:none;stroke:#0000ff;stroke-width:1" />
    <polyline
       points="197.627,362.905 206.964,358.495"
       id="polyline252"
       style="fill:none;stroke:#0000ff;stroke-width:1" />
    <polyline
       points="524.413,70.0571 533.75,57.5"
       id="polyline254"
       style="fill:none;stroke:#0000ff;stroke-width:1" />
    <polyline
       points="505.74,94.4727 515.077,82.3813"
       id="polyline256"
       style="fill:none;stroke:#0000ff;stroke-width:1" />
    <polyline
       points="533.75,57.5 76.25,57.5"
       id="polyline258"
       style="fill:none;stroke:#000000;stroke-width:1" />
    <polyline
       points="533.75,402.5 76.25,402.5 76.25,57.5"
       id="polyline260"
       style="fill:none;stroke:#000000;stroke-width:1" />
    <polyline
       points="533.75,57.5 533.75,402.5"
       id="polyline262"
       style="fill:none;stroke:#000000;stroke-width:1" />
  </g>
</svg>
