<?xml version="1.0" encoding="UTF-8" standalone="no"?>
<!-- Created with Inkscape (http://www.inkscape.org/) -->
<svg
   xmlns:dc="http://purl.org/dc/elements/1.1/"
   xmlns:cc="http://creativecommons.org/ns#"
   xmlns:rdf="http://www.w3.org/1999/02/22-rdf-syntax-ns#"
   xmlns:svg="http://www.w3.org/2000/svg"
   xmlns="http://www.w3.org/2000/svg"
   xmlns:sodipodi="http://sodipodi.sourceforge.net/DTD/sodipodi-0.dtd"
   xmlns:inkscape="http://www.inkscape.org/namespaces/inkscape"
   width="1007.0412"
   height="830.19885"
   id="svg2"
   sodipodi:version="0.32"
   inkscape:version="0.46"
   sodipodi:docname="solution3.svg"
   inkscape:output_extension="org.inkscape.output.svg.inkscape"
   version="1.0">
  <defs
     id="defs4">
    <marker
       inkscape:stockid="Arrow1Lend"
       orient="auto"
       refY="0"
       refX="0"
       id="Arrow1Lend"
       style="overflow:visible">
      <path
         id="path3244"
         d="M 0,0 L 5,-5 L -12.5,0 L 5,5 L 0,0 z"
         style="fill-rule:evenodd;stroke:#000000;stroke-width:1pt;marker-start:none"
         transform="matrix(-0.8,0,0,-0.8,-10,0)" />
    </marker>
    <inkscape:perspective
       sodipodi:type="inkscape:persp3d"
       inkscape:vp_x="0 : 526.18109 : 1"
       inkscape:vp_y="0 : 1000 : 0"
       inkscape:vp_z="744.09448 : 526.18109 : 1"
       inkscape:persp3d-origin="372.04724 : 350.78739 : 1"
       id="perspective10" />
  </defs>
  <sodipodi:namedview
     id="base"
     pagecolor="#ffffff"
     bordercolor="#666666"
     borderopacity="1.0"
     inkscape:pageopacity="0.0"
     inkscape:pageshadow="2"
     inkscape:zoom="0.7"
     inkscape:cx="651.23878"
     inkscape:cy="400.57606"
     inkscape:document-units="px"
     inkscape:current-layer="layer1"
     showgrid="false"
     inkscape:window-width="1679"
     inkscape:window-height="1000"
     inkscape:window-x="1"
     inkscape:window-y="14" />
  <metadata
     id="metadata7">
    <rdf:RDF>
      <cc:Work
         rdf:about="">
        <dc:format>image/svg+xml</dc:format>
        <dc:type
           rdf:resource="http://purl.org/dc/dcmitype/StillImage" />
      </cc:Work>
    </rdf:RDF>
  </metadata>
  <g
     inkscape:label="Calque 1"
     inkscape:groupmode="layer"
     id="layer1"
     transform="translate(110.20573,380.42644)">
    <g
       id="g3214"
       transform="translate(-25.459488,0.739018)">
      <rect
         y="169.13379"
         x="110.20305"
         height="86.342926"
         width="192.79767"
         id="rect2419"
         style="fill:none;fill-opacity:1;stroke:#000000;stroke-width:2;stroke-miterlimit:4;stroke-dasharray:none;stroke-dashoffset:0;stroke-opacity:1" />
      <text
         id="text3191"
         y="205.10408"
         x="136.82103"
         style="font-size:22px;font-style:normal;font-weight:normal;line-height:125%;fill:#000000;fill-opacity:1;stroke:none;stroke-width:1px;stroke-linecap:butt;stroke-linejoin:miter;stroke-opacity:1;font-family:Bitstream Vera Sans"
         xml:space="preserve"
         sodipodi:linespacing="125%"><tspan
           y="205.10408"
           x="136.82103"
           id="tspan3193"
           sodipodi:role="line"
           style="font-size:24px;font-style:normal;font-variant:normal;font-weight:bold;font-stretch:normal;text-align:start;line-height:125%;writing-mode:lr-tb;text-anchor:start;font-family:Arial;-inkscape-font-specification:Arial Bold"> * name</tspan><tspan
           y="233.43294"
           x="136.82103"
           sodipodi:role="line"
           id="tspan2490">S = init(name)</tspan></text>
    </g>
    <g
       id="g3219"
       transform="translate(77.576073,-2.0203051)">
      <rect
         y="171.89311"
         x="295.03528"
         height="56.34293"
         width="216.03117"
         id="rect3202"
         style="fill:none;fill-opacity:1;stroke:#000000;stroke-width:2;stroke-miterlimit:4;stroke-dasharray:none;stroke-dashoffset:0;stroke-opacity:1" />
      <text
         id="text3204"
         y="207.63245"
         x="314.93402"
         style="font-size:22px;font-style:normal;font-weight:normal;fill:#000000;fill-opacity:1;stroke:none;stroke-width:1px;stroke-linecap:butt;stroke-linejoin:miter;stroke-opacity:1;font-family:Bitstream Vera Sans"
         xml:space="preserve"><tspan
           y="207.63245"
           x="314.93402"
           id="tspan3206"
           sodipodi:role="line">[this,v] = next(this)</tspan></text>
    </g>
    <g
       id="g2457"
       transform="translate(15.152287,37.857143)">
      <rect
         y="305.85944"
         x="211.12189"
         height="105.05583"
         width="184.85791"
         id="rect3224"
         style="opacity:1;fill:none;fill-opacity:1;stroke:#000000;stroke-width:2;stroke-miterlimit:4;stroke-dasharray:none;stroke-dashoffset:0;stroke-opacity:1" />
      <text
         id="text3226"
         y="351.31631"
         x="234.35539"
         style="font-size:22px;font-style:normal;font-weight:normal;fill:#000000;fill-opacity:1;stroke:none;stroke-width:1px;stroke-linecap:butt;stroke-linejoin:miter;stroke-opacity:1;font-family:Bitstream Vera Sans"
         xml:space="preserve"><tspan
           y="351.31631"
           x="234.35539"
           id="tspan3228"
           sodipodi:role="line">S = init(&quot;A&quot;);</tspan><tspan
           id="tspan3232"
           y="378.81631"
           x="234.35539"
           sodipodi:role="line">[S,v] = next(S)</tspan></text>
    </g>
    <path
       style="fill:none;fill-rule:evenodd;stroke:#000000;stroke-width:2;stroke-linecap:butt;stroke-linejoin:miter;marker-end:url(#Arrow1Lend);stroke-miterlimit:4;stroke-dasharray:none;stroke-opacity:1"
       d="M 299.00515,340.18107 L 170.71578,271.49069"
       id="path3236"
       sodipodi:nodetypes="cc" />
    <path
       style="fill:none;fill-rule:evenodd;stroke:#000000;stroke-width:2;stroke-linecap:butt;stroke-linejoin:miter;marker-end:url(#Arrow1Lend);stroke-miterlimit:4;stroke-dasharray:none;stroke-opacity:1"
       d="M 347.49247,340.18106 L 457.59909,236.49068"
       id="path4016"
       sodipodi:nodetypes="cc" />
    <g
       id="g2395"
       transform="translate(-195.12307,-141.97381)">
      <rect
         y="169.13379"
         x="110.20305"
         height="83.61705"
         width="156.96954"
         id="rect2397"
         style="fill:none;fill-opacity:1;stroke:#000000;stroke-width:2;stroke-miterlimit:4;stroke-dasharray:none;stroke-dashoffset:0;stroke-opacity:1" />
      <text
         id="text2399"
         y="205.10408"
         x="136.82103"
         style="font-size:22px;font-style:normal;font-weight:normal;line-height:125%;fill:#000000;fill-opacity:1;stroke:none;stroke-width:1px;stroke-linecap:butt;stroke-linejoin:miter;stroke-opacity:1;font-family:Bitstream Vera Sans"
         xml:space="preserve"
         sodipodi:linespacing="125%"><tspan
           y="205.10408"
           x="136.82103"
           id="tspan2401"
           sodipodi:role="line"
           style="font-size:24px;font-style:normal;font-variant:normal;font-weight:bold;font-stretch:normal;text-align:start;line-height:125%;writing-mode:lr-tb;text-anchor:start;font-family:Arial;-inkscape-font-specification:Arial Bold"> * a</tspan><tspan
           y="233.43294"
           x="136.82103"
           sodipodi:role="line"
           id="tspan2494">S = A_init()</tspan></text>
    </g>
    <g
       id="g2403"
       transform="translate(91.718209,-321.50983)">
      <rect
         y="171.89311"
         x="295.03528"
         height="56.34293"
         width="253.40681"
         id="rect2405"
         style="fill:none;fill-opacity:1;stroke:#000000;stroke-width:2;stroke-miterlimit:4;stroke-dasharray:none;stroke-dashoffset:0;stroke-opacity:1" />
      <text
         id="text2407"
         y="207.63245"
         x="314.93402"
         style="font-size:22px;font-style:normal;font-weight:normal;fill:#000000;fill-opacity:1;stroke:none;stroke-width:1px;stroke-linecap:butt;stroke-linejoin:miter;stroke-opacity:1;font-family:Bitstream Vera Sans"
         xml:space="preserve"><tspan
           y="207.63245"
           x="314.93402"
           id="tspan2409"
           sodipodi:role="line">[this,v] = A_next(this)</tspan></text>
    </g>
    <g
       id="g2411"
       transform="translate(59.650747,-318.75051)">
      <rect
         y="144.89012"
         x="110.20305"
         height="80.586617"
         width="160.562"
         id="rect2413"
         style="fill:none;fill-opacity:1;stroke:#000000;stroke-width:2;stroke-miterlimit:4;stroke-dasharray:none;stroke-dashoffset:0;stroke-opacity:1" />
      <text
         id="text2415"
         y="176.81981"
         x="136.82103"
         style="font-size:22px;font-style:normal;font-weight:normal;line-height:125%;fill:#000000;fill-opacity:1;stroke:none;stroke-width:1px;stroke-linecap:butt;stroke-linejoin:miter;stroke-opacity:1;font-family:Bitstream Vera Sans"
         xml:space="preserve"
         sodipodi:linespacing="125%"><tspan
           y="176.81981"
           x="136.82103"
           id="tspan2417"
           sodipodi:role="line"
           style="font-size:24px;font-style:normal;font-variant:normal;font-weight:bold;font-stretch:normal;text-align:start;line-height:125%;writing-mode:lr-tb;text-anchor:start;font-family:Arial;-inkscape-font-specification:Arial Bold"> * c</tspan><tspan
           y="205.14867"
           x="136.82103"
           sodipodi:role="line"
           id="tspan2456">S = C_init()</tspan></text>
    </g>
    <g
       id="g2419"
       transform="translate(296.77918,-160.89558)">
      <rect
         y="171.89311"
         x="295.03528"
         height="56.34293"
         width="253.40681"
         id="rect2421"
         style="fill:none;fill-opacity:1;stroke:#000000;stroke-width:2;stroke-miterlimit:4;stroke-dasharray:none;stroke-dashoffset:0;stroke-opacity:1" />
      <text
         id="text2423"
         y="207.63245"
         x="314.93402"
         style="font-size:22px;font-style:normal;font-weight:normal;fill:#000000;fill-opacity:1;stroke:none;stroke-width:1px;stroke-linecap:butt;stroke-linejoin:miter;stroke-opacity:1;font-family:Bitstream Vera Sans"
         xml:space="preserve"><tspan
           y="207.63245"
           x="314.93402"
           id="tspan2425"
           sodipodi:role="line">[this,v] = C_next(this)</tspan></text>
    </g>
    <g
       id="g2427"
       transform="translate(-77.38336,-237.18069)">
      <rect
         y="169.13379"
         x="110.20305"
         height="82.606895"
         width="159.13342"
         id="rect2429"
         style="fill:none;fill-opacity:1;stroke:#000000;stroke-width:2;stroke-miterlimit:4;stroke-dasharray:none;stroke-dashoffset:0;stroke-opacity:1" />
      <text
         id="text2431"
         y="205.10408"
         x="136.82103"
         style="font-size:22px;font-style:normal;font-weight:normal;line-height:125%;fill:#000000;fill-opacity:1;stroke:none;stroke-width:1px;stroke-linecap:butt;stroke-linejoin:miter;stroke-opacity:1;font-family:Bitstream Vera Sans"
         xml:space="preserve"
         sodipodi:linespacing="125%"><tspan
           y="205.10408"
           x="136.82103"
           id="tspan2433"
           sodipodi:role="line"
           style="font-size:24px;font-style:normal;font-variant:normal;font-weight:bold;font-stretch:normal;text-align:start;line-height:125%;writing-mode:lr-tb;text-anchor:start;font-family:Arial;-inkscape-font-specification:Arial Bold"> * b</tspan><tspan
           y="233.43294"
           x="136.82103"
           sodipodi:role="line"
           id="tspan2492">S = B_init()</tspan></text>
    </g>
    <g
       id="g2435"
       transform="translate(205.86545,-239.94002)">
      <rect
         y="171.89311"
         x="295.03528"
         height="56.34293"
         width="247.3459"
         id="rect2437"
         style="fill:none;fill-opacity:1;stroke:#000000;stroke-width:2;stroke-miterlimit:4;stroke-dasharray:none;stroke-dashoffset:0;stroke-opacity:1" />
      <text
         id="text2439"
         y="207.63245"
         x="314.93402"
         style="font-size:22px;font-style:normal;font-weight:normal;fill:#000000;fill-opacity:1;stroke:none;stroke-width:1px;stroke-linecap:butt;stroke-linejoin:miter;stroke-opacity:1;font-family:Bitstream Vera Sans"
         xml:space="preserve"><tspan
           y="207.63245"
           x="314.93402"
           id="tspan2441"
           sodipodi:role="line">[this,v] = B_next(this)</tspan></text>
    </g>
    <path
       style="fill:none;fill-rule:evenodd;stroke:#000000;stroke-width:2;stroke-linecap:butt;stroke-linejoin:miter;marker-end:url(#Arrow1Lend);stroke-miterlimit:4;stroke-dasharray:none;stroke-opacity:1"
       d="M 157.29554,157.35684 L -8.6058809,119.9812"
       id="path2443"
       sodipodi:nodetypes="cc" />
    <path
       style="fill:none;fill-rule:evenodd;stroke:#000000;stroke-width:2;stroke-linecap:butt;stroke-linejoin:miter;marker-end:url(#Arrow1Lend);stroke-miterlimit:4;stroke-dasharray:none;stroke-opacity:1"
       d="M 179.27378,157.35684 L 142.03301,28.057303"
       id="path2445"
       sodipodi:nodetypes="cc" />
    <path
       style="fill:none;fill-rule:evenodd;stroke:#000000;stroke-width:2;stroke-linecap:butt;stroke-linejoin:miter;marker-end:url(#Arrow1Lend);stroke-miterlimit:4;stroke-dasharray:none;stroke-opacity:1"
       d="M 203.11781,157.35684 L 248.42239,-79.018861"
       id="path2447"
       sodipodi:nodetypes="cc" />
    <path
       style="fill:none;fill-rule:evenodd;stroke:#000000;stroke-width:2;stroke-linecap:butt;stroke-linejoin:miter;marker-end:url(#Arrow1Lend);stroke-miterlimit:4;stroke-dasharray:none;stroke-opacity:1"
       d="M 489.00118,157.35684 L 412.26803,-79.01886"
       id="path2451"
       sodipodi:nodetypes="cc" />
    <path
       style="fill:none;fill-rule:evenodd;stroke:#000000;stroke-width:2;stroke-linecap:butt;stroke-linejoin:miter;marker-end:url(#Arrow1Lend);stroke-miterlimit:4;stroke-dasharray:none;stroke-opacity:1"
       d="M 509.18681,157.35684 L 546.42758,2.8034824"
       id="path2453"
       sodipodi:nodetypes="cc" />
    <path
       style="fill:none;fill-rule:evenodd;stroke:#000000;stroke-width:2;stroke-linecap:butt;stroke-linejoin:miter;marker-end:url(#Arrow1Lend);stroke-miterlimit:4;stroke-dasharray:none;stroke-opacity:1"
       d="M 533.412,157.35684 L 626.45627,86.646147"
       id="path2455"
       sodipodi:nodetypes="cc" />
    <g
       id="g2426"
       transform="translate(-110.23142,-548.56023)">
      <rect
         y="169.13379"
         x="110.20305"
         height="84.627197"
         width="207.17259"
         id="rect2428"
         style="fill:none;fill-opacity:1;stroke:#000000;stroke-width:2;stroke-miterlimit:4;stroke-dasharray:none;stroke-dashoffset:0;stroke-opacity:1" />
      <text
         id="text2430"
         y="205.10408"
         x="136.82103"
         style="font-size:22px;font-style:normal;font-weight:normal;line-height:125%;fill:#000000;fill-opacity:1;stroke:none;stroke-width:1px;stroke-linecap:butt;stroke-linejoin:miter;stroke-opacity:1;font-family:Bitstream Vera Sans"
         xml:space="preserve"
         sodipodi:linespacing="125%"><tspan
           y="205.10408"
           x="136.82103"
           sodipodi:role="line"
           id="tspan2450"
           style="font-size:24px;font-style:normal;font-variant:normal;font-weight:bold;font-stretch:normal;text-align:start;line-height:125%;writing-mode:lr-tb;text-anchor:start;font-family:Arial;-inkscape-font-specification:Arial Bold"> * u, n</tspan><tspan
           y="233.43294"
           x="136.82103"
           sodipodi:role="line"
           id="tspan2452">S = ABS_init(u0)</tspan></text>
    </g>
    <path
       style="fill:none;fill-rule:evenodd;stroke:#000000;stroke-width:2;stroke-linecap:butt;stroke-linejoin:miter;marker-end:url(#Arrow1Lend);stroke-miterlimit:4;stroke-dasharray:none;stroke-opacity:1"
       d="M -17.83189,-2.2472747 L 82.714184,-287.11029"
       id="path2458"
       sodipodi:nodetypes="cc" />
    <path
       style="fill:none;fill-rule:evenodd;stroke:#000000;stroke-width:2;stroke-linecap:butt;stroke-linejoin:miter;marker-end:url(#Arrow1Lend);stroke-miterlimit:4;stroke-dasharray:none;stroke-opacity:1"
       d="M 82.24755,-80.029009 L 108.47307,-287.11029"
       id="path2460"
       sodipodi:nodetypes="cc" />
    <path
       style="fill:none;fill-rule:evenodd;stroke:#000000;stroke-width:2;stroke-linecap:butt;stroke-linejoin:miter;marker-end:url(#Arrow1Lend);stroke-miterlimit:4;stroke-dasharray:none;stroke-opacity:1"
       d="M 245.93431,-183.06458 L 133.72689,-287.11029"
       id="path2462"
       sodipodi:nodetypes="cc" />
    <g
       id="g2485"
       transform="translate(168.69547,-16.667523)">
      <rect
         y="-350.63708"
         x="420.1951"
         height="60.383537"
         width="306.94492"
         id="rect2466"
         style="fill:none;fill-opacity:1;stroke:#000000;stroke-width:2;stroke-miterlimit:4;stroke-dasharray:none;stroke-dashoffset:0;stroke-opacity:1" />
      <text
         id="text2468"
         y="-314.66681"
         x="446.81308"
         style="font-size:22px;font-style:normal;font-weight:normal;fill:#000000;fill-opacity:1;stroke:none;stroke-width:1px;stroke-linecap:butt;stroke-linejoin:miter;stroke-opacity:1;font-family:Bitstream Vera Sans"
         xml:space="preserve"><tspan
           y="-314.66681"
           x="446.81308"
           sodipodi:role="line"
           id="tspan2472">this = ABS_next ( this, v )</tspan></text>
    </g>
    <path
       style="fill:none;fill-rule:evenodd;stroke:#000000;stroke-width:2;stroke-linecap:butt;stroke-linejoin:miter;marker-end:url(#Arrow1Lend);stroke-miterlimit:4;stroke-dasharray:none;stroke-opacity:1"
       d="M 519.13852,-158.82091 L 687.79556,-298.22196"
       id="path2479"
       sodipodi:nodetypes="cc" />
    <path
       style="fill:none;fill-rule:evenodd;stroke:#000000;stroke-width:2;stroke-linecap:butt;stroke-linejoin:miter;marker-end:url(#Arrow1Lend);stroke-miterlimit:4;stroke-dasharray:none;stroke-opacity:1"
       d="M 679.75278,-79.018857 L 720.12044,-298.22196"
       id="path2481"
       sodipodi:nodetypes="cc" />
    <path
       style="fill:none;fill-rule:evenodd;stroke:#000000;stroke-width:2;stroke-linecap:butt;stroke-linejoin:miter;marker-end:url(#Arrow1Lend);stroke-miterlimit:4;stroke-dasharray:none;stroke-opacity:1"
       d="M 792.88986,-3.2574204 L 751.43517,-298.22196"
       id="path2483"
       sodipodi:nodetypes="cc" />
  </g>
</svg>
