<?xml version="1.0" encoding="UTF-8" standalone="no"?>
<svg xmlns="http://www.w3.org/2000/svg"
     xmlns:xlink="http://www.w3.org/1999/xlink"
     width="610px" height="460px" viewBox="0 0 610 460"
     style="stroke:none">
<title>Graphic window number 1</title>
<desc>
Creator: GL2PS 1.3.2, (C) 1999-2006 Christophe Geuzaine (geuz@geuz.org)
For: Scilab
CreationDate: Mon Aug 30 21:17:42 2010
</desc>
<defs>
</defs>
<polygon fill="#ffffff" points="0,0 610,0 610,460 0,460"/>
<g>
<polygon fill="#ffffff" points="76.25,134.167 76.25,19.1667 76.25,134.167"/>
<polygon fill="#ffffff" points="76.25,19.1667 76.25,19.1667 76.25,134.167"/>
<polygon fill="#ffffff" points="76.25,134.167 533.75,134.167 76.25,134.167"/>
<polygon fill="#ffffff" points="533.75,134.167 533.75,134.167 76.25,134.167"/>
<polygon fill="#ffffff" points="76.25,134.167 533.75,134.167 76.25,19.1667"/>
<polygon fill="#ffffff" points="533.75,134.167 533.75,19.1667 76.25,19.1667"/>
<polygon fill="#0000ff" points="76.25,133.771 76.25,134.167 84.4196,133.771"/>
<polygon fill="#0000ff" points="76.25,134.167 84.4196,134.167 84.4196,133.771"/>
<polygon fill="#0000ff" points="84.4196,133.771 84.4196,134.167 92.5893,133.771"/>
<polygon fill="#0000ff" points="84.4196,134.167 92.5893,134.167 92.5893,133.771"/>
<polygon fill="#0000ff" points="92.5893,133.771 92.5893,134.167 100.759,133.771"/>
<polygon fill="#0000ff" points="92.5893,134.167 100.759,134.167 100.759,133.771"/>
<polygon fill="#0000ff" points="100.759,133.771 100.759,134.167 108.929,133.771"/>
<polygon fill="#0000ff" points="100.759,134.167 108.929,134.167 108.929,133.771"/>
<polygon fill="#0000ff" points="108.929,133.771 108.929,134.167 117.098,133.771"/>
<polygon fill="#0000ff" points="108.929,134.167 117.098,134.167 117.098,133.771"/>
<polygon fill="#0000ff" points="117.098,130.606 117.098,134.167 125.268,130.606"/>
<polygon fill="#0000ff" points="117.098,134.167 125.268,134.167 125.268,130.606"/>
<polygon fill="#0000ff" points="125.268,130.606 125.268,134.167 133.438,130.606"/>
<polygon fill="#0000ff" points="125.268,134.167 133.438,134.167 133.438,130.606"/>
<polygon fill="#0000ff" points="133.438,130.606 133.438,134.167 141.607,130.606"/>
<polygon fill="#0000ff" points="133.438,134.167 141.607,134.167 141.607,130.606"/>
<polygon fill="#0000ff" points="141.607,130.606 141.607,134.167 149.777,130.606"/>
<polygon fill="#0000ff" points="141.607,134.167 149.777,134.167 149.777,130.606"/>
<polygon fill="#0000ff" points="149.777,112.804 149.777,134.167 157.946,112.804"/>
<polygon fill="#0000ff" points="149.777,134.167 157.946,134.167 157.946,112.804"/>
<polygon fill="#0000ff" points="157.946,129.419 157.946,134.167 166.116,129.419"/>
<polygon fill="#0000ff" points="157.946,134.167 166.116,134.167 166.116,129.419"/>
<polygon fill="#0000ff" points="166.116,129.419 166.116,134.167 174.286,129.419"/>
<polygon fill="#0000ff" points="166.116,134.167 174.286,134.167 174.286,129.419"/>
<polygon fill="#0000ff" points="174.286,129.419 174.286,134.167 182.455,129.419"/>
<polygon fill="#0000ff" points="174.286,134.167 182.455,134.167 182.455,129.419"/>
<polygon fill="#0000ff" points="182.455,112.804 182.455,134.167 190.625,112.804"/>
<polygon fill="#0000ff" points="182.455,134.167 190.625,134.167 190.625,112.804"/>
<polygon fill="#0000ff" points="190.625,130.606 190.625,134.167 198.795,130.606"/>
<polygon fill="#0000ff" points="190.625,134.167 198.795,134.167 198.795,130.606"/>
<polygon fill="#0000ff" points="198.795,130.606 198.795,134.167 206.964,130.606"/>
<polygon fill="#0000ff" points="198.795,134.167 206.964,134.167 206.964,130.606"/>
<polygon fill="#0000ff" points="206.964,112.804 206.964,134.167 215.134,112.804"/>
<polygon fill="#0000ff" points="206.964,134.167 215.134,134.167 215.134,112.804"/>
<polygon fill="#0000ff" points="215.134,112.804 215.134,134.167 223.304,112.804"/>
<polygon fill="#0000ff" points="215.134,134.167 223.304,134.167 223.304,112.804"/>
<polygon fill="#0000ff" points="223.304,112.804 223.304,134.167 231.473,112.804"/>
<polygon fill="#0000ff" points="223.304,134.167 231.473,134.167 231.473,112.804"/>
<polygon fill="#0000ff" points="231.473,112.804 231.473,134.167 239.643,112.804"/>
<polygon fill="#0000ff" points="231.473,134.167 239.643,134.167 239.643,112.804"/>
<polygon fill="#0000ff" points="239.643,130.606 239.643,134.167 247.812,130.606"/>
<polygon fill="#0000ff" points="239.643,134.167 247.812,134.167 247.812,130.606"/>
<polygon fill="#0000ff" points="247.812,130.606 247.812,134.167 255.982,130.606"/>
<polygon fill="#0000ff" points="247.812,134.167 255.982,134.167 255.982,130.606"/>
<polygon fill="#0000ff" points="255.982,130.606 255.982,134.167 264.152,130.606"/>
<polygon fill="#0000ff" points="255.982,134.167 264.152,134.167 264.152,130.606"/>
<polygon fill="#0000ff" points="264.152,116.365 264.152,134.167 272.321,116.365"/>
<polygon fill="#0000ff" points="264.152,134.167 272.321,134.167 272.321,116.365"/>
<polygon fill="#0000ff" points="272.321,116.365 272.321,134.167 280.491,116.365"/>
<polygon fill="#0000ff" points="272.321,134.167 280.491,134.167 280.491,116.365"/>
<polygon fill="#0000ff" points="280.491,130.606 280.491,134.167 288.661,130.606"/>
<polygon fill="#0000ff" points="280.491,134.167 288.661,134.167 288.661,130.606"/>
<polygon fill="#0000ff" points="288.661,116.365 288.661,134.167 296.83,116.365"/>
<polygon fill="#0000ff" points="288.661,134.167 296.83,134.167 296.83,116.365"/>
<polygon fill="#0000ff" points="296.83,21.4216 296.83,134.167 305,21.4216"/>
<polygon fill="#0000ff" points="296.83,134.167 305,134.167 305,21.4216"/>
<polygon fill="#0000ff" points="305,21.4216 305,134.167 313.17,21.4216"/>
<polygon fill="#0000ff" points="305,134.167 313.17,134.167 313.17,21.4216"/>
<polygon fill="#0000ff" points="313.17,116.365 313.17,134.167 321.339,116.365"/>
<polygon fill="#0000ff" points="313.17,134.167 321.339,134.167 321.339,116.365"/>
<polygon fill="#0000ff" points="321.339,130.606 321.339,134.167 329.509,130.606"/>
<polygon fill="#0000ff" points="321.339,134.167 329.509,134.167 329.509,130.606"/>
<polygon fill="#0000ff" points="329.509,133.771 329.509,134.167 337.679,133.771"/>
<polygon fill="#0000ff" points="329.509,134.167 337.679,134.167 337.679,133.771"/>
<polygon fill="#0000ff" points="337.679,133.771 337.679,134.167 345.848,133.771"/>
<polygon fill="#0000ff" points="337.679,134.167 345.848,134.167 345.848,133.771"/>
<polygon fill="#0000ff" points="345.848,130.606 345.848,134.167 354.018,130.606"/>
<polygon fill="#0000ff" points="345.848,134.167 354.018,134.167 354.018,130.606"/>
<polygon fill="#0000ff" points="354.018,130.606 354.018,134.167 362.188,130.606"/>
<polygon fill="#0000ff" points="354.018,134.167 362.188,134.167 362.188,130.606"/>
<polygon fill="#0000ff" points="362.188,130.606 362.188,134.167 370.357,130.606"/>
<polygon fill="#0000ff" points="362.188,134.167 370.357,134.167 370.357,130.606"/>
<polygon fill="#0000ff" points="370.357,130.606 370.357,134.167 378.527,130.606"/>
<polygon fill="#0000ff" points="370.357,134.167 378.527,134.167 378.527,130.606"/>
<polygon fill="#0000ff" points="378.527,130.606 378.527,134.167 386.696,130.606"/>
<polygon fill="#0000ff" points="378.527,134.167 386.696,134.167 386.696,130.606"/>
<polygon fill="#0000ff" points="386.696,130.606 386.696,134.167 394.866,130.606"/>
<polygon fill="#0000ff" points="386.696,134.167 394.866,134.167 394.866,130.606"/>
<polygon fill="#0000ff" points="394.866,130.606 394.866,134.167 403.036,130.606"/>
<polygon fill="#0000ff" points="394.866,134.167 403.036,134.167 403.036,130.606"/>
<polygon fill="#0000ff" points="403.036,116.365 403.036,134.167 411.205,116.365"/>
<polygon fill="#0000ff" points="403.036,134.167 411.205,134.167 411.205,116.365"/>
<polygon fill="#0000ff" points="411.205,116.365 411.205,134.167 419.375,116.365"/>
<polygon fill="#0000ff" points="411.205,134.167 419.375,134.167 419.375,116.365"/>
<polygon fill="#0000ff" points="419.375,130.606 419.375,134.167 427.545,130.606"/>
<polygon fill="#0000ff" points="419.375,134.167 427.545,134.167 427.545,130.606"/>
<polygon fill="#0000ff" points="427.545,133.771 427.545,134.167 435.714,133.771"/>
<polygon fill="#0000ff" points="427.545,134.167 435.714,134.167 435.714,133.771"/>
<polygon fill="#0000ff" points="435.714,133.771 435.714,134.167 443.884,133.771"/>
<polygon fill="#0000ff" points="435.714,134.167 443.884,134.167 443.884,133.771"/>
<polygon fill="#0000ff" points="443.884,130.211 443.884,134.167 452.054,130.211"/>
<polygon fill="#0000ff" points="443.884,134.167 452.054,134.167 452.054,130.211"/>
<polygon fill="#0000ff" points="452.054,130.211 452.054,134.167 460.223,130.211"/>
<polygon fill="#0000ff" points="452.054,134.167 460.223,134.167 460.223,130.211"/>
<polygon fill="#0000ff" points="460.223,116.365 460.223,134.167 468.393,116.365"/>
<polygon fill="#0000ff" points="460.223,134.167 468.393,134.167 468.393,116.365"/>
<polygon fill="#0000ff" points="468.393,116.365 468.393,134.167 476.562,116.365"/>
<polygon fill="#0000ff" points="468.393,134.167 476.562,134.167 476.562,116.365"/>
<polygon fill="#0000ff" points="476.562,130.211 476.562,134.167 484.732,130.211"/>
<polygon fill="#0000ff" points="476.562,134.167 484.732,134.167 484.732,130.211"/>
<polygon fill="#0000ff" points="484.732,130.211 484.732,134.167 492.902,130.211"/>
<polygon fill="#0000ff" points="484.732,134.167 492.902,134.167 492.902,130.211"/>
<polygon fill="#0000ff" points="492.902,133.771 492.902,134.167 501.071,133.771"/>
<polygon fill="#0000ff" points="492.902,134.167 501.071,134.167 501.071,133.771"/>
<polygon fill="#0000ff" points="501.071,133.771 501.071,134.167 509.241,133.771"/>
<polygon fill="#0000ff" points="501.071,134.167 509.241,134.167 509.241,133.771"/>
<polygon fill="#0000ff" points="509.241,133.771 509.241,134.167 517.411,133.771"/>
<polygon fill="#0000ff" points="509.241,134.167 517.411,134.167 517.411,133.771"/>
<polyline fill="none" stroke="#000000" stroke-width="0.5" points="76.25,133.771 76.25,134.167 84.4196,134.167 84.4196,133.771 76.25,133.771"/>
<polyline fill="none" stroke="#000000" stroke-width="0.5" points="84.4196,133.771 84.4196,134.167 92.5893,134.167 92.5893,133.771 84.4196,133.771"/>
<polyline fill="none" stroke="#000000" stroke-width="0.5" points="92.5893,133.771 92.5893,134.167 100.759,134.167 100.759,133.771 92.5893,133.771"/>
<polyline fill="none" stroke="#000000" stroke-width="0.5" points="100.759,133.771 100.759,134.167 108.929,134.167 108.929,133.771 100.759,133.771"/>
<polyline fill="none" stroke="#000000" stroke-width="0.5" points="108.929,133.771 108.929,134.167 117.098,134.167 117.098,133.771 108.929,133.771"/>
<polyline fill="none" stroke="#000000" stroke-width="0.5" points="117.098,130.606 117.098,134.167 125.268,134.167 125.268,130.606 117.098,130.606"/>
<polyline fill="none" stroke="#000000" stroke-width="0.5" points="125.268,130.606 125.268,134.167 133.438,134.167 133.438,130.606 125.268,130.606"/>
<polyline fill="none" stroke="#000000" stroke-width="0.5" points="133.438,130.606 133.438,134.167 141.607,134.167 141.607,130.606 133.438,130.606"/>
<polyline fill="none" stroke="#000000" stroke-width="0.5" points="141.607,130.606 141.607,134.167 149.777,134.167 149.777,130.606 141.607,130.606"/>
<polyline fill="none" stroke="#000000" stroke-width="0.5" points="149.777,112.804 149.777,134.167 157.946,134.167 157.946,112.804 149.777,112.804"/>
<polyline fill="none" stroke="#000000" stroke-width="0.5" points="157.946,129.419 157.946,134.167 166.116,134.167 166.116,129.419 157.946,129.419"/>
<polyline fill="none" stroke="#000000" stroke-width="0.5" points="166.116,129.419 166.116,134.167 174.286,134.167 174.286,129.419 166.116,129.419"/>
<polyline fill="none" stroke="#000000" stroke-width="0.5" points="174.286,129.419 174.286,134.167 182.455,134.167 182.455,129.419 174.286,129.419"/>
<polyline fill="none" stroke="#000000" stroke-width="0.5" points="182.455,112.804 182.455,134.167 190.625,134.167 190.625,112.804 182.455,112.804"/>
<polyline fill="none" stroke="#000000" stroke-width="0.5" points="190.625,130.606 190.625,134.167 198.795,134.167 198.795,130.606 190.625,130.606"/>
<polyline fill="none" stroke="#000000" stroke-width="0.5" points="198.795,130.606 198.795,134.167 206.964,134.167 206.964,130.606 198.795,130.606"/>
<polyline fill="none" stroke="#000000" stroke-width="0.5" points="206.964,112.804 206.964,134.167 215.134,134.167 215.134,112.804 206.964,112.804"/>
<polyline fill="none" stroke="#000000" stroke-width="0.5" points="215.134,112.804 215.134,134.167 223.304,134.167 223.304,112.804 215.134,112.804"/>
<polyline fill="none" stroke="#000000" stroke-width="0.5" points="223.304,112.804 223.304,134.167 231.473,134.167 231.473,112.804 223.304,112.804"/>
<polyline fill="none" stroke="#000000" stroke-width="0.5" points="231.473,112.804 231.473,134.167 239.643,134.167 239.643,112.804 231.473,112.804"/>
<polyline fill="none" stroke="#000000" stroke-width="0.5" points="239.643,130.606 239.643,134.167 247.812,134.167 247.812,130.606 239.643,130.606"/>
<polyline fill="none" stroke="#000000" stroke-width="0.5" points="247.812,130.606 247.812,134.167 255.982,134.167 255.982,130.606 247.812,130.606"/>
<polyline fill="none" stroke="#000000" stroke-width="0.5" points="255.982,130.606 255.982,134.167 264.152,134.167 264.152,130.606 255.982,130.606"/>
<polyline fill="none" stroke="#000000" stroke-width="0.5" points="264.152,116.365 264.152,134.167 272.321,134.167 272.321,116.365 264.152,116.365"/>
<polyline fill="none" stroke="#000000" stroke-width="0.5" points="272.321,116.365 272.321,134.167 280.491,134.167 280.491,116.365 272.321,116.365"/>
<polyline fill="none" stroke="#000000" stroke-width="0.5" points="280.491,130.606 280.491,134.167 288.661,134.167 288.661,130.606 280.491,130.606"/>
<polyline fill="none" stroke="#000000" stroke-width="0.5" points="288.661,116.365 288.661,134.167 296.83,134.167 296.83,116.365 288.661,116.365"/>
<polyline fill="none" stroke="#000000" stroke-width="0.5" points="296.83,21.4216 296.83,134.167 305,134.167 305,21.4216 296.83,21.4216"/>
<polyline fill="none" stroke="#000000" stroke-width="0.5" points="305,21.4216 305,134.167 313.17,134.167 313.17,21.4216 305,21.4216"/>
<polyline fill="none" stroke="#000000" stroke-width="0.5" points="313.17,116.365 313.17,134.167 321.339,134.167 321.339,116.365 313.17,116.365"/>
<polyline fill="none" stroke="#000000" stroke-width="0.5" points="321.339,130.606 321.339,134.167 329.509,134.167 329.509,130.606 321.339,130.606"/>
<polyline fill="none" stroke="#000000" stroke-width="0.5" points="329.509,133.771 329.509,134.167 337.679,134.167 337.679,133.771 329.509,133.771"/>
<polyline fill="none" stroke="#000000" stroke-width="0.5" points="337.679,133.771 337.679,134.167 345.848,134.167 345.848,133.771 337.679,133.771"/>
<polyline fill="none" stroke="#000000" stroke-width="0.5" points="345.848,130.606 345.848,134.167 354.018,134.167 354.018,130.606 345.848,130.606"/>
<polyline fill="none" stroke="#000000" stroke-width="0.5" points="354.018,130.606 354.018,134.167 362.188,134.167 362.188,130.606 354.018,130.606"/>
<polyline fill="none" stroke="#000000" stroke-width="0.5" points="362.188,130.606 362.188,134.167 370.357,134.167 370.357,130.606 362.188,130.606"/>
<polyline fill="none" stroke="#000000" stroke-width="0.5" points="370.357,130.606 370.357,134.167 378.527,134.167 378.527,130.606 370.357,130.606"/>
<polyline fill="none" stroke="#000000" stroke-width="0.5" points="378.527,130.606 378.527,134.167 386.696,134.167 386.696,130.606 378.527,130.606"/>
<polyline fill="none" stroke="#000000" stroke-width="0.5" points="386.696,130.606 386.696,134.167 394.866,134.167 394.866,130.606 386.696,130.606"/>
<polyline fill="none" stroke="#000000" stroke-width="0.5" points="394.866,130.606 394.866,134.167 403.036,134.167 403.036,130.606 394.866,130.606"/>
<polyline fill="none" stroke="#000000" stroke-width="0.5" points="403.036,116.365 403.036,134.167 411.205,134.167 411.205,116.365 403.036,116.365"/>
<polyline fill="none" stroke="#000000" stroke-width="0.5" points="411.205,116.365 411.205,134.167 419.375,134.167 419.375,116.365 411.205,116.365"/>
<polyline fill="none" stroke="#000000" stroke-width="0.5" points="419.375,130.606 419.375,134.167 427.545,134.167 427.545,130.606 419.375,130.606"/>
<polyline fill="none" stroke="#000000" stroke-width="0.5" points="427.545,133.771 427.545,134.167 435.714,134.167 435.714,133.771 427.545,133.771"/>
<polyline fill="none" stroke="#000000" stroke-width="0.5" points="435.714,133.771 435.714,134.167 443.884,134.167 443.884,133.771 435.714,133.771"/>
<polyline fill="none" stroke="#000000" stroke-width="0.5" points="443.884,130.211 443.884,134.167 452.054,134.167 452.054,130.211 443.884,130.211"/>
<polyline fill="none" stroke="#000000" stroke-width="0.5" points="452.054,130.211 452.054,134.167 460.223,134.167 460.223,130.211 452.054,130.211"/>
<polyline fill="none" stroke="#000000" stroke-width="0.5" points="460.223,116.365 460.223,134.167 468.393,134.167 468.393,116.365 460.223,116.365"/>
<polyline fill="none" stroke="#000000" stroke-width="0.5" points="468.393,116.365 468.393,134.167 476.562,134.167 476.562,116.365 468.393,116.365"/>
<polyline fill="none" stroke="#000000" stroke-width="0.5" points="476.562,130.211 476.562,134.167 484.732,134.167 484.732,130.211 476.562,130.211"/>
<polyline fill="none" stroke="#000000" stroke-width="0.5" points="484.732,130.211 484.732,134.167 492.902,134.167 492.902,130.211 484.732,130.211"/>
<polyline fill="none" stroke="#000000" stroke-width="0.5" points="492.902,133.771 492.902,134.167 501.071,134.167 501.071,133.771 492.902,133.771"/>
<polyline fill="none" stroke="#000000" stroke-width="0.5" points="501.071,133.771 501.071,134.167 509.241,134.167 509.241,133.771 501.071,133.771"/>
<polyline fill="none" stroke="#000000" stroke-width="0.5" points="509.241,133.771 509.241,134.167 517.411,134.167 517.411,133.771 509.241,133.771"/>
<polyline fill="none" stroke="#ff0000" stroke-width="0.5" points="80.3348,19.1655 80.3348,134.167"/>
<polygon fill="#ff0000" points="80.3348,134.167 80.3856,134.027 80.2841,134.027"/>
<polyline fill="none" stroke="#000000" stroke-width="0.5" points="76.25,134.167 76.25,19.1667"/>
<polyline fill="none" stroke="#000000" stroke-width="0.5" points="76.25,134.167 69.395,134.167"/>
<polyline fill="none" stroke="#000000" stroke-width="0.5" points="76.25,114.387 69.395,114.387"/>
<polyline fill="none" stroke="#000000" stroke-width="0.5" points="76.25,94.607 69.395,94.607"/>
<polyline fill="none" stroke="#000000" stroke-width="0.5" points="76.25,74.8271 69.395,74.8271"/>
<polyline fill="none" stroke="#000000" stroke-width="0.5" points="76.25,55.0473 69.395,55.0473"/>
<polyline fill="none" stroke="#000000" stroke-width="0.5" points="76.25,35.2675 69.395,35.2675"/>
<polyline fill="none" stroke="#000000" stroke-width="0.5" points="76.25,129.222 72.137,129.222"/>
<polyline fill="none" stroke="#000000" stroke-width="0.5" points="76.25,124.277 72.137,124.277"/>
<polyline fill="none" stroke="#000000" stroke-width="0.5" points="76.25,119.332 72.137,119.332"/>
<polyline fill="none" stroke="#000000" stroke-width="0.5" points="76.25,109.442 72.137,109.442"/>
<polyline fill="none" stroke="#000000" stroke-width="0.5" points="76.25,104.497 72.137,104.497"/>
<polyline fill="none" stroke="#000000" stroke-width="0.5" points="76.25,99.552 72.137,99.552"/>
<polyline fill="none" stroke="#000000" stroke-width="0.5" points="76.25,89.6621 72.137,89.6621"/>
<polyline fill="none" stroke="#000000" stroke-width="0.5" points="76.25,84.7171 72.137,84.7171"/>
<polyline fill="none" stroke="#000000" stroke-width="0.5" points="76.25,79.7722 72.137,79.7722"/>
<polyline fill="none" stroke="#000000" stroke-width="0.5" points="76.25,69.8822 72.137,69.8822"/>
<polyline fill="none" stroke="#000000" stroke-width="0.5" points="76.25,64.9373 72.137,64.9373"/>
<polyline fill="none" stroke="#000000" stroke-width="0.5" points="76.25,59.9923 72.137,59.9923"/>
<polyline fill="none" stroke="#000000" stroke-width="0.5" points="76.25,50.1024 72.137,50.1024"/>
<polyline fill="none" stroke="#000000" stroke-width="0.5" points="76.25,45.1574 72.137,45.1574"/>
<polyline fill="none" stroke="#000000" stroke-width="0.5" points="76.25,40.2125 72.137,40.2125"/>
<polyline fill="none" stroke="#000000" stroke-width="0.5" points="76.25,30.3225 72.137,30.3225"/>
<polyline fill="none" stroke="#000000" stroke-width="0.5" points="76.25,25.3776 72.137,25.3776"/>
<polyline fill="none" stroke="#000000" stroke-width="0.5" points="76.25,20.4326 72.137,20.4326"/>
<text fill="#000000" style="stroke:none" x="60" y="139" transform="rotate(-0, 60, 139)" font-size="10" font-family="SansSerif" font-style="normal" font-weight="normal">0</text>
<text fill="#000000" style="stroke:none" x="55" y="119" transform="rotate(-0, 55, 119)" font-size="10" font-family="SansSerif" font-style="normal" font-weight="normal">50</text>
<text fill="#000000" style="stroke:none" x="49" y="100" transform="rotate(-0, 49, 100)" font-size="10" font-family="SansSerif" font-style="normal" font-weight="normal">100</text>
<text fill="#000000" style="stroke:none" x="49" y="80" transform="rotate(-0, 49, 80)" font-size="10" font-family="SansSerif" font-style="normal" font-weight="normal">150</text>
<text fill="#000000" style="stroke:none" x="49" y="60" transform="rotate(-0, 49, 60)" font-size="10" font-family="SansSerif" font-style="normal" font-weight="normal">200</text>
<text fill="#000000" style="stroke:none" x="49" y="40" transform="rotate(-0, 49, 40)" font-size="10" font-family="SansSerif" font-style="normal" font-weight="normal">250</text>
<polyline fill="none" stroke="#000000" stroke-width="0.5" points="76.25,134.167 533.75,134.167"/>
<polyline fill="none" stroke="#000000" stroke-width="0.5" points="153.862,134.167 153.862,137.167"/>
<polyline fill="none" stroke="#000000" stroke-width="0.5" points="235.558,134.167 235.558,137.167"/>
<polyline fill="none" stroke="#000000" stroke-width="0.5" points="317.254,134.167 317.254,137.167"/>
<polyline fill="none" stroke="#000000" stroke-width="0.5" points="398.951,134.167 398.951,137.167"/>
<polyline fill="none" stroke="#000000" stroke-width="0.5" points="480.647,134.167 480.647,137.167"/>
<polyline fill="none" stroke="#000000" stroke-width="0.5" points="92.5893,134.167 92.5893,135.967"/>
<polyline fill="none" stroke="#000000" stroke-width="0.5" points="113.013,134.167 113.013,135.967"/>
<polyline fill="none" stroke="#000000" stroke-width="0.5" points="133.438,134.167 133.438,135.967"/>
<polyline fill="none" stroke="#000000" stroke-width="0.5" points="174.286,134.167 174.286,135.967"/>
<polyline fill="none" stroke="#000000" stroke-width="0.5" points="194.71,134.167 194.71,135.967"/>
<polyline fill="none" stroke="#000000" stroke-width="0.5" points="215.134,134.167 215.134,135.967"/>
<polyline fill="none" stroke="#000000" stroke-width="0.5" points="255.982,134.167 255.982,135.967"/>
<polyline fill="none" stroke="#000000" stroke-width="0.5" points="276.406,134.167 276.406,135.967"/>
<polyline fill="none" stroke="#000000" stroke-width="0.5" points="296.83,134.167 296.83,135.967"/>
<polyline fill="none" stroke="#000000" stroke-width="0.5" points="337.679,134.167 337.679,135.967"/>
<polyline fill="none" stroke="#000000" stroke-width="0.5" points="358.103,134.167 358.103,135.967"/>
<polyline fill="none" stroke="#000000" stroke-width="0.5" points="378.527,134.167 378.527,135.967"/>
<polyline fill="none" stroke="#000000" stroke-width="0.5" points="419.375,134.167 419.375,135.967"/>
<polyline fill="none" stroke="#000000" stroke-width="0.5" points="439.799,134.167 439.799,135.967"/>
<polyline fill="none" stroke="#000000" stroke-width="0.5" points="460.223,134.167 460.223,135.967"/>
<polyline fill="none" stroke="#000000" stroke-width="0.5" points="501.071,134.167 501.071,135.967"/>
<polyline fill="none" stroke="#000000" stroke-width="0.5" points="521.496,134.167 521.496,135.967"/>
<text fill="#000000" style="stroke:none" x="147" y="148" transform="rotate(-0, 147, 148)" font-size="10" font-family="SansSerif" font-style="normal" font-weight="normal">10</text>
<text fill="#000000" style="stroke:none" x="229" y="148" transform="rotate(-0, 229, 148)" font-size="10" font-family="SansSerif" font-style="normal" font-weight="normal">20</text>
<text fill="#000000" style="stroke:none" x="311" y="148" transform="rotate(-0, 311, 148)" font-size="10" font-family="SansSerif" font-style="normal" font-weight="normal">30</text>
<text fill="#000000" style="stroke:none" x="392" y="148" transform="rotate(-0, 392, 148)" font-size="10" font-family="SansSerif" font-style="normal" font-weight="normal">40</text>
<text fill="#000000" style="stroke:none" x="474" y="148" transform="rotate(-0, 474, 148)" font-size="10" font-family="SansSerif" font-style="normal" font-weight="normal">50</text>
<text fill="#000000" style="stroke:none" x="288" y="11" transform="rotate(0, 288, 11)" font-size="10" font-family="SansSerif" font-style="normal" font-weight="normal"># calls</text>
<polygon fill="#ffffff" points="76.25,287.5 76.25,172.5 76.25,287.5"/>
<polygon fill="#ffffff" points="76.25,172.5 76.25,172.5 76.25,287.5"/>
<polygon fill="#ffffff" points="76.25,287.5 533.75,287.5 76.25,287.5"/>
<polygon fill="#ffffff" points="533.75,287.5 533.75,287.5 76.25,287.5"/>
<polygon fill="#ffffff" points="76.25,287.5 533.75,287.5 76.25,172.5"/>
<polygon fill="#ffffff" points="533.75,287.5 533.75,172.5 76.25,172.5"/>
<polygon fill="#00ff00" points="76.25,287.5 76.25,287.5 84.4196,287.5"/>
<polygon fill="#00ff00" points="76.25,287.5 84.4196,287.5 84.4196,287.5"/>
<polygon fill="#00ff00" points="84.4196,287.407 84.4196,287.5 92.5893,287.407"/>
<polygon fill="#00ff00" points="84.4196,287.5 92.5893,287.5 92.5893,287.407"/>
<polygon fill="#00ff00" points="92.5893,287.477 92.5893,287.5 100.759,287.477"/>
<polygon fill="#00ff00" points="92.5893,287.5 100.759,287.5 100.759,287.477"/>
<polygon fill="#00ff00" points="100.759,287.36 100.759,287.5 108.929,287.36"/>
<polygon fill="#00ff00" points="100.759,287.5 108.929,287.5 108.929,287.36"/>
<polygon fill="#00ff00" points="108.929,287.477 108.929,287.5 117.098,287.477"/>
<polygon fill="#00ff00" points="108.929,287.5 117.098,287.5 117.098,287.477"/>
<polygon fill="#00ff00" points="117.098,287.5 117.098,287.5 125.268,287.5"/>
<polygon fill="#00ff00" points="117.098,287.5 125.268,287.5 125.268,287.5"/>
<polygon fill="#00ff00" points="125.268,287.291 125.268,287.5 133.438,287.291"/>
<polygon fill="#00ff00" points="125.268,287.5 133.438,287.5 133.438,287.291"/>
<polygon fill="#00ff00" points="133.438,287.081 133.438,287.5 141.607,287.081"/>
<polygon fill="#00ff00" points="133.438,287.5 141.607,287.5 141.607,287.081"/>
<polygon fill="#00ff00" points="141.607,286.243 141.607,287.5 149.777,286.243"/>
<polygon fill="#00ff00" points="141.607,287.5 149.777,287.5 149.777,286.243"/>
<polygon fill="#00ff00" points="149.777,287.5 149.777,287.5 157.946,287.5"/>
<polygon fill="#00ff00" points="149.777,287.5 157.946,287.5 157.946,287.5"/>
<polygon fill="#00ff00" points="157.946,287.5 157.946,287.5 166.116,287.5"/>
<polygon fill="#00ff00" points="157.946,287.5 166.116,287.5 166.116,287.5"/>
<polygon fill="#00ff00" points="166.116,286.942 166.116,287.5 174.286,286.942"/>
<polygon fill="#00ff00" points="166.116,287.5 174.286,287.5 174.286,286.942"/>
<polygon fill="#00ff00" points="174.286,285.825 174.286,287.5 182.455,285.825"/>
<polygon fill="#00ff00" points="174.286,287.5 182.455,287.5 182.455,285.825"/>
<polygon fill="#00ff00" points="182.455,287.5 182.455,287.5 190.625,287.5"/>
<polygon fill="#00ff00" points="182.455,287.5 190.625,287.5 190.625,287.5"/>
<polygon fill="#00ff00" points="190.625,287.5 190.625,287.5 198.795,287.5"/>
<polygon fill="#00ff00" points="190.625,287.5 198.795,287.5 198.795,287.5"/>
<polygon fill="#00ff00" points="198.795,287.291 198.795,287.5 206.964,287.291"/>
<polygon fill="#00ff00" points="198.795,287.5 206.964,287.5 206.964,287.291"/>
<polygon fill="#00ff00" points="206.964,287.5 206.964,287.5 215.134,287.5"/>
<polygon fill="#00ff00" points="206.964,287.5 215.134,287.5 215.134,287.5"/>
<polygon fill="#00ff00" points="215.134,281.217 215.134,287.5 223.304,281.217"/>
<polygon fill="#00ff00" points="215.134,287.5 223.304,287.5 223.304,281.217"/>
<polygon fill="#00ff00" points="223.304,278.704 223.304,287.5 231.473,278.704"/>
<polygon fill="#00ff00" points="223.304,287.5 231.473,287.5 231.473,278.704"/>
<polygon fill="#00ff00" points="231.473,282.474 231.473,287.5 239.643,282.474"/>
<polygon fill="#00ff00" points="231.473,287.5 239.643,287.5 239.643,282.474"/>
<polygon fill="#00ff00" points="239.643,287.5 239.643,287.5 247.812,287.5"/>
<polygon fill="#00ff00" points="239.643,287.5 247.812,287.5 247.812,287.5"/>
<polygon fill="#00ff00" points="247.812,286.872 247.812,287.5 255.982,286.872"/>
<polygon fill="#00ff00" points="247.812,287.5 255.982,287.5 255.982,286.872"/>
<polygon fill="#00ff00" points="255.982,287.291 255.982,287.5 264.152,287.291"/>
<polygon fill="#00ff00" points="255.982,287.5 264.152,287.5 264.152,287.291"/>
<polygon fill="#00ff00" points="264.152,287.5 264.152,287.5 272.321,287.5"/>
<polygon fill="#00ff00" points="264.152,287.5 272.321,287.5 272.321,287.5"/>
<polygon fill="#00ff00" points="272.321,274.934 272.321,287.5 280.491,274.934"/>
<polygon fill="#00ff00" points="272.321,287.5 280.491,287.5 280.491,274.934"/>
<polygon fill="#00ff00" points="280.491,287.5 280.491,287.5 288.661,287.5"/>
<polygon fill="#00ff00" points="280.491,287.5 288.661,287.5 288.661,287.5"/>
<polygon fill="#00ff00" points="288.661,287.5 288.661,287.5 296.83,287.5"/>
<polygon fill="#00ff00" points="288.661,287.5 296.83,287.5 296.83,287.5"/>
<polygon fill="#00ff00" points="296.83,287.5 296.83,287.5 305,287.5"/>
<polygon fill="#00ff00" points="296.83,287.5 305,287.5 305,287.5"/>
<polygon fill="#00ff00" points="305,174.755 305,287.5 313.17,174.755"/>
<polygon fill="#00ff00" points="305,287.5 313.17,287.5 313.17,174.755"/>
<polygon fill="#00ff00" points="313.17,287.5 313.17,287.5 321.339,287.5"/>
<polygon fill="#00ff00" points="313.17,287.5 321.339,287.5 321.339,287.5"/>
<polygon fill="#00ff00" points="321.339,287.5 321.339,287.5 329.509,287.5"/>
<polygon fill="#00ff00" points="321.339,287.5 329.509,287.5 329.509,287.5"/>
<polygon fill="#00ff00" points="329.509,287.5 329.509,287.5 337.679,287.5"/>
<polygon fill="#00ff00" points="329.509,287.5 337.679,287.5 337.679,287.5"/>
<polygon fill="#00ff00" points="337.679,287.477 337.679,287.5 345.848,287.477"/>
<polygon fill="#00ff00" points="337.679,287.5 345.848,287.5 345.848,287.477"/>
<polygon fill="#00ff00" points="345.848,287.5 345.848,287.5 354.018,287.5"/>
<polygon fill="#00ff00" points="345.848,287.5 354.018,287.5 354.018,287.5"/>
<polygon fill="#00ff00" points="354.018,287.291 354.018,287.5 362.188,287.291"/>
<polygon fill="#00ff00" points="354.018,287.5 362.188,287.5 362.188,287.291"/>
<polygon fill="#00ff00" points="362.188,286.662 362.188,287.5 370.357,286.662"/>
<polygon fill="#00ff00" points="362.188,287.5 370.357,287.5 370.357,286.662"/>
<polygon fill="#00ff00" points="370.357,286.662 370.357,287.5 378.527,286.662"/>
<polygon fill="#00ff00" points="370.357,287.5 378.527,287.5 378.527,286.662"/>
<polygon fill="#00ff00" points="378.527,286.453 378.527,287.5 386.696,286.453"/>
<polygon fill="#00ff00" points="378.527,287.5 386.696,287.5 386.696,286.453"/>
<polygon fill="#00ff00" points="386.696,286.872 386.696,287.5 394.866,286.872"/>
<polygon fill="#00ff00" points="386.696,287.5 394.866,287.5 394.866,286.872"/>
<polygon fill="#00ff00" points="394.866,287.291 394.866,287.5 403.036,287.291"/>
<polygon fill="#00ff00" points="394.866,287.5 403.036,287.5 403.036,287.291"/>
<polygon fill="#00ff00" points="403.036,287.5 403.036,287.5 411.205,287.5"/>
<polygon fill="#00ff00" points="403.036,287.5 411.205,287.5 411.205,287.5"/>
<polygon fill="#00ff00" points="411.205,272.84 411.205,287.5 419.375,272.84"/>
<polygon fill="#00ff00" points="411.205,287.5 419.375,287.5 419.375,272.84"/>
<polygon fill="#00ff00" points="419.375,287.5 419.375,287.5 427.545,287.5"/>
<polygon fill="#00ff00" points="419.375,287.5 427.545,287.5 427.545,287.5"/>
<polygon fill="#00ff00" points="427.545,287.5 427.545,287.5 435.714,287.5"/>
<polygon fill="#00ff00" points="427.545,287.5 435.714,287.5 435.714,287.5"/>
<polygon fill="#00ff00" points="435.714,287.477 435.714,287.5 443.884,287.477"/>
<polygon fill="#00ff00" points="435.714,287.5 443.884,287.5 443.884,287.477"/>
<polygon fill="#00ff00" points="443.884,287.5 443.884,287.5 452.054,287.5"/>
<polygon fill="#00ff00" points="443.884,287.5 452.054,287.5 452.054,287.5"/>
<polygon fill="#00ff00" points="452.054,287.035 452.054,287.5 460.223,287.035"/>
<polygon fill="#00ff00" points="452.054,287.5 460.223,287.5 460.223,287.035"/>
<polygon fill="#00ff00" points="460.223,287.5 460.223,287.5 468.393,287.5"/>
<polygon fill="#00ff00" points="460.223,287.5 468.393,287.5 468.393,287.5"/>
<polygon fill="#00ff00" points="468.393,275.981 468.393,287.5 476.562,275.981"/>
<polygon fill="#00ff00" points="468.393,287.5 476.562,287.5 476.562,275.981"/>
<polygon fill="#00ff00" points="476.562,287.5 476.562,287.5 484.732,287.5"/>
<polygon fill="#00ff00" points="476.562,287.5 484.732,287.5 484.732,287.5"/>
<polygon fill="#00ff00" points="484.732,284.708 484.732,287.5 492.902,284.708"/>
<polygon fill="#00ff00" points="484.732,287.5 492.902,287.5 492.902,284.708"/>
<polygon fill="#00ff00" points="492.902,287.5 492.902,287.5 501.071,287.5"/>
<polygon fill="#00ff00" points="492.902,287.5 501.071,287.5 501.071,287.5"/>
<polygon fill="#00ff00" points="501.071,287.453 501.071,287.5 509.241,287.453"/>
<polygon fill="#00ff00" points="501.071,287.5 509.241,287.5 509.241,287.453"/>
<polygon fill="#00ff00" points="509.241,287.5 509.241,287.5 517.411,287.5"/>
<polygon fill="#00ff00" points="509.241,287.5 517.411,287.5 517.411,287.5"/>
<polyline fill="none" stroke="#000000" stroke-width="0.5" points="76.25,287.5 76.25,287.5 84.4196,287.5 84.4196,287.5 76.25,287.5"/>
<polyline fill="none" stroke="#000000" stroke-width="0.5" points="84.4196,287.407 84.4196,287.5 92.5893,287.5 92.5893,287.407 84.4196,287.407"/>
<polyline fill="none" stroke="#000000" stroke-width="0.5" points="92.5893,287.477 92.5893,287.5 100.759,287.5 100.759,287.477 92.5893,287.477"/>
<polyline fill="none" stroke="#000000" stroke-width="0.5" points="100.759,287.36 100.759,287.5 108.929,287.5 108.929,287.36 100.759,287.36"/>
<polyline fill="none" stroke="#000000" stroke-width="0.5" points="108.929,287.477 108.929,287.5 117.098,287.5 117.098,287.477 108.929,287.477"/>
<polyline fill="none" stroke="#000000" stroke-width="0.5" points="117.098,287.5 117.098,287.5 125.268,287.5 125.268,287.5 117.098,287.5"/>
<polyline fill="none" stroke="#000000" stroke-width="0.5" points="125.268,287.291 125.268,287.5 133.438,287.5 133.438,287.291 125.268,287.291"/>
<polyline fill="none" stroke="#000000" stroke-width="0.5" points="133.438,287.081 133.438,287.5 141.607,287.5 141.607,287.081 133.438,287.081"/>
<polyline fill="none" stroke="#000000" stroke-width="0.5" points="141.607,286.243 141.607,287.5 149.777,287.5 149.777,286.243 141.607,286.243"/>
<polyline fill="none" stroke="#000000" stroke-width="0.5" points="149.777,287.5 149.777,287.5 157.946,287.5 157.946,287.5 149.777,287.5"/>
<polyline fill="none" stroke="#000000" stroke-width="0.5" points="157.946,287.5 157.946,287.5 166.116,287.5 166.116,287.5 157.946,287.5"/>
<polyline fill="none" stroke="#000000" stroke-width="0.5" points="166.116,286.942 166.116,287.5 174.286,287.5 174.286,286.942 166.116,286.942"/>
<polyline fill="none" stroke="#000000" stroke-width="0.5" points="174.286,285.825 174.286,287.5 182.455,287.5 182.455,285.825 174.286,285.825"/>
<polyline fill="none" stroke="#000000" stroke-width="0.5" points="182.455,287.5 182.455,287.5 190.625,287.5 190.625,287.5 182.455,287.5"/>
<polyline fill="none" stroke="#000000" stroke-width="0.5" points="190.625,287.5 190.625,287.5 198.795,287.5 198.795,287.5 190.625,287.5"/>
<polyline fill="none" stroke="#000000" stroke-width="0.5" points="198.795,287.291 198.795,287.5 206.964,287.5 206.964,287.291 198.795,287.291"/>
<polyline fill="none" stroke="#000000" stroke-width="0.5" points="206.964,287.5 206.964,287.5 215.134,287.5 215.134,287.5 206.964,287.5"/>
<polyline fill="none" stroke="#000000" stroke-width="0.5" points="215.134,281.217 215.134,287.5 223.304,287.5 223.304,281.217 215.134,281.217"/>
<polyline fill="none" stroke="#000000" stroke-width="0.5" points="223.304,278.704 223.304,287.5 231.473,287.5 231.473,278.704 223.304,278.704"/>
<polyline fill="none" stroke="#000000" stroke-width="0.5" points="231.473,282.474 231.473,287.5 239.643,287.5 239.643,282.474 231.473,282.474"/>
<polyline fill="none" stroke="#000000" stroke-width="0.5" points="239.643,287.5 239.643,287.5 247.812,287.5 247.812,287.5 239.643,287.5"/>
<polyline fill="none" stroke="#000000" stroke-width="0.5" points="247.812,286.872 247.812,287.5 255.982,287.5 255.982,286.872 247.812,286.872"/>
<polyline fill="none" stroke="#000000" stroke-width="0.5" points="255.982,287.291 255.982,287.5 264.152,287.5 264.152,287.291 255.982,287.291"/>
<polyline fill="none" stroke="#000000" stroke-width="0.5" points="264.152,287.5 264.152,287.5 272.321,287.5 272.321,287.5 264.152,287.5"/>
<polyline fill="none" stroke="#000000" stroke-width="0.5" points="272.321,274.934 272.321,287.5 280.491,287.5 280.491,274.934 272.321,274.934"/>
<polyline fill="none" stroke="#000000" stroke-width="0.5" points="280.491,287.5 280.491,287.5 288.661,287.5 288.661,287.5 280.491,287.5"/>
<polyline fill="none" stroke="#000000" stroke-width="0.5" points="288.661,287.5 288.661,287.5 296.83,287.5 296.83,287.5 288.661,287.5"/>
<polyline fill="none" stroke="#000000" stroke-width="0.5" points="296.83,287.5 296.83,287.5 305,287.5 305,287.5 296.83,287.5"/>
<polyline fill="none" stroke="#000000" stroke-width="0.5" points="305,174.755 305,287.5 313.17,287.5 313.17,174.755 305,174.755"/>
<polyline fill="none" stroke="#000000" stroke-width="0.5" points="313.17,287.5 313.17,287.5 321.339,287.5 321.339,287.5 313.17,287.5"/>
<polyline fill="none" stroke="#000000" stroke-width="0.5" points="321.339,287.5 321.339,287.5 329.509,287.5 329.509,287.5 321.339,287.5"/>
<polyline fill="none" stroke="#000000" stroke-width="0.5" points="329.509,287.5 329.509,287.5 337.679,287.5 337.679,287.5 329.509,287.5"/>
<polyline fill="none" stroke="#000000" stroke-width="0.5" points="337.679,287.477 337.679,287.5 345.848,287.5 345.848,287.477 337.679,287.477"/>
<polyline fill="none" stroke="#000000" stroke-width="0.5" points="345.848,287.5 345.848,287.5 354.018,287.5 354.018,287.5 345.848,287.5"/>
<polyline fill="none" stroke="#000000" stroke-width="0.5" points="354.018,287.291 354.018,287.5 362.188,287.5 362.188,287.291 354.018,287.291"/>
<polyline fill="none" stroke="#000000" stroke-width="0.5" points="362.188,286.662 362.188,287.5 370.357,287.5 370.357,286.662 362.188,286.662"/>
<polyline fill="none" stroke="#000000" stroke-width="0.5" points="370.357,286.662 370.357,287.5 378.527,287.5 378.527,286.662 370.357,286.662"/>
<polyline fill="none" stroke="#000000" stroke-width="0.5" points="378.527,286.453 378.527,287.5 386.696,287.5 386.696,286.453 378.527,286.453"/>
<polyline fill="none" stroke="#000000" stroke-width="0.5" points="386.696,286.872 386.696,287.5 394.866,287.5 394.866,286.872 386.696,286.872"/>
<polyline fill="none" stroke="#000000" stroke-width="0.5" points="394.866,287.291 394.866,287.5 403.036,287.5 403.036,287.291 394.866,287.291"/>
<polyline fill="none" stroke="#000000" stroke-width="0.5" points="403.036,287.5 403.036,287.5 411.205,287.5 411.205,287.5 403.036,287.5"/>
<polyline fill="none" stroke="#000000" stroke-width="0.5" points="411.205,272.84 411.205,287.5 419.375,287.5 419.375,272.84 411.205,272.84"/>
<polyline fill="none" stroke="#000000" stroke-width="0.5" points="419.375,287.5 419.375,287.5 427.545,287.5 427.545,287.5 419.375,287.5"/>
<polyline fill="none" stroke="#000000" stroke-width="0.5" points="427.545,287.5 427.545,287.5 435.714,287.5 435.714,287.5 427.545,287.5"/>
<polyline fill="none" stroke="#000000" stroke-width="0.5" points="435.714,287.477 435.714,287.5 443.884,287.5 443.884,287.477 435.714,287.477"/>
<polyline fill="none" stroke="#000000" stroke-width="0.5" points="443.884,287.5 443.884,287.5 452.054,287.5 452.054,287.5 443.884,287.5"/>
<polyline fill="none" stroke="#000000" stroke-width="0.5" points="452.054,287.035 452.054,287.5 460.223,287.5 460.223,287.035 452.054,287.035"/>
<polyline fill="none" stroke="#000000" stroke-width="0.5" points="460.223,287.5 460.223,287.5 468.393,287.5 468.393,287.5 460.223,287.5"/>
<polyline fill="none" stroke="#000000" stroke-width="0.5" points="468.393,275.981 468.393,287.5 476.562,287.5 476.562,275.981 468.393,275.981"/>
<polyline fill="none" stroke="#000000" stroke-width="0.5" points="476.562,287.5 476.562,287.5 484.732,287.5 484.732,287.5 476.562,287.5"/>
<polyline fill="none" stroke="#000000" stroke-width="0.5" points="484.732,284.708 484.732,287.5 492.902,287.5 492.902,284.708 484.732,284.708"/>
<polyline fill="none" stroke="#000000" stroke-width="0.5" points="492.902,287.5 492.902,287.5 501.071,287.5 501.071,287.5 492.902,287.5"/>
<polyline fill="none" stroke="#000000" stroke-width="0.5" points="501.071,287.453 501.071,287.5 509.241,287.5 509.241,287.453 501.071,287.453"/>
<polyline fill="none" stroke="#000000" stroke-width="0.5" points="509.241,287.5 509.241,287.5 517.411,287.5 517.411,287.5 509.241,287.5"/>
<polyline fill="none" stroke="#ff0000" stroke-width="0.5" points="80.3348,172.499 80.3348,287.5"/>
<polygon fill="#ff0000" points="80.3348,287.5 80.3378,287.492 80.3318,287.492"/>
<polyline fill="none" stroke="#000000" stroke-width="0.5" points="76.25,287.5 76.25,172.5"/>
<polyline fill="none" stroke="#000000" stroke-width="0.5" points="76.25,287.5 69.395,287.5"/>
<polyline fill="none" stroke="#000000" stroke-width="0.5" points="76.25,275.865 69.395,275.865"/>
<polyline fill="none" stroke="#000000" stroke-width="0.5" points="76.25,264.23 69.395,264.23"/>
<polyline fill="none" stroke="#000000" stroke-width="0.5" points="76.25,252.594 69.395,252.594"/>
<polyline fill="none" stroke="#000000" stroke-width="0.5" points="76.25,240.959 69.395,240.959"/>
<polyline fill="none" stroke="#000000" stroke-width="0.5" points="76.25,229.324 69.395,229.324"/>
<polyline fill="none" stroke="#000000" stroke-width="0.5" points="76.25,217.689 69.395,217.689"/>
<polyline fill="none" stroke="#000000" stroke-width="0.5" points="76.25,206.054 69.395,206.054"/>
<polyline fill="none" stroke="#000000" stroke-width="0.5" points="76.25,194.418 69.395,194.418"/>
<polyline fill="none" stroke="#000000" stroke-width="0.5" points="76.25,182.783 69.395,182.783"/>
<polyline fill="none" stroke="#000000" stroke-width="0.5" points="76.25,281.682 72.137,281.682"/>
<polyline fill="none" stroke="#000000" stroke-width="0.5" points="76.25,270.047 72.137,270.047"/>
<polyline fill="none" stroke="#000000" stroke-width="0.5" points="76.25,258.412 72.137,258.412"/>
<polyline fill="none" stroke="#000000" stroke-width="0.5" points="76.25,246.777 72.137,246.777"/>
<polyline fill="none" stroke="#000000" stroke-width="0.5" points="76.25,235.142 72.137,235.142"/>
<polyline fill="none" stroke="#000000" stroke-width="0.5" points="76.25,223.506 72.137,223.506"/>
<polyline fill="none" stroke="#000000" stroke-width="0.5" points="76.25,211.871 72.137,211.871"/>
<polyline fill="none" stroke="#000000" stroke-width="0.5" points="76.25,200.236 72.137,200.236"/>
<polyline fill="none" stroke="#000000" stroke-width="0.5" points="76.25,188.601 72.137,188.601"/>
<polyline fill="none" stroke="#000000" stroke-width="0.5" points="76.25,176.966 72.137,176.966"/>
<text fill="#000000" style="stroke:none" x="60" y="292" transform="rotate(-0, 60, 292)" font-size="10" font-family="SansSerif" font-style="normal" font-weight="normal">0</text>
<text fill="#000000" style="stroke:none" x="49" y="281" transform="rotate(-0, 49, 281)" font-size="10" font-family="SansSerif" font-style="normal" font-weight="normal">500</text>
<text fill="#000000" style="stroke:none" x="43" y="269" transform="rotate(-0, 43, 269)" font-size="10" font-family="SansSerif" font-style="normal" font-weight="normal">1000</text>
<text fill="#000000" style="stroke:none" x="43" y="258" transform="rotate(-0, 43, 258)" font-size="10" font-family="SansSerif" font-style="normal" font-weight="normal">1500</text>
<text fill="#000000" style="stroke:none" x="43" y="246" transform="rotate(-0, 43, 246)" font-size="10" font-family="SansSerif" font-style="normal" font-weight="normal">2000</text>
<text fill="#000000" style="stroke:none" x="43" y="234" transform="rotate(-0, 43, 234)" font-size="10" font-family="SansSerif" font-style="normal" font-weight="normal">2500</text>
<text fill="#000000" style="stroke:none" x="43" y="223" transform="rotate(-0, 43, 223)" font-size="10" font-family="SansSerif" font-style="normal" font-weight="normal">3000</text>
<text fill="#000000" style="stroke:none" x="43" y="211" transform="rotate(-0, 43, 211)" font-size="10" font-family="SansSerif" font-style="normal" font-weight="normal">3500</text>
<text fill="#000000" style="stroke:none" x="42" y="199" transform="rotate(-0, 42, 199)" font-size="10" font-family="SansSerif" font-style="normal" font-weight="normal">4000</text>
<text fill="#000000" style="stroke:none" x="42" y="188" transform="rotate(-0, 42, 188)" font-size="10" font-family="SansSerif" font-style="normal" font-weight="normal">4500</text>
<polyline fill="none" stroke="#000000" stroke-width="0.5" points="76.25,287.5 533.75,287.5"/>
<polyline fill="none" stroke="#000000" stroke-width="0.5" points="153.862,287.5 153.862,290.5"/>
<polyline fill="none" stroke="#000000" stroke-width="0.5" points="235.558,287.5 235.558,290.5"/>
<polyline fill="none" stroke="#000000" stroke-width="0.5" points="317.254,287.5 317.254,290.5"/>
<polyline fill="none" stroke="#000000" stroke-width="0.5" points="398.951,287.5 398.951,290.5"/>
<polyline fill="none" stroke="#000000" stroke-width="0.5" points="480.647,287.5 480.647,290.5"/>
<polyline fill="none" stroke="#000000" stroke-width="0.5" points="92.5893,287.5 92.5893,289.3"/>
<polyline fill="none" stroke="#000000" stroke-width="0.5" points="113.013,287.5 113.013,289.3"/>
<polyline fill="none" stroke="#000000" stroke-width="0.5" points="133.438,287.5 133.438,289.3"/>
<polyline fill="none" stroke="#000000" stroke-width="0.5" points="174.286,287.5 174.286,289.3"/>
<polyline fill="none" stroke="#000000" stroke-width="0.5" points="194.71,287.5 194.71,289.3"/>
<polyline fill="none" stroke="#000000" stroke-width="0.5" points="215.134,287.5 215.134,289.3"/>
<polyline fill="none" stroke="#000000" stroke-width="0.5" points="255.982,287.5 255.982,289.3"/>
<polyline fill="none" stroke="#000000" stroke-width="0.5" points="276.406,287.5 276.406,289.3"/>
<polyline fill="none" stroke="#000000" stroke-width="0.5" points="296.83,287.5 296.83,289.3"/>
<polyline fill="none" stroke="#000000" stroke-width="0.5" points="337.679,287.5 337.679,289.3"/>
<polyline fill="none" stroke="#000000" stroke-width="0.5" points="358.103,287.5 358.103,289.3"/>
<polyline fill="none" stroke="#000000" stroke-width="0.5" points="378.527,287.5 378.527,289.3"/>
<polyline fill="none" stroke="#000000" stroke-width="0.5" points="419.375,287.5 419.375,289.3"/>
<polyline fill="none" stroke="#000000" stroke-width="0.5" points="439.799,287.5 439.799,289.3"/>
<polyline fill="none" stroke="#000000" stroke-width="0.5" points="460.223,287.5 460.223,289.3"/>
<polyline fill="none" stroke="#000000" stroke-width="0.5" points="501.071,287.5 501.071,289.3"/>
<polyline fill="none" stroke="#000000" stroke-width="0.5" points="521.496,287.5 521.496,289.3"/>
<text fill="#000000" style="stroke:none" x="147" y="301" transform="rotate(-0, 147, 301)" font-size="10" font-family="SansSerif" font-style="normal" font-weight="normal">10</text>
<text fill="#000000" style="stroke:none" x="229" y="301" transform="rotate(-0, 229, 301)" font-size="10" font-family="SansSerif" font-style="normal" font-weight="normal">20</text>
<text fill="#000000" style="stroke:none" x="311" y="301" transform="rotate(-0, 311, 301)" font-size="10" font-family="SansSerif" font-style="normal" font-weight="normal">30</text>
<text fill="#000000" style="stroke:none" x="392" y="301" transform="rotate(-0, 392, 301)" font-size="10" font-family="SansSerif" font-style="normal" font-weight="normal">40</text>
<text fill="#000000" style="stroke:none" x="474" y="301" transform="rotate(-0, 474, 301)" font-size="10" font-family="SansSerif" font-style="normal" font-weight="normal">50</text>
<text fill="#000000" style="stroke:none" x="274" y="163" transform="rotate(0, 274, 163)" font-size="10" font-family="SansSerif" font-style="normal" font-weight="normal">Complexity</text>
<polygon fill="#ffffff" points="76.25,440.833 76.25,325.833 76.25,440.833"/>
<polygon fill="#ffffff" points="76.25,325.833 76.25,325.833 76.25,440.833"/>
<polygon fill="#ffffff" points="76.25,440.833 533.75,440.833 76.25,440.833"/>
<polygon fill="#ffffff" points="533.75,440.833 533.75,440.833 76.25,440.833"/>
<polygon fill="#ffffff" points="76.25,440.833 533.75,440.833 76.25,325.833"/>
<polygon fill="#ffffff" points="533.75,440.833 533.75,325.833 76.25,325.833"/>
<polygon fill="#00ffff" points="76.25,440.833 76.25,440.833 84.4196,440.833"/>
<polygon fill="#00ffff" points="76.25,440.833 84.4196,440.833 84.4196,440.833"/>
<polygon fill="#00ffff" points="84.4196,440.833 84.4196,440.833 92.5893,440.833"/>
<polygon fill="#00ffff" points="84.4196,440.833 92.5893,440.833 92.5893,440.833"/>
<polygon fill="#00ffff" points="92.5893,440.833 92.5893,440.833 100.759,440.833"/>
<polygon fill="#00ffff" points="92.5893,440.833 100.759,440.833 100.759,440.833"/>
<polygon fill="#00ffff" points="100.759,440.833 100.759,440.833 108.929,440.833"/>
<polygon fill="#00ffff" points="100.759,440.833 108.929,440.833 108.929,440.833"/>
<polygon fill="#00ffff" points="108.929,440.833 108.929,440.833 117.098,440.833"/>
<polygon fill="#00ffff" points="108.929,440.833 117.098,440.833 117.098,440.833"/>
<polygon fill="#00ffff" points="117.098,440.833 117.098,440.833 125.268,440.833"/>
<polygon fill="#00ffff" points="117.098,440.833 125.268,440.833 125.268,440.833"/>
<polygon fill="#00ffff" points="125.268,440.833 125.268,440.833 133.438,440.833"/>
<polygon fill="#00ffff" points="125.268,440.833 133.438,440.833 133.438,440.833"/>
<polygon fill="#00ffff" points="133.438,440.833 133.438,440.833 141.607,440.833"/>
<polygon fill="#00ffff" points="133.438,440.833 141.607,440.833 141.607,440.833"/>
<polygon fill="#00ffff" points="141.607,440.833 141.607,440.833 149.777,440.833"/>
<polygon fill="#00ffff" points="141.607,440.833 149.777,440.833 149.777,440.833"/>
<polygon fill="#00ffff" points="149.777,440.833 149.777,440.833 157.946,440.833"/>
<polygon fill="#00ffff" points="149.777,440.833 157.946,440.833 157.946,440.833"/>
<polygon fill="#00ffff" points="157.946,440.833 157.946,440.833 166.116,440.833"/>
<polygon fill="#00ffff" points="157.946,440.833 166.116,440.833 166.116,440.833"/>
<polygon fill="#00ffff" points="166.116,440.833 166.116,440.833 174.286,440.833"/>
<polygon fill="#00ffff" points="166.116,440.833 174.286,440.833 174.286,440.833"/>
<polygon fill="#00ffff" points="174.286,440.833 174.286,440.833 182.455,440.833"/>
<polygon fill="#00ffff" points="174.286,440.833 182.455,440.833 182.455,440.833"/>
<polygon fill="#00ffff" points="182.455,440.833 182.455,440.833 190.625,440.833"/>
<polygon fill="#00ffff" points="182.455,440.833 190.625,440.833 190.625,440.833"/>
<polygon fill="#00ffff" points="190.625,440.833 190.625,440.833 198.795,440.833"/>
<polygon fill="#00ffff" points="190.625,440.833 198.795,440.833 198.795,440.833"/>
<polygon fill="#00ffff" points="198.795,440.833 198.795,440.833 206.964,440.833"/>
<polygon fill="#00ffff" points="198.795,440.833 206.964,440.833 206.964,440.833"/>
<polygon fill="#00ffff" points="206.964,440.833 206.964,440.833 215.134,440.833"/>
<polygon fill="#00ffff" points="206.964,440.833 215.134,440.833 215.134,440.833"/>
<polygon fill="#00ffff" points="215.134,440.833 215.134,440.833 223.304,440.833"/>
<polygon fill="#00ffff" points="215.134,440.833 223.304,440.833 223.304,440.833"/>
<polygon fill="#00ffff" points="223.304,440.833 223.304,440.833 231.473,440.833"/>
<polygon fill="#00ffff" points="223.304,440.833 231.473,440.833 231.473,440.833"/>
<polygon fill="#00ffff" points="231.473,440.833 231.473,440.833 239.643,440.833"/>
<polygon fill="#00ffff" points="231.473,440.833 239.643,440.833 239.643,440.833"/>
<polygon fill="#00ffff" points="239.643,440.833 239.643,440.833 247.812,440.833"/>
<polygon fill="#00ffff" points="239.643,440.833 247.812,440.833 247.812,440.833"/>
<polygon fill="#00ffff" points="247.812,440.833 247.812,440.833 255.982,440.833"/>
<polygon fill="#00ffff" points="247.812,440.833 255.982,440.833 255.982,440.833"/>
<polygon fill="#00ffff" points="255.982,440.833 255.982,440.833 264.152,440.833"/>
<polygon fill="#00ffff" points="255.982,440.833 264.152,440.833 264.152,440.833"/>
<polygon fill="#00ffff" points="264.152,440.833 264.152,440.833 272.321,440.833"/>
<polygon fill="#00ffff" points="264.152,440.833 272.321,440.833 272.321,440.833"/>
<polygon fill="#00ffff" points="272.321,440.833 272.321,440.833 280.491,440.833"/>
<polygon fill="#00ffff" points="272.321,440.833 280.491,440.833 280.491,440.833"/>
<polygon fill="#00ffff" points="280.491,440.833 280.491,440.833 288.661,440.833"/>
<polygon fill="#00ffff" points="280.491,440.833 288.661,440.833 288.661,440.833"/>
<polygon fill="#00ffff" points="288.661,440.833 288.661,440.833 296.83,440.833"/>
<polygon fill="#00ffff" points="288.661,440.833 296.83,440.833 296.83,440.833"/>
<polygon fill="#00ffff" points="296.83,440.833 296.83,440.833 305,440.833"/>
<polygon fill="#00ffff" points="296.83,440.833 305,440.833 305,440.833"/>
<polygon fill="#00ffff" points="305,440.833 305,440.833 313.17,440.833"/>
<polygon fill="#00ffff" points="305,440.833 313.17,440.833 313.17,440.833"/>
<polygon fill="#00ffff" points="313.17,440.833 313.17,440.833 321.339,440.833"/>
<polygon fill="#00ffff" points="313.17,440.833 321.339,440.833 321.339,440.833"/>
<polygon fill="#00ffff" points="321.339,440.833 321.339,440.833 329.509,440.833"/>
<polygon fill="#00ffff" points="321.339,440.833 329.509,440.833 329.509,440.833"/>
<polygon fill="#00ffff" points="329.509,440.833 329.509,440.833 337.679,440.833"/>
<polygon fill="#00ffff" points="329.509,440.833 337.679,440.833 337.679,440.833"/>
<polygon fill="#00ffff" points="337.679,440.833 337.679,440.833 345.848,440.833"/>
<polygon fill="#00ffff" points="337.679,440.833 345.848,440.833 345.848,440.833"/>
<polygon fill="#00ffff" points="345.848,440.833 345.848,440.833 354.018,440.833"/>
<polygon fill="#00ffff" points="345.848,440.833 354.018,440.833 354.018,440.833"/>
<polygon fill="#00ffff" points="354.018,440.833 354.018,440.833 362.188,440.833"/>
<polygon fill="#00ffff" points="354.018,440.833 362.188,440.833 362.188,440.833"/>
<polygon fill="#00ffff" points="362.188,440.833 362.188,440.833 370.357,440.833"/>
<polygon fill="#00ffff" points="362.188,440.833 370.357,440.833 370.357,440.833"/>
<polygon fill="#00ffff" points="370.357,440.833 370.357,440.833 378.527,440.833"/>
<polygon fill="#00ffff" points="370.357,440.833 378.527,440.833 378.527,440.833"/>
<polygon fill="#00ffff" points="378.527,440.833 378.527,440.833 386.696,440.833"/>
<polygon fill="#00ffff" points="378.527,440.833 386.696,440.833 386.696,440.833"/>
<polygon fill="#00ffff" points="386.696,440.833 386.696,440.833 394.866,440.833"/>
<polygon fill="#00ffff" points="386.696,440.833 394.866,440.833 394.866,440.833"/>
<polygon fill="#00ffff" points="394.866,440.833 394.866,440.833 403.036,440.833"/>
<polygon fill="#00ffff" points="394.866,440.833 403.036,440.833 403.036,440.833"/>
<polygon fill="#00ffff" points="403.036,328.088 403.036,440.833 411.205,328.088"/>
<polygon fill="#00ffff" points="403.036,440.833 411.205,440.833 411.205,328.088"/>
<polygon fill="#00ffff" points="411.205,440.833 411.205,440.833 419.375,440.833"/>
<polygon fill="#00ffff" points="411.205,440.833 419.375,440.833 419.375,440.833"/>
<polygon fill="#00ffff" points="419.375,440.833 419.375,440.833 427.545,440.833"/>
<polygon fill="#00ffff" points="419.375,440.833 427.545,440.833 427.545,440.833"/>
<polygon fill="#00ffff" points="427.545,440.833 427.545,440.833 435.714,440.833"/>
<polygon fill="#00ffff" points="427.545,440.833 435.714,440.833 435.714,440.833"/>
<polygon fill="#00ffff" points="435.714,440.833 435.714,440.833 443.884,440.833"/>
<polygon fill="#00ffff" points="435.714,440.833 443.884,440.833 443.884,440.833"/>
<polygon fill="#00ffff" points="443.884,440.833 443.884,440.833 452.054,440.833"/>
<polygon fill="#00ffff" points="443.884,440.833 452.054,440.833 452.054,440.833"/>
<polygon fill="#00ffff" points="452.054,440.833 452.054,440.833 460.223,440.833"/>
<polygon fill="#00ffff" points="452.054,440.833 460.223,440.833 460.223,440.833"/>
<polygon fill="#00ffff" points="460.223,440.833 460.223,440.833 468.393,440.833"/>
<polygon fill="#00ffff" points="460.223,440.833 468.393,440.833 468.393,440.833"/>
<polygon fill="#00ffff" points="468.393,440.833 468.393,440.833 476.562,440.833"/>
<polygon fill="#00ffff" points="468.393,440.833 476.562,440.833 476.562,440.833"/>
<polygon fill="#00ffff" points="476.562,440.833 476.562,440.833 484.732,440.833"/>
<polygon fill="#00ffff" points="476.562,440.833 484.732,440.833 484.732,440.833"/>
<polygon fill="#00ffff" points="484.732,440.833 484.732,440.833 492.902,440.833"/>
<polygon fill="#00ffff" points="484.732,440.833 492.902,440.833 492.902,440.833"/>
<polygon fill="#00ffff" points="492.902,440.833 492.902,440.833 501.071,440.833"/>
<polygon fill="#00ffff" points="492.902,440.833 501.071,440.833 501.071,440.833"/>
<polygon fill="#00ffff" points="501.071,440.833 501.071,440.833 509.241,440.833"/>
<polygon fill="#00ffff" points="501.071,440.833 509.241,440.833 509.241,440.833"/>
<polygon fill="#00ffff" points="509.241,440.833 509.241,440.833 517.411,440.833"/>
<polygon fill="#00ffff" points="509.241,440.833 517.411,440.833 517.411,440.833"/>
<polyline fill="none" stroke="#000000" stroke-width="0.5" points="76.25,440.833 76.25,440.833 84.4196,440.833 84.4196,440.833 76.25,440.833"/>
<polyline fill="none" stroke="#000000" stroke-width="0.5" points="84.4196,440.833 84.4196,440.833 92.5893,440.833 92.5893,440.833 84.4196,440.833"/>
<polyline fill="none" stroke="#000000" stroke-width="0.5" points="92.5893,440.833 92.5893,440.833 100.759,440.833 100.759,440.833 92.5893,440.833"/>
<polyline fill="none" stroke="#000000" stroke-width="0.5" points="100.759,440.833 100.759,440.833 108.929,440.833 108.929,440.833 100.759,440.833"/>
<polyline fill="none" stroke="#000000" stroke-width="0.5" points="108.929,440.833 108.929,440.833 117.098,440.833 117.098,440.833 108.929,440.833"/>
<polyline fill="none" stroke="#000000" stroke-width="0.5" points="117.098,440.833 117.098,440.833 125.268,440.833 125.268,440.833 117.098,440.833"/>
<polyline fill="none" stroke="#000000" stroke-width="0.5" points="125.268,440.833 125.268,440.833 133.438,440.833 133.438,440.833 125.268,440.833"/>
<polyline fill="none" stroke="#000000" stroke-width="0.5" points="133.438,440.833 133.438,440.833 141.607,440.833 141.607,440.833 133.438,440.833"/>
<polyline fill="none" stroke="#000000" stroke-width="0.5" points="141.607,440.833 141.607,440.833 149.777,440.833 149.777,440.833 141.607,440.833"/>
<polyline fill="none" stroke="#000000" stroke-width="0.5" points="149.777,440.833 149.777,440.833 157.946,440.833 157.946,440.833 149.777,440.833"/>
<polyline fill="none" stroke="#000000" stroke-width="0.5" points="157.946,440.833 157.946,440.833 166.116,440.833 166.116,440.833 157.946,440.833"/>
<polyline fill="none" stroke="#000000" stroke-width="0.5" points="166.116,440.833 166.116,440.833 174.286,440.833 174.286,440.833 166.116,440.833"/>
<polyline fill="none" stroke="#000000" stroke-width="0.5" points="174.286,440.833 174.286,440.833 182.455,440.833 182.455,440.833 174.286,440.833"/>
<polyline fill="none" stroke="#000000" stroke-width="0.5" points="182.455,440.833 182.455,440.833 190.625,440.833 190.625,440.833 182.455,440.833"/>
<polyline fill="none" stroke="#000000" stroke-width="0.5" points="190.625,440.833 190.625,440.833 198.795,440.833 198.795,440.833 190.625,440.833"/>
<polyline fill="none" stroke="#000000" stroke-width="0.5" points="198.795,440.833 198.795,440.833 206.964,440.833 206.964,440.833 198.795,440.833"/>
<polyline fill="none" stroke="#000000" stroke-width="0.5" points="206.964,440.833 206.964,440.833 215.134,440.833 215.134,440.833 206.964,440.833"/>
<polyline fill="none" stroke="#000000" stroke-width="0.5" points="215.134,440.833 215.134,440.833 223.304,440.833 223.304,440.833 215.134,440.833"/>
<polyline fill="none" stroke="#000000" stroke-width="0.5" points="223.304,440.833 223.304,440.833 231.473,440.833 231.473,440.833 223.304,440.833"/>
<polyline fill="none" stroke="#000000" stroke-width="0.5" points="231.473,440.833 231.473,440.833 239.643,440.833 239.643,440.833 231.473,440.833"/>
<polyline fill="none" stroke="#000000" stroke-width="0.5" points="239.643,440.833 239.643,440.833 247.812,440.833 247.812,440.833 239.643,440.833"/>
<polyline fill="none" stroke="#000000" stroke-width="0.5" points="247.812,440.833 247.812,440.833 255.982,440.833 255.982,440.833 247.812,440.833"/>
<polyline fill="none" stroke="#000000" stroke-width="0.5" points="255.982,440.833 255.982,440.833 264.152,440.833 264.152,440.833 255.982,440.833"/>
<polyline fill="none" stroke="#000000" stroke-width="0.5" points="264.152,440.833 264.152,440.833 272.321,440.833 272.321,440.833 264.152,440.833"/>
<polyline fill="none" stroke="#000000" stroke-width="0.5" points="272.321,440.833 272.321,440.833 280.491,440.833 280.491,440.833 272.321,440.833"/>
<polyline fill="none" stroke="#000000" stroke-width="0.5" points="280.491,440.833 280.491,440.833 288.661,440.833 288.661,440.833 280.491,440.833"/>
<polyline fill="none" stroke="#000000" stroke-width="0.5" points="288.661,440.833 288.661,440.833 296.83,440.833 296.83,440.833 288.661,440.833"/>
<polyline fill="none" stroke="#000000" stroke-width="0.5" points="296.83,440.833 296.83,440.833 305,440.833 305,440.833 296.83,440.833"/>
<polyline fill="none" stroke="#000000" stroke-width="0.5" points="305,440.833 305,440.833 313.17,440.833 313.17,440.833 305,440.833"/>
<polyline fill="none" stroke="#000000" stroke-width="0.5" points="313.17,440.833 313.17,440.833 321.339,440.833 321.339,440.833 313.17,440.833"/>
<polyline fill="none" stroke="#000000" stroke-width="0.5" points="321.339,440.833 321.339,440.833 329.509,440.833 329.509,440.833 321.339,440.833"/>
<polyline fill="none" stroke="#000000" stroke-width="0.5" points="329.509,440.833 329.509,440.833 337.679,440.833 337.679,440.833 329.509,440.833"/>
<polyline fill="none" stroke="#000000" stroke-width="0.5" points="337.679,440.833 337.679,440.833 345.848,440.833 345.848,440.833 337.679,440.833"/>
<polyline fill="none" stroke="#000000" stroke-width="0.5" points="345.848,440.833 345.848,440.833 354.018,440.833 354.018,440.833 345.848,440.833"/>
<polyline fill="none" stroke="#000000" stroke-width="0.5" points="354.018,440.833 354.018,440.833 362.188,440.833 362.188,440.833 354.018,440.833"/>
<polyline fill="none" stroke="#000000" stroke-width="0.5" points="362.188,440.833 362.188,440.833 370.357,440.833 370.357,440.833 362.188,440.833"/>
<polyline fill="none" stroke="#000000" stroke-width="0.5" points="370.357,440.833 370.357,440.833 378.527,440.833 378.527,440.833 370.357,440.833"/>
<polyline fill="none" stroke="#000000" stroke-width="0.5" points="378.527,440.833 378.527,440.833 386.696,440.833 386.696,440.833 378.527,440.833"/>
<polyline fill="none" stroke="#000000" stroke-width="0.5" points="386.696,440.833 386.696,440.833 394.866,440.833 394.866,440.833 386.696,440.833"/>
<polyline fill="none" stroke="#000000" stroke-width="0.5" points="394.866,440.833 394.866,440.833 403.036,440.833 403.036,440.833 394.866,440.833"/>
<polyline fill="none" stroke="#000000" stroke-width="0.5" points="403.036,328.088 403.036,440.833 411.205,440.833 411.205,328.088 403.036,328.088"/>
<polyline fill="none" stroke="#000000" stroke-width="0.5" points="411.205,440.833 411.205,440.833 419.375,440.833 419.375,440.833 411.205,440.833"/>
<polyline fill="none" stroke="#000000" stroke-width="0.5" points="419.375,440.833 419.375,440.833 427.545,440.833 427.545,440.833 419.375,440.833"/>
<polyline fill="none" stroke="#000000" stroke-width="0.5" points="427.545,440.833 427.545,440.833 435.714,440.833 435.714,440.833 427.545,440.833"/>
<polyline fill="none" stroke="#000000" stroke-width="0.5" points="435.714,440.833 435.714,440.833 443.884,440.833 443.884,440.833 435.714,440.833"/>
<polyline fill="none" stroke="#000000" stroke-width="0.5" points="443.884,440.833 443.884,440.833 452.054,440.833 452.054,440.833 443.884,440.833"/>
<polyline fill="none" stroke="#000000" stroke-width="0.5" points="452.054,440.833 452.054,440.833 460.223,440.833 460.223,440.833 452.054,440.833"/>
<polyline fill="none" stroke="#000000" stroke-width="0.5" points="460.223,440.833 460.223,440.833 468.393,440.833 468.393,440.833 460.223,440.833"/>
<polyline fill="none" stroke="#000000" stroke-width="0.5" points="468.393,440.833 468.393,440.833 476.562,440.833 476.562,440.833 468.393,440.833"/>
<polyline fill="none" stroke="#000000" stroke-width="0.5" points="476.562,440.833 476.562,440.833 484.732,440.833 484.732,440.833 476.562,440.833"/>
<polyline fill="none" stroke="#000000" stroke-width="0.5" points="484.732,440.833 484.732,440.833 492.902,440.833 492.902,440.833 484.732,440.833"/>
<polyline fill="none" stroke="#000000" stroke-width="0.5" points="492.902,440.833 492.902,440.833 501.071,440.833 501.071,440.833 492.902,440.833"/>
<polyline fill="none" stroke="#000000" stroke-width="0.5" points="501.071,440.833 501.071,440.833 509.241,440.833 509.241,440.833 501.071,440.833"/>
<polyline fill="none" stroke="#000000" stroke-width="0.5" points="509.241,440.833 509.241,440.833 517.411,440.833 517.411,440.833 509.241,440.833"/>
<polyline fill="none" stroke="#ff0000" stroke-width="0.5" points="80.3348,325.832 80.3348,440.833"/>
<polygon fill="#ff0000" points="80.3348,440.833 80.5982,440.11 80.0714,440.11"/>
<polyline fill="none" stroke="#000000" stroke-width="0.5" points="76.25,440.833 76.25,325.833"/>
<polyline fill="none" stroke="#000000" stroke-width="0.5" points="76.25,440.833 69.395,440.833"/>
<polyline fill="none" stroke="#000000" stroke-width="0.5" points="76.25,418.284 69.395,418.284"/>
<polyline fill="none" stroke="#000000" stroke-width="0.5" points="76.25,395.735 69.395,395.735"/>
<polyline fill="none" stroke="#000000" stroke-width="0.5" points="76.25,373.186 69.395,373.186"/>
<polyline fill="none" stroke="#000000" stroke-width="0.5" points="76.25,350.637 69.395,350.637"/>
<polyline fill="none" stroke="#000000" stroke-width="0.5" points="76.25,328.088 69.395,328.088"/>
<polyline fill="none" stroke="#000000" stroke-width="0.5" points="76.25,435.196 72.137,435.196"/>
<polyline fill="none" stroke="#000000" stroke-width="0.5" points="76.25,429.559 72.137,429.559"/>
<polyline fill="none" stroke="#000000" stroke-width="0.5" points="76.25,423.922 72.137,423.922"/>
<polyline fill="none" stroke="#000000" stroke-width="0.5" points="76.25,412.647 72.137,412.647"/>
<polyline fill="none" stroke="#000000" stroke-width="0.5" points="76.25,407.01 72.137,407.01"/>
<polyline fill="none" stroke="#000000" stroke-width="0.5" points="76.25,401.373 72.137,401.373"/>
<polyline fill="none" stroke="#000000" stroke-width="0.5" points="76.25,390.098 72.137,390.098"/>
<polyline fill="none" stroke="#000000" stroke-width="0.5" points="76.25,384.461 72.137,384.461"/>
<polyline fill="none" stroke="#000000" stroke-width="0.5" points="76.25,378.824 72.137,378.824"/>
<polyline fill="none" stroke="#000000" stroke-width="0.5" points="76.25,367.549 72.137,367.549"/>
<polyline fill="none" stroke="#000000" stroke-width="0.5" points="76.25,361.912 72.137,361.912"/>
<polyline fill="none" stroke="#000000" stroke-width="0.5" points="76.25,356.275 72.137,356.275"/>
<polyline fill="none" stroke="#000000" stroke-width="0.5" points="76.25,345 72.137,345"/>
<polyline fill="none" stroke="#000000" stroke-width="0.5" points="76.25,339.363 72.137,339.363"/>
<polyline fill="none" stroke="#000000" stroke-width="0.5" points="76.25,333.725 72.137,333.725"/>
<text fill="#000000" style="stroke:none" x="39" y="446" transform="rotate(-0, 39, 446)" font-size="10" font-family="SansSerif" font-style="normal" font-weight="normal">0.000</text>
<text fill="#000000" style="stroke:none" x="40" y="423" transform="rotate(-0, 40, 423)" font-size="10" font-family="SansSerif" font-style="normal" font-weight="normal">0.002</text>
<text fill="#000000" style="stroke:none" x="39" y="401" transform="rotate(-0, 39, 401)" font-size="10" font-family="SansSerif" font-style="normal" font-weight="normal">0.004</text>
<text fill="#000000" style="stroke:none" x="39" y="378" transform="rotate(-0, 39, 378)" font-size="10" font-family="SansSerif" font-style="normal" font-weight="normal">0.006</text>
<text fill="#000000" style="stroke:none" x="39" y="356" transform="rotate(-0, 39, 356)" font-size="10" font-family="SansSerif" font-style="normal" font-weight="normal">0.008</text>
<text fill="#000000" style="stroke:none" x="39" y="333" transform="rotate(-0, 39, 333)" font-size="10" font-family="SansSerif" font-style="normal" font-weight="normal">0.010</text>
<polyline fill="none" stroke="#000000" stroke-width="0.5" points="76.25,440.833 533.75,440.833"/>
<polyline fill="none" stroke="#000000" stroke-width="0.5" points="153.862,440.833 153.862,443.833"/>
<polyline fill="none" stroke="#000000" stroke-width="0.5" points="235.558,440.833 235.558,443.833"/>
<polyline fill="none" stroke="#000000" stroke-width="0.5" points="317.254,440.833 317.254,443.833"/>
<polyline fill="none" stroke="#000000" stroke-width="0.5" points="398.951,440.833 398.951,443.833"/>
<polyline fill="none" stroke="#000000" stroke-width="0.5" points="480.647,440.833 480.647,443.833"/>
<polyline fill="none" stroke="#000000" stroke-width="0.5" points="92.5893,440.833 92.5893,442.633"/>
<polyline fill="none" stroke="#000000" stroke-width="0.5" points="113.013,440.833 113.013,442.633"/>
<polyline fill="none" stroke="#000000" stroke-width="0.5" points="133.438,440.833 133.438,442.633"/>
<polyline fill="none" stroke="#000000" stroke-width="0.5" points="174.286,440.833 174.286,442.633"/>
<polyline fill="none" stroke="#000000" stroke-width="0.5" points="194.71,440.833 194.71,442.633"/>
<polyline fill="none" stroke="#000000" stroke-width="0.5" points="215.134,440.833 215.134,442.633"/>
<polyline fill="none" stroke="#000000" stroke-width="0.5" points="255.982,440.833 255.982,442.633"/>
<polyline fill="none" stroke="#000000" stroke-width="0.5" points="276.406,440.833 276.406,442.633"/>
<polyline fill="none" stroke="#000000" stroke-width="0.5" points="296.83,440.833 296.83,442.633"/>
<polyline fill="none" stroke="#000000" stroke-width="0.5" points="337.679,440.833 337.679,442.633"/>
<polyline fill="none" stroke="#000000" stroke-width="0.5" points="358.103,440.833 358.103,442.633"/>
<polyline fill="none" stroke="#000000" stroke-width="0.5" points="378.527,440.833 378.527,442.633"/>
<polyline fill="none" stroke="#000000" stroke-width="0.5" points="419.375,440.833 419.375,442.633"/>
<polyline fill="none" stroke="#000000" stroke-width="0.5" points="439.799,440.833 439.799,442.633"/>
<polyline fill="none" stroke="#000000" stroke-width="0.5" points="460.223,440.833 460.223,442.633"/>
<polyline fill="none" stroke="#000000" stroke-width="0.5" points="501.071,440.833 501.071,442.633"/>
<polyline fill="none" stroke="#000000" stroke-width="0.5" points="521.496,440.833 521.496,442.633"/>
<text fill="#000000" style="stroke:none" x="147" y="455" transform="rotate(-0, 147, 455)" font-size="10" font-family="SansSerif" font-style="normal" font-weight="normal">10</text>
<text fill="#000000" style="stroke:none" x="229" y="455" transform="rotate(-0, 229, 455)" font-size="10" font-family="SansSerif" font-style="normal" font-weight="normal">20</text>
<text fill="#000000" style="stroke:none" x="311" y="455" transform="rotate(-0, 311, 455)" font-size="10" font-family="SansSerif" font-style="normal" font-weight="normal">30</text>
<text fill="#000000" style="stroke:none" x="392" y="455" transform="rotate(-0, 392, 455)" font-size="10" font-family="SansSerif" font-style="normal" font-weight="normal">40</text>
<text fill="#000000" style="stroke:none" x="474" y="455" transform="rotate(-0, 474, 455)" font-size="10" font-family="SansSerif" font-style="normal" font-weight="normal">50</text>
<text fill="#000000" style="stroke:none" x="238" y="316" transform="rotate(0, 238, 316)" font-size="10" font-family="SansSerif" font-style="normal" font-weight="normal">Cpu time (total 0.01 sec)</text>
</g>
</svg>
