<?xml version="1.0" encoding="UTF-8" standalone="no"?>
<svg xmlns="http://www.w3.org/2000/svg"
     xmlns:xlink="http://www.w3.org/1999/xlink"
     width="610px" height="460px" viewBox="0 0 610 460"
     style="stroke:none">
<title>Graphic window number 2</title>
<desc>
Creator: GL2PS 1.3.2, (C) 1999-2006 Christophe Geuzaine (geuz@geuz.org)
For: Scilab
CreationDate: Mon Aug 30 21:31:16 2010
</desc>
<defs>
</defs>
<polygon fill="#ffffff" points="0,0 610,0 610,460 0,460"/>
<g>
<polygon fill="#ffffff" points="76.25,134.167 76.25,19.1667 76.25,134.167"/>
<polygon fill="#ffffff" points="76.25,19.1667 76.25,19.1667 76.25,134.167"/>
<polygon fill="#ffffff" points="76.25,134.167 533.75,134.167 76.25,134.167"/>
<polygon fill="#ffffff" points="533.75,134.167 533.75,134.167 76.25,134.167"/>
<polygon fill="#ffffff" points="76.25,134.167 533.75,134.167 76.25,19.1667"/>
<polygon fill="#ffffff" points="533.75,134.167 533.75,19.1667 76.25,19.1667"/>
<polygon fill="#0000ff" points="76.25,122.892 76.25,134.167 90.1136,122.892"/>
<polygon fill="#0000ff" points="76.25,134.167 90.1136,134.167 90.1136,122.892"/>
<polygon fill="#0000ff" points="90.1136,122.892 90.1136,134.167 103.977,122.892"/>
<polygon fill="#0000ff" points="90.1136,134.167 103.977,134.167 103.977,122.892"/>
<polygon fill="#0000ff" points="103.977,122.892 103.977,134.167 117.841,122.892"/>
<polygon fill="#0000ff" points="103.977,134.167 117.841,134.167 117.841,122.892"/>
<polygon fill="#0000ff" points="117.841,122.892 117.841,134.167 131.705,122.892"/>
<polygon fill="#0000ff" points="117.841,134.167 131.705,134.167 131.705,122.892"/>
<polygon fill="#0000ff" points="131.705,122.892 131.705,134.167 145.568,122.892"/>
<polygon fill="#0000ff" points="131.705,134.167 145.568,134.167 145.568,122.892"/>
<polygon fill="#0000ff" points="145.568,32.6961 145.568,134.167 159.432,32.6961"/>
<polygon fill="#0000ff" points="145.568,134.167 159.432,134.167 159.432,32.6961"/>
<polygon fill="#0000ff" points="159.432,32.6961 159.432,134.167 173.295,32.6961"/>
<polygon fill="#0000ff" points="159.432,134.167 173.295,134.167 173.295,32.6961"/>
<polygon fill="#0000ff" points="173.295,32.6961 173.295,134.167 187.159,32.6961"/>
<polygon fill="#0000ff" points="173.295,134.167 187.159,134.167 187.159,32.6961"/>
<polygon fill="#0000ff" points="187.159,32.6961 187.159,134.167 201.023,32.6961"/>
<polygon fill="#0000ff" points="187.159,134.167 201.023,134.167 201.023,32.6961"/>
<polygon fill="#0000ff" points="201.023,32.6961 201.023,134.167 214.886,32.6961"/>
<polygon fill="#0000ff" points="201.023,134.167 214.886,134.167 214.886,32.6961"/>
<polygon fill="#0000ff" points="214.886,32.6961 214.886,134.167 228.75,32.6961"/>
<polygon fill="#0000ff" points="214.886,134.167 228.75,134.167 228.75,32.6961"/>
<polygon fill="#0000ff" points="228.75,32.6961 228.75,134.167 242.614,32.6961"/>
<polygon fill="#0000ff" points="228.75,134.167 242.614,134.167 242.614,32.6961"/>
<polygon fill="#0000ff" points="242.614,32.6961 242.614,134.167 256.477,32.6961"/>
<polygon fill="#0000ff" points="242.614,134.167 256.477,134.167 256.477,32.6961"/>
<polygon fill="#0000ff" points="256.477,32.6961 256.477,134.167 270.341,32.6961"/>
<polygon fill="#0000ff" points="256.477,134.167 270.341,134.167 270.341,32.6961"/>
<polygon fill="#0000ff" points="270.341,32.6961 270.341,134.167 284.205,32.6961"/>
<polygon fill="#0000ff" points="270.341,134.167 284.205,134.167 284.205,32.6961"/>
<polygon fill="#0000ff" points="284.205,32.6961 284.205,134.167 298.068,32.6961"/>
<polygon fill="#0000ff" points="284.205,134.167 298.068,134.167 298.068,32.6961"/>
<polygon fill="#0000ff" points="298.068,122.892 298.068,134.167 311.932,122.892"/>
<polygon fill="#0000ff" points="298.068,134.167 311.932,134.167 311.932,122.892"/>
<polygon fill="#0000ff" points="311.932,122.892 311.932,134.167 325.795,122.892"/>
<polygon fill="#0000ff" points="311.932,134.167 325.795,134.167 325.795,122.892"/>
<polygon fill="#0000ff" points="325.795,32.6961 325.795,134.167 339.659,32.6961"/>
<polygon fill="#0000ff" points="325.795,134.167 339.659,134.167 339.659,32.6961"/>
<polygon fill="#0000ff" points="339.659,32.6961 339.659,134.167 353.523,32.6961"/>
<polygon fill="#0000ff" points="339.659,134.167 353.523,134.167 353.523,32.6961"/>
<polygon fill="#0000ff" points="353.523,32.6961 353.523,134.167 367.386,32.6961"/>
<polygon fill="#0000ff" points="353.523,134.167 367.386,134.167 367.386,32.6961"/>
<polygon fill="#0000ff" points="367.386,32.6961 367.386,134.167 381.25,32.6961"/>
<polygon fill="#0000ff" points="367.386,134.167 381.25,134.167 381.25,32.6961"/>
<polygon fill="#0000ff" points="381.25,32.6961 381.25,134.167 395.114,32.6961"/>
<polygon fill="#0000ff" points="381.25,134.167 395.114,134.167 395.114,32.6961"/>
<polygon fill="#0000ff" points="395.114,32.6961 395.114,134.167 408.977,32.6961"/>
<polygon fill="#0000ff" points="395.114,134.167 408.977,134.167 408.977,32.6961"/>
<polygon fill="#0000ff" points="408.977,122.892 408.977,134.167 422.841,122.892"/>
<polygon fill="#0000ff" points="408.977,134.167 422.841,134.167 422.841,122.892"/>
<polygon fill="#0000ff" points="422.841,122.892 422.841,134.167 436.705,122.892"/>
<polygon fill="#0000ff" points="422.841,134.167 436.705,134.167 436.705,122.892"/>
<polygon fill="#0000ff" points="436.705,21.4216 436.705,134.167 450.568,21.4216"/>
<polygon fill="#0000ff" points="436.705,134.167 450.568,134.167 450.568,21.4216"/>
<polygon fill="#0000ff" points="450.568,21.4216 450.568,134.167 464.432,21.4216"/>
<polygon fill="#0000ff" points="450.568,134.167 464.432,134.167 464.432,21.4216"/>
<polygon fill="#0000ff" points="464.432,122.892 464.432,134.167 478.295,122.892"/>
<polygon fill="#0000ff" points="464.432,134.167 478.295,134.167 478.295,122.892"/>
<polygon fill="#0000ff" points="478.295,122.892 478.295,134.167 492.159,122.892"/>
<polygon fill="#0000ff" points="478.295,134.167 492.159,134.167 492.159,122.892"/>
<polygon fill="#0000ff" points="492.159,122.892 492.159,134.167 506.023,122.892"/>
<polygon fill="#0000ff" points="492.159,134.167 506.023,134.167 506.023,122.892"/>
<polyline fill="none" stroke="#000000" stroke-width="0.5" points="76.25,122.892 76.25,134.167 90.1136,134.167 90.1136,122.892 76.25,122.892"/>
<polyline fill="none" stroke="#000000" stroke-width="0.5" points="90.1136,122.892 90.1136,134.167 103.977,134.167 103.977,122.892 90.1136,122.892"/>
<polyline fill="none" stroke="#000000" stroke-width="0.5" points="103.977,122.892 103.977,134.167 117.841,134.167 117.841,122.892 103.977,122.892"/>
<polyline fill="none" stroke="#000000" stroke-width="0.5" points="117.841,122.892 117.841,134.167 131.705,134.167 131.705,122.892 117.841,122.892"/>
<polyline fill="none" stroke="#000000" stroke-width="0.5" points="131.705,122.892 131.705,134.167 145.568,134.167 145.568,122.892 131.705,122.892"/>
<polyline fill="none" stroke="#000000" stroke-width="0.5" points="145.568,32.6961 145.568,134.167 159.432,134.167 159.432,32.6961 145.568,32.6961"/>
<polyline fill="none" stroke="#000000" stroke-width="0.5" points="159.432,32.6961 159.432,134.167 173.295,134.167 173.295,32.6961 159.432,32.6961"/>
<polyline fill="none" stroke="#000000" stroke-width="0.5" points="173.295,32.6961 173.295,134.167 187.159,134.167 187.159,32.6961 173.295,32.6961"/>
<polyline fill="none" stroke="#000000" stroke-width="0.5" points="187.159,32.6961 187.159,134.167 201.023,134.167 201.023,32.6961 187.159,32.6961"/>
<polyline fill="none" stroke="#000000" stroke-width="0.5" points="201.023,32.6961 201.023,134.167 214.886,134.167 214.886,32.6961 201.023,32.6961"/>
<polyline fill="none" stroke="#000000" stroke-width="0.5" points="214.886,32.6961 214.886,134.167 228.75,134.167 228.75,32.6961 214.886,32.6961"/>
<polyline fill="none" stroke="#000000" stroke-width="0.5" points="228.75,32.6961 228.75,134.167 242.614,134.167 242.614,32.6961 228.75,32.6961"/>
<polyline fill="none" stroke="#000000" stroke-width="0.5" points="242.614,32.6961 242.614,134.167 256.477,134.167 256.477,32.6961 242.614,32.6961"/>
<polyline fill="none" stroke="#000000" stroke-width="0.5" points="256.477,32.6961 256.477,134.167 270.341,134.167 270.341,32.6961 256.477,32.6961"/>
<polyline fill="none" stroke="#000000" stroke-width="0.5" points="270.341,32.6961 270.341,134.167 284.205,134.167 284.205,32.6961 270.341,32.6961"/>
<polyline fill="none" stroke="#000000" stroke-width="0.5" points="284.205,32.6961 284.205,134.167 298.068,134.167 298.068,32.6961 284.205,32.6961"/>
<polyline fill="none" stroke="#000000" stroke-width="0.5" points="298.068,122.892 298.068,134.167 311.932,134.167 311.932,122.892 298.068,122.892"/>
<polyline fill="none" stroke="#000000" stroke-width="0.5" points="311.932,122.892 311.932,134.167 325.795,134.167 325.795,122.892 311.932,122.892"/>
<polyline fill="none" stroke="#000000" stroke-width="0.5" points="325.795,32.6961 325.795,134.167 339.659,134.167 339.659,32.6961 325.795,32.6961"/>
<polyline fill="none" stroke="#000000" stroke-width="0.5" points="339.659,32.6961 339.659,134.167 353.523,134.167 353.523,32.6961 339.659,32.6961"/>
<polyline fill="none" stroke="#000000" stroke-width="0.5" points="353.523,32.6961 353.523,134.167 367.386,134.167 367.386,32.6961 353.523,32.6961"/>
<polyline fill="none" stroke="#000000" stroke-width="0.5" points="367.386,32.6961 367.386,134.167 381.25,134.167 381.25,32.6961 367.386,32.6961"/>
<polyline fill="none" stroke="#000000" stroke-width="0.5" points="381.25,32.6961 381.25,134.167 395.114,134.167 395.114,32.6961 381.25,32.6961"/>
<polyline fill="none" stroke="#000000" stroke-width="0.5" points="395.114,32.6961 395.114,134.167 408.977,134.167 408.977,32.6961 395.114,32.6961"/>
<polyline fill="none" stroke="#000000" stroke-width="0.5" points="408.977,122.892 408.977,134.167 422.841,134.167 422.841,122.892 408.977,122.892"/>
<polyline fill="none" stroke="#000000" stroke-width="0.5" points="422.841,122.892 422.841,134.167 436.705,134.167 436.705,122.892 422.841,122.892"/>
<polyline fill="none" stroke="#000000" stroke-width="0.5" points="436.705,21.4216 436.705,134.167 450.568,134.167 450.568,21.4216 436.705,21.4216"/>
<polyline fill="none" stroke="#000000" stroke-width="0.5" points="450.568,21.4216 450.568,134.167 464.432,134.167 464.432,21.4216 450.568,21.4216"/>
<polyline fill="none" stroke="#000000" stroke-width="0.5" points="464.432,122.892 464.432,134.167 478.295,134.167 478.295,122.892 464.432,122.892"/>
<polyline fill="none" stroke="#000000" stroke-width="0.5" points="478.295,122.892 478.295,134.167 492.159,134.167 492.159,122.892 478.295,122.892"/>
<polyline fill="none" stroke="#000000" stroke-width="0.5" points="492.159,122.892 492.159,134.167 506.023,134.167 506.023,122.892 492.159,122.892"/>
<polyline fill="none" stroke="#ff0000" stroke-width="0.5" points="83.1818,19.1655 83.1818,134.167"/>
<polygon fill="#ff0000" points="83.1818,134.167 83.6288,132.939 82.7348,132.939"/>
<polyline fill="none" stroke="#000000" stroke-width="0.5" points="76.25,134.167 76.25,19.1667"/>
<polyline fill="none" stroke="#000000" stroke-width="0.5" points="76.25,134.167 69.395,134.167"/>
<polyline fill="none" stroke="#000000" stroke-width="0.5" points="76.25,111.618 69.395,111.618"/>
<polyline fill="none" stroke="#000000" stroke-width="0.5" points="76.25,89.0686 69.395,89.0686"/>
<polyline fill="none" stroke="#000000" stroke-width="0.5" points="76.25,66.5197 69.395,66.5197"/>
<polyline fill="none" stroke="#000000" stroke-width="0.5" points="76.25,43.9706 69.395,43.9706"/>
<polyline fill="none" stroke="#000000" stroke-width="0.5" points="76.25,21.4216 69.395,21.4216"/>
<polyline fill="none" stroke="#000000" stroke-width="0.5" points="76.25,128.529 72.137,128.529"/>
<polyline fill="none" stroke="#000000" stroke-width="0.5" points="76.25,122.892 72.137,122.892"/>
<polyline fill="none" stroke="#000000" stroke-width="0.5" points="76.25,117.255 72.137,117.255"/>
<polyline fill="none" stroke="#000000" stroke-width="0.5" points="76.25,105.98 72.137,105.98"/>
<polyline fill="none" stroke="#000000" stroke-width="0.5" points="76.25,100.343 72.137,100.343"/>
<polyline fill="none" stroke="#000000" stroke-width="0.5" points="76.25,94.7059 72.137,94.7059"/>
<polyline fill="none" stroke="#000000" stroke-width="0.5" points="76.25,83.4314 72.137,83.4314"/>
<polyline fill="none" stroke="#000000" stroke-width="0.5" points="76.25,77.7941 72.137,77.7941"/>
<polyline fill="none" stroke="#000000" stroke-width="0.5" points="76.25,72.1569 72.137,72.1569"/>
<polyline fill="none" stroke="#000000" stroke-width="0.5" points="76.25,60.8824 72.137,60.8824"/>
<polyline fill="none" stroke="#000000" stroke-width="0.5" points="76.25,55.2451 72.137,55.2451"/>
<polyline fill="none" stroke="#000000" stroke-width="0.5" points="76.25,49.6079 72.137,49.6079"/>
<polyline fill="none" stroke="#000000" stroke-width="0.5" points="76.25,38.3334 72.137,38.3334"/>
<polyline fill="none" stroke="#000000" stroke-width="0.5" points="76.25,32.6961 72.137,32.6961"/>
<polyline fill="none" stroke="#000000" stroke-width="0.5" points="76.25,27.0588 72.137,27.0588"/>
<text fill="#000000" style="stroke:none" x="60" y="139" transform="rotate(-0, 60, 139)" font-size="10" font-family="SansSerif" font-style="normal" font-weight="normal">0</text>
<text fill="#000000" style="stroke:none" x="61" y="117" transform="rotate(-0, 61, 117)" font-size="10" font-family="SansSerif" font-style="normal" font-weight="normal">2</text>
<text fill="#000000" style="stroke:none" x="60" y="94" transform="rotate(-0, 60, 94)" font-size="10" font-family="SansSerif" font-style="normal" font-weight="normal">4</text>
<text fill="#000000" style="stroke:none" x="60" y="72" transform="rotate(-0, 60, 72)" font-size="10" font-family="SansSerif" font-style="normal" font-weight="normal">6</text>
<text fill="#000000" style="stroke:none" x="61" y="49" transform="rotate(-0, 61, 49)" font-size="10" font-family="SansSerif" font-style="normal" font-weight="normal">8</text>
<text fill="#000000" style="stroke:none" x="55" y="26" transform="rotate(-0, 55, 26)" font-size="10" font-family="SansSerif" font-style="normal" font-weight="normal">10</text>
<polyline fill="none" stroke="#000000" stroke-width="0.5" points="76.25,134.167 533.75,134.167"/>
<polyline fill="none" stroke="#000000" stroke-width="0.5" points="138.636,134.167 138.636,137.167"/>
<polyline fill="none" stroke="#000000" stroke-width="0.5" points="207.955,134.167 207.955,137.167"/>
<polyline fill="none" stroke="#000000" stroke-width="0.5" points="277.273,134.167 277.273,137.167"/>
<polyline fill="none" stroke="#000000" stroke-width="0.5" points="346.591,134.167 346.591,137.167"/>
<polyline fill="none" stroke="#000000" stroke-width="0.5" points="415.909,134.167 415.909,137.167"/>
<polyline fill="none" stroke="#000000" stroke-width="0.5" points="485.227,134.167 485.227,137.167"/>
<polyline fill="none" stroke="#000000" stroke-width="0.5" points="92.4242,134.167 92.4242,135.967"/>
<polyline fill="none" stroke="#000000" stroke-width="0.5" points="115.53,134.167 115.53,135.967"/>
<polyline fill="none" stroke="#000000" stroke-width="0.5" points="161.742,134.167 161.742,135.967"/>
<polyline fill="none" stroke="#000000" stroke-width="0.5" points="184.848,134.167 184.848,135.967"/>
<polyline fill="none" stroke="#000000" stroke-width="0.5" points="231.061,134.167 231.061,135.967"/>
<polyline fill="none" stroke="#000000" stroke-width="0.5" points="254.167,134.167 254.167,135.967"/>
<polyline fill="none" stroke="#000000" stroke-width="0.5" points="300.379,134.167 300.379,135.967"/>
<polyline fill="none" stroke="#000000" stroke-width="0.5" points="323.485,134.167 323.485,135.967"/>
<polyline fill="none" stroke="#000000" stroke-width="0.5" points="369.697,134.167 369.697,135.967"/>
<polyline fill="none" stroke="#000000" stroke-width="0.5" points="392.803,134.167 392.803,135.967"/>
<polyline fill="none" stroke="#000000" stroke-width="0.5" points="439.015,134.167 439.015,135.967"/>
<polyline fill="none" stroke="#000000" stroke-width="0.5" points="462.121,134.167 462.121,135.967"/>
<polyline fill="none" stroke="#000000" stroke-width="0.5" points="508.333,134.167 508.333,135.967"/>
<polyline fill="none" stroke="#000000" stroke-width="0.5" points="531.439,134.167 531.439,135.967"/>
<text fill="#000000" style="stroke:none" x="135" y="148" transform="rotate(-0, 135, 148)" font-size="10" font-family="SansSerif" font-style="normal" font-weight="normal">5</text>
<text fill="#000000" style="stroke:none" x="201" y="148" transform="rotate(-0, 201, 148)" font-size="10" font-family="SansSerif" font-style="normal" font-weight="normal">10</text>
<text fill="#000000" style="stroke:none" x="271" y="148" transform="rotate(-0, 271, 148)" font-size="10" font-family="SansSerif" font-style="normal" font-weight="normal">15</text>
<text fill="#000000" style="stroke:none" x="340" y="148" transform="rotate(-0, 340, 148)" font-size="10" font-family="SansSerif" font-style="normal" font-weight="normal">20</text>
<text fill="#000000" style="stroke:none" x="409" y="148" transform="rotate(-0, 409, 148)" font-size="10" font-family="SansSerif" font-style="normal" font-weight="normal">25</text>
<text fill="#000000" style="stroke:none" x="479" y="148" transform="rotate(-0, 479, 148)" font-size="10" font-family="SansSerif" font-style="normal" font-weight="normal">30</text>
<text fill="#000000" style="stroke:none" x="288" y="11" transform="rotate(0, 288, 11)" font-size="10" font-family="SansSerif" font-style="normal" font-weight="normal"># calls</text>
<polygon fill="#ffffff" points="76.25,287.5 76.25,172.5 76.25,287.5"/>
<polygon fill="#ffffff" points="76.25,172.5 76.25,172.5 76.25,287.5"/>
<polygon fill="#ffffff" points="76.25,287.5 533.75,287.5 76.25,287.5"/>
<polygon fill="#ffffff" points="533.75,287.5 533.75,287.5 76.25,287.5"/>
<polygon fill="#ffffff" points="76.25,287.5 533.75,287.5 76.25,172.5"/>
<polygon fill="#ffffff" points="533.75,287.5 533.75,172.5 76.25,172.5"/>
<polygon fill="#00ff00" points="76.25,287.5 76.25,287.5 90.1136,287.5"/>
<polygon fill="#00ff00" points="76.25,287.5 90.1136,287.5 90.1136,287.5"/>
<polygon fill="#00ff00" points="90.1136,286.278 90.1136,287.5 103.977,286.278"/>
<polygon fill="#00ff00" points="90.1136,287.5 103.977,287.5 103.977,286.278"/>
<polygon fill="#00ff00" points="103.977,287.194 103.977,287.5 117.841,287.194"/>
<polygon fill="#00ff00" points="103.977,287.5 117.841,287.5 117.841,287.194"/>
<polygon fill="#00ff00" points="117.841,285.667 117.841,287.5 131.705,285.667"/>
<polygon fill="#00ff00" points="117.841,287.5 131.705,287.5 131.705,285.667"/>
<polygon fill="#00ff00" points="131.705,287.194 131.705,287.5 145.568,287.194"/>
<polygon fill="#00ff00" points="131.705,287.5 145.568,287.5 145.568,287.194"/>
<polygon fill="#00ff00" points="145.568,287.5 145.568,287.5 159.432,287.5"/>
<polygon fill="#00ff00" points="145.568,287.5 159.432,287.5 159.432,287.5"/>
<polygon fill="#00ff00" points="159.432,284.75 159.432,287.5 173.295,284.75"/>
<polygon fill="#00ff00" points="159.432,287.5 173.295,287.5 173.295,284.75"/>
<polygon fill="#00ff00" points="173.295,262.751 173.295,287.5 187.159,262.751"/>
<polygon fill="#00ff00" points="173.295,287.5 187.159,287.5 187.159,262.751"/>
<polygon fill="#00ff00" points="187.159,284.75 187.159,287.5 201.023,284.75"/>
<polygon fill="#00ff00" points="187.159,287.5 201.023,287.5 201.023,284.75"/>
<polygon fill="#00ff00" points="201.023,271.001 201.023,287.5 214.886,271.001"/>
<polygon fill="#00ff00" points="201.023,287.5 214.886,287.5 214.886,271.001"/>
<polygon fill="#00ff00" points="214.886,284.75 214.886,287.5 228.75,284.75"/>
<polygon fill="#00ff00" points="214.886,287.5 228.75,287.5 228.75,284.75"/>
<polygon fill="#00ff00" points="228.75,246.252 228.75,287.5 242.614,246.252"/>
<polygon fill="#00ff00" points="228.75,287.5 242.614,287.5 242.614,246.252"/>
<polygon fill="#00ff00" points="242.614,279.25 242.614,287.5 256.477,279.25"/>
<polygon fill="#00ff00" points="242.614,287.5 256.477,287.5 256.477,279.25"/>
<polygon fill="#00ff00" points="256.477,284.75 256.477,287.5 270.341,284.75"/>
<polygon fill="#00ff00" points="256.477,287.5 270.341,287.5 270.341,284.75"/>
<polygon fill="#00ff00" points="270.341,232.502 270.341,287.5 284.205,232.502"/>
<polygon fill="#00ff00" points="270.341,287.5 284.205,287.5 284.205,232.502"/>
<polygon fill="#00ff00" points="284.205,174.755 284.205,287.5 298.068,174.755"/>
<polygon fill="#00ff00" points="284.205,287.5 298.068,287.5 298.068,174.755"/>
<polygon fill="#00ff00" points="298.068,287.5 298.068,287.5 311.932,287.5"/>
<polygon fill="#00ff00" points="298.068,287.5 311.932,287.5 311.932,287.5"/>
<polygon fill="#00ff00" points="311.932,287.194 311.932,287.5 325.795,287.194"/>
<polygon fill="#00ff00" points="311.932,287.5 325.795,287.5 325.795,287.194"/>
<polygon fill="#00ff00" points="325.795,287.5 325.795,287.5 339.659,287.5"/>
<polygon fill="#00ff00" points="325.795,287.5 339.659,287.5 339.659,287.5"/>
<polygon fill="#00ff00" points="339.659,284.75 339.659,287.5 353.523,284.75"/>
<polygon fill="#00ff00" points="339.659,287.5 353.523,287.5 353.523,284.75"/>
<polygon fill="#00ff00" points="353.523,276.5 353.523,287.5 367.386,276.5"/>
<polygon fill="#00ff00" points="353.523,287.5 367.386,287.5 367.386,276.5"/>
<polygon fill="#00ff00" points="367.386,262.751 367.386,287.5 381.25,262.751"/>
<polygon fill="#00ff00" points="367.386,287.5 381.25,287.5 381.25,262.751"/>
<polygon fill="#00ff00" points="381.25,284.75 381.25,287.5 395.114,284.75"/>
<polygon fill="#00ff00" points="381.25,287.5 395.114,287.5 395.114,284.75"/>
<polygon fill="#00ff00" points="395.114,216.003 395.114,287.5 408.977,216.003"/>
<polygon fill="#00ff00" points="395.114,287.5 408.977,287.5 408.977,216.003"/>
<polygon fill="#00ff00" points="408.977,287.5 408.977,287.5 422.841,287.5"/>
<polygon fill="#00ff00" points="408.977,287.5 422.841,287.5 422.841,287.5"/>
<polygon fill="#00ff00" points="422.841,287.194 422.841,287.5 436.705,287.194"/>
<polygon fill="#00ff00" points="422.841,287.5 436.705,287.5 436.705,287.194"/>
<polygon fill="#00ff00" points="436.705,287.5 436.705,287.5 450.568,287.5"/>
<polygon fill="#00ff00" points="436.705,287.5 450.568,287.5 450.568,287.5"/>
<polygon fill="#00ff00" points="450.568,205.004 450.568,287.5 464.432,205.004"/>
<polygon fill="#00ff00" points="450.568,287.5 464.432,287.5 464.432,205.004"/>
<polygon fill="#00ff00" points="464.432,287.5 464.432,287.5 478.295,287.5"/>
<polygon fill="#00ff00" points="464.432,287.5 478.295,287.5 478.295,287.5"/>
<polygon fill="#00ff00" points="478.295,286.889 478.295,287.5 492.159,286.889"/>
<polygon fill="#00ff00" points="478.295,287.5 492.159,287.5 492.159,286.889"/>
<polygon fill="#00ff00" points="492.159,287.5 492.159,287.5 506.023,287.5"/>
<polygon fill="#00ff00" points="492.159,287.5 506.023,287.5 506.023,287.5"/>
<polyline fill="none" stroke="#000000" stroke-width="0.5" points="76.25,287.5 76.25,287.5 90.1136,287.5 90.1136,287.5 76.25,287.5"/>
<polyline fill="none" stroke="#000000" stroke-width="0.5" points="90.1136,286.278 90.1136,287.5 103.977,287.5 103.977,286.278 90.1136,286.278"/>
<polyline fill="none" stroke="#000000" stroke-width="0.5" points="103.977,287.194 103.977,287.5 117.841,287.5 117.841,287.194 103.977,287.194"/>
<polyline fill="none" stroke="#000000" stroke-width="0.5" points="117.841,285.667 117.841,287.5 131.705,287.5 131.705,285.667 117.841,285.667"/>
<polyline fill="none" stroke="#000000" stroke-width="0.5" points="131.705,287.194 131.705,287.5 145.568,287.5 145.568,287.194 131.705,287.194"/>
<polyline fill="none" stroke="#000000" stroke-width="0.5" points="145.568,287.5 145.568,287.5 159.432,287.5 159.432,287.5 145.568,287.5"/>
<polyline fill="none" stroke="#000000" stroke-width="0.5" points="159.432,284.75 159.432,287.5 173.295,287.5 173.295,284.75 159.432,284.75"/>
<polyline fill="none" stroke="#000000" stroke-width="0.5" points="173.295,262.751 173.295,287.5 187.159,287.5 187.159,262.751 173.295,262.751"/>
<polyline fill="none" stroke="#000000" stroke-width="0.5" points="187.159,284.75 187.159,287.5 201.023,287.5 201.023,284.75 187.159,284.75"/>
<polyline fill="none" stroke="#000000" stroke-width="0.5" points="201.023,271.001 201.023,287.5 214.886,287.5 214.886,271.001 201.023,271.001"/>
<polyline fill="none" stroke="#000000" stroke-width="0.5" points="214.886,284.75 214.886,287.5 228.75,287.5 228.75,284.75 214.886,284.75"/>
<polyline fill="none" stroke="#000000" stroke-width="0.5" points="228.75,246.252 228.75,287.5 242.614,287.5 242.614,246.252 228.75,246.252"/>
<polyline fill="none" stroke="#000000" stroke-width="0.5" points="242.614,279.25 242.614,287.5 256.477,287.5 256.477,279.25 242.614,279.25"/>
<polyline fill="none" stroke="#000000" stroke-width="0.5" points="256.477,284.75 256.477,287.5 270.341,287.5 270.341,284.75 256.477,284.75"/>
<polyline fill="none" stroke="#000000" stroke-width="0.5" points="270.341,232.502 270.341,287.5 284.205,287.5 284.205,232.502 270.341,232.502"/>
<polyline fill="none" stroke="#000000" stroke-width="0.5" points="284.205,174.755 284.205,287.5 298.068,287.5 298.068,174.755 284.205,174.755"/>
<polyline fill="none" stroke="#000000" stroke-width="0.5" points="298.068,287.5 298.068,287.5 311.932,287.5 311.932,287.5 298.068,287.5"/>
<polyline fill="none" stroke="#000000" stroke-width="0.5" points="311.932,287.194 311.932,287.5 325.795,287.5 325.795,287.194 311.932,287.194"/>
<polyline fill="none" stroke="#000000" stroke-width="0.5" points="325.795,287.5 325.795,287.5 339.659,287.5 339.659,287.5 325.795,287.5"/>
<polyline fill="none" stroke="#000000" stroke-width="0.5" points="339.659,284.75 339.659,287.5 353.523,287.5 353.523,284.75 339.659,284.75"/>
<polyline fill="none" stroke="#000000" stroke-width="0.5" points="353.523,276.5 353.523,287.5 367.386,287.5 367.386,276.5 353.523,276.5"/>
<polyline fill="none" stroke="#000000" stroke-width="0.5" points="367.386,262.751 367.386,287.5 381.25,287.5 381.25,262.751 367.386,262.751"/>
<polyline fill="none" stroke="#000000" stroke-width="0.5" points="381.25,284.75 381.25,287.5 395.114,287.5 395.114,284.75 381.25,284.75"/>
<polyline fill="none" stroke="#000000" stroke-width="0.5" points="395.114,216.003 395.114,287.5 408.977,287.5 408.977,216.003 395.114,216.003"/>
<polyline fill="none" stroke="#000000" stroke-width="0.5" points="408.977,287.5 408.977,287.5 422.841,287.5 422.841,287.5 408.977,287.5"/>
<polyline fill="none" stroke="#000000" stroke-width="0.5" points="422.841,287.194 422.841,287.5 436.705,287.5 436.705,287.194 422.841,287.194"/>
<polyline fill="none" stroke="#000000" stroke-width="0.5" points="436.705,287.5 436.705,287.5 450.568,287.5 450.568,287.5 436.705,287.5"/>
<polyline fill="none" stroke="#000000" stroke-width="0.5" points="450.568,205.004 450.568,287.5 464.432,287.5 464.432,205.004 450.568,205.004"/>
<polyline fill="none" stroke="#000000" stroke-width="0.5" points="464.432,287.5 464.432,287.5 478.295,287.5 478.295,287.5 464.432,287.5"/>
<polyline fill="none" stroke="#000000" stroke-width="0.5" points="478.295,286.889 478.295,287.5 492.159,287.5 492.159,286.889 478.295,286.889"/>
<polyline fill="none" stroke="#000000" stroke-width="0.5" points="492.159,287.5 492.159,287.5 506.023,287.5 506.023,287.5 492.159,287.5"/>
<polyline fill="none" stroke="#ff0000" stroke-width="0.5" points="83.1818,172.499 83.1818,287.5"/>
<polygon fill="#ff0000" points="83.1818,287.5 83.221,287.392 83.1426,287.392"/>
<polyline fill="none" stroke="#000000" stroke-width="0.5" points="76.25,287.5 76.25,172.5"/>
<polyline fill="none" stroke="#000000" stroke-width="0.5" points="76.25,287.5 69.395,287.5"/>
<polyline fill="none" stroke="#000000" stroke-width="0.5" points="76.25,272.223 69.395,272.223"/>
<polyline fill="none" stroke="#000000" stroke-width="0.5" points="76.25,256.946 69.395,256.946"/>
<polyline fill="none" stroke="#000000" stroke-width="0.5" points="76.25,241.669 69.395,241.669"/>
<polyline fill="none" stroke="#000000" stroke-width="0.5" points="76.25,226.392 69.395,226.392"/>
<polyline fill="none" stroke="#000000" stroke-width="0.5" points="76.25,211.114 69.395,211.114"/>
<polyline fill="none" stroke="#000000" stroke-width="0.5" points="76.25,195.837 69.395,195.837"/>
<polyline fill="none" stroke="#000000" stroke-width="0.5" points="76.25,180.56 69.395,180.56"/>
<polyline fill="none" stroke="#000000" stroke-width="0.5" points="76.25,279.861 72.137,279.861"/>
<polyline fill="none" stroke="#000000" stroke-width="0.5" points="76.25,264.584 72.137,264.584"/>
<polyline fill="none" stroke="#000000" stroke-width="0.5" points="76.25,249.307 72.137,249.307"/>
<polyline fill="none" stroke="#000000" stroke-width="0.5" points="76.25,234.03 72.137,234.03"/>
<polyline fill="none" stroke="#000000" stroke-width="0.5" points="76.25,218.753 72.137,218.753"/>
<polyline fill="none" stroke="#000000" stroke-width="0.5" points="76.25,203.476 72.137,203.476"/>
<polyline fill="none" stroke="#000000" stroke-width="0.5" points="76.25,188.199 72.137,188.199"/>
<polyline fill="none" stroke="#000000" stroke-width="0.5" points="76.25,172.922 72.137,172.922"/>
<text fill="#000000" style="stroke:none" x="60" y="292" transform="rotate(-0, 60, 292)" font-size="10" font-family="SansSerif" font-style="normal" font-weight="normal">0</text>
<text fill="#000000" style="stroke:none" x="55" y="277" transform="rotate(-0, 55, 277)" font-size="10" font-family="SansSerif" font-style="normal" font-weight="normal">50</text>
<text fill="#000000" style="stroke:none" x="49" y="262" transform="rotate(-0, 49, 262)" font-size="10" font-family="SansSerif" font-style="normal" font-weight="normal">100</text>
<text fill="#000000" style="stroke:none" x="49" y="247" transform="rotate(-0, 49, 247)" font-size="10" font-family="SansSerif" font-style="normal" font-weight="normal">150</text>
<text fill="#000000" style="stroke:none" x="49" y="231" transform="rotate(-0, 49, 231)" font-size="10" font-family="SansSerif" font-style="normal" font-weight="normal">200</text>
<text fill="#000000" style="stroke:none" x="49" y="216" transform="rotate(-0, 49, 216)" font-size="10" font-family="SansSerif" font-style="normal" font-weight="normal">250</text>
<text fill="#000000" style="stroke:none" x="49" y="201" transform="rotate(-0, 49, 201)" font-size="10" font-family="SansSerif" font-style="normal" font-weight="normal">300</text>
<text fill="#000000" style="stroke:none" x="49" y="186" transform="rotate(-0, 49, 186)" font-size="10" font-family="SansSerif" font-style="normal" font-weight="normal">350</text>
<polyline fill="none" stroke="#000000" stroke-width="0.5" points="76.25,287.5 533.75,287.5"/>
<polyline fill="none" stroke="#000000" stroke-width="0.5" points="138.636,287.5 138.636,290.5"/>
<polyline fill="none" stroke="#000000" stroke-width="0.5" points="207.955,287.5 207.955,290.5"/>
<polyline fill="none" stroke="#000000" stroke-width="0.5" points="277.273,287.5 277.273,290.5"/>
<polyline fill="none" stroke="#000000" stroke-width="0.5" points="346.591,287.5 346.591,290.5"/>
<polyline fill="none" stroke="#000000" stroke-width="0.5" points="415.909,287.5 415.909,290.5"/>
<polyline fill="none" stroke="#000000" stroke-width="0.5" points="485.227,287.5 485.227,290.5"/>
<polyline fill="none" stroke="#000000" stroke-width="0.5" points="92.4242,287.5 92.4242,289.3"/>
<polyline fill="none" stroke="#000000" stroke-width="0.5" points="115.53,287.5 115.53,289.3"/>
<polyline fill="none" stroke="#000000" stroke-width="0.5" points="161.742,287.5 161.742,289.3"/>
<polyline fill="none" stroke="#000000" stroke-width="0.5" points="184.848,287.5 184.848,289.3"/>
<polyline fill="none" stroke="#000000" stroke-width="0.5" points="231.061,287.5 231.061,289.3"/>
<polyline fill="none" stroke="#000000" stroke-width="0.5" points="254.167,287.5 254.167,289.3"/>
<polyline fill="none" stroke="#000000" stroke-width="0.5" points="300.379,287.5 300.379,289.3"/>
<polyline fill="none" stroke="#000000" stroke-width="0.5" points="323.485,287.5 323.485,289.3"/>
<polyline fill="none" stroke="#000000" stroke-width="0.5" points="369.697,287.5 369.697,289.3"/>
<polyline fill="none" stroke="#000000" stroke-width="0.5" points="392.803,287.5 392.803,289.3"/>
<polyline fill="none" stroke="#000000" stroke-width="0.5" points="439.015,287.5 439.015,289.3"/>
<polyline fill="none" stroke="#000000" stroke-width="0.5" points="462.121,287.5 462.121,289.3"/>
<polyline fill="none" stroke="#000000" stroke-width="0.5" points="508.333,287.5 508.333,289.3"/>
<polyline fill="none" stroke="#000000" stroke-width="0.5" points="531.439,287.5 531.439,289.3"/>
<text fill="#000000" style="stroke:none" x="135" y="301" transform="rotate(-0, 135, 301)" font-size="10" font-family="SansSerif" font-style="normal" font-weight="normal">5</text>
<text fill="#000000" style="stroke:none" x="201" y="301" transform="rotate(-0, 201, 301)" font-size="10" font-family="SansSerif" font-style="normal" font-weight="normal">10</text>
<text fill="#000000" style="stroke:none" x="271" y="301" transform="rotate(-0, 271, 301)" font-size="10" font-family="SansSerif" font-style="normal" font-weight="normal">15</text>
<text fill="#000000" style="stroke:none" x="340" y="301" transform="rotate(-0, 340, 301)" font-size="10" font-family="SansSerif" font-style="normal" font-weight="normal">20</text>
<text fill="#000000" style="stroke:none" x="409" y="301" transform="rotate(-0, 409, 301)" font-size="10" font-family="SansSerif" font-style="normal" font-weight="normal">25</text>
<text fill="#000000" style="stroke:none" x="479" y="301" transform="rotate(-0, 479, 301)" font-size="10" font-family="SansSerif" font-style="normal" font-weight="normal">30</text>
<text fill="#000000" style="stroke:none" x="274" y="163" transform="rotate(0, 274, 163)" font-size="10" font-family="SansSerif" font-style="normal" font-weight="normal">Complexity</text>
<polygon fill="#ffffff" points="76.25,440.833 76.25,325.833 76.25,440.833"/>
<polygon fill="#ffffff" points="76.25,325.833 76.25,325.833 76.25,440.833"/>
<polygon fill="#ffffff" points="76.25,440.833 533.75,440.833 76.25,440.833"/>
<polygon fill="#ffffff" points="533.75,440.833 533.75,440.833 76.25,440.833"/>
<polygon fill="#ffffff" points="76.25,440.833 533.75,440.833 76.25,325.833"/>
<polygon fill="#ffffff" points="533.75,440.833 533.75,325.833 76.25,325.833"/>
<polygon fill="#00ffff" points="76.25,440.833 76.25,440.833 90.1136,440.833"/>
<polygon fill="#00ffff" points="76.25,440.833 90.1136,440.833 90.1136,440.833"/>
<polygon fill="#00ffff" points="90.1136,440.833 90.1136,440.833 103.977,440.833"/>
<polygon fill="#00ffff" points="90.1136,440.833 103.977,440.833 103.977,440.833"/>
<polygon fill="#00ffff" points="103.977,440.833 103.977,440.833 117.841,440.833"/>
<polygon fill="#00ffff" points="103.977,440.833 117.841,440.833 117.841,440.833"/>
<polygon fill="#00ffff" points="117.841,440.833 117.841,440.833 131.705,440.833"/>
<polygon fill="#00ffff" points="117.841,440.833 131.705,440.833 131.705,440.833"/>
<polygon fill="#00ffff" points="131.705,440.833 131.705,440.833 145.568,440.833"/>
<polygon fill="#00ffff" points="131.705,440.833 145.568,440.833 145.568,440.833"/>
<polygon fill="#00ffff" points="145.568,440.833 145.568,440.833 159.432,440.833"/>
<polygon fill="#00ffff" points="145.568,440.833 159.432,440.833 159.432,440.833"/>
<polygon fill="#00ffff" points="159.432,440.833 159.432,440.833 173.295,440.833"/>
<polygon fill="#00ffff" points="159.432,440.833 173.295,440.833 173.295,440.833"/>
<polygon fill="#00ffff" points="173.295,440.833 173.295,440.833 187.159,440.833"/>
<polygon fill="#00ffff" points="173.295,440.833 187.159,440.833 187.159,440.833"/>
<polygon fill="#00ffff" points="187.159,440.833 187.159,440.833 201.023,440.833"/>
<polygon fill="#00ffff" points="187.159,440.833 201.023,440.833 201.023,440.833"/>
<polygon fill="#00ffff" points="201.023,440.833 201.023,440.833 214.886,440.833"/>
<polygon fill="#00ffff" points="201.023,440.833 214.886,440.833 214.886,440.833"/>
<polygon fill="#00ffff" points="214.886,440.833 214.886,440.833 228.75,440.833"/>
<polygon fill="#00ffff" points="214.886,440.833 228.75,440.833 228.75,440.833"/>
<polygon fill="#00ffff" points="228.75,440.833 228.75,440.833 242.614,440.833"/>
<polygon fill="#00ffff" points="228.75,440.833 242.614,440.833 242.614,440.833"/>
<polygon fill="#00ffff" points="242.614,440.833 242.614,440.833 256.477,440.833"/>
<polygon fill="#00ffff" points="242.614,440.833 256.477,440.833 256.477,440.833"/>
<polygon fill="#00ffff" points="256.477,440.833 256.477,440.833 270.341,440.833"/>
<polygon fill="#00ffff" points="256.477,440.833 270.341,440.833 270.341,440.833"/>
<polygon fill="#00ffff" points="270.341,440.833 270.341,440.833 284.205,440.833"/>
<polygon fill="#00ffff" points="270.341,440.833 284.205,440.833 284.205,440.833"/>
<polygon fill="#00ffff" points="284.205,440.833 284.205,440.833 298.068,440.833"/>
<polygon fill="#00ffff" points="284.205,440.833 298.068,440.833 298.068,440.833"/>
<polygon fill="#00ffff" points="298.068,440.833 298.068,440.833 311.932,440.833"/>
<polygon fill="#00ffff" points="298.068,440.833 311.932,440.833 311.932,440.833"/>
<polygon fill="#00ffff" points="311.932,440.833 311.932,440.833 325.795,440.833"/>
<polygon fill="#00ffff" points="311.932,440.833 325.795,440.833 325.795,440.833"/>
<polygon fill="#00ffff" points="325.795,440.833 325.795,440.833 339.659,440.833"/>
<polygon fill="#00ffff" points="325.795,440.833 339.659,440.833 339.659,440.833"/>
<polygon fill="#00ffff" points="339.659,440.833 339.659,440.833 353.523,440.833"/>
<polygon fill="#00ffff" points="339.659,440.833 353.523,440.833 353.523,440.833"/>
<polygon fill="#00ffff" points="353.523,440.833 353.523,440.833 367.386,440.833"/>
<polygon fill="#00ffff" points="353.523,440.833 367.386,440.833 367.386,440.833"/>
<polygon fill="#00ffff" points="367.386,440.833 367.386,440.833 381.25,440.833"/>
<polygon fill="#00ffff" points="367.386,440.833 381.25,440.833 381.25,440.833"/>
<polygon fill="#00ffff" points="381.25,440.833 381.25,440.833 395.114,440.833"/>
<polygon fill="#00ffff" points="381.25,440.833 395.114,440.833 395.114,440.833"/>
<polygon fill="#00ffff" points="395.114,440.833 395.114,440.833 408.977,440.833"/>
<polygon fill="#00ffff" points="395.114,440.833 408.977,440.833 408.977,440.833"/>
<polygon fill="#00ffff" points="408.977,440.833 408.977,440.833 422.841,440.833"/>
<polygon fill="#00ffff" points="408.977,440.833 422.841,440.833 422.841,440.833"/>
<polygon fill="#00ffff" points="422.841,440.833 422.841,440.833 436.705,440.833"/>
<polygon fill="#00ffff" points="422.841,440.833 436.705,440.833 436.705,440.833"/>
<polygon fill="#00ffff" points="436.705,440.833 436.705,440.833 450.568,440.833"/>
<polygon fill="#00ffff" points="436.705,440.833 450.568,440.833 450.568,440.833"/>
<polygon fill="#00ffff" points="450.568,440.833 450.568,440.833 464.432,440.833"/>
<polygon fill="#00ffff" points="450.568,440.833 464.432,440.833 464.432,440.833"/>
<polygon fill="#00ffff" points="464.432,440.833 464.432,440.833 478.295,440.833"/>
<polygon fill="#00ffff" points="464.432,440.833 478.295,440.833 478.295,440.833"/>
<polygon fill="#00ffff" points="478.295,440.833 478.295,440.833 492.159,440.833"/>
<polygon fill="#00ffff" points="478.295,440.833 492.159,440.833 492.159,440.833"/>
<polygon fill="#00ffff" points="492.159,440.833 492.159,440.833 506.023,440.833"/>
<polygon fill="#00ffff" points="492.159,440.833 506.023,440.833 506.023,440.833"/>
<polyline fill="none" stroke="#000000" stroke-width="0.5" points="76.25,440.833 76.25,440.833 90.1136,440.833 90.1136,440.833 76.25,440.833"/>
<polyline fill="none" stroke="#000000" stroke-width="0.5" points="90.1136,440.833 90.1136,440.833 103.977,440.833 103.977,440.833 90.1136,440.833"/>
<polyline fill="none" stroke="#000000" stroke-width="0.5" points="103.977,440.833 103.977,440.833 117.841,440.833 117.841,440.833 103.977,440.833"/>
<polyline fill="none" stroke="#000000" stroke-width="0.5" points="117.841,440.833 117.841,440.833 131.705,440.833 131.705,440.833 117.841,440.833"/>
<polyline fill="none" stroke="#000000" stroke-width="0.5" points="131.705,440.833 131.705,440.833 145.568,440.833 145.568,440.833 131.705,440.833"/>
<polyline fill="none" stroke="#000000" stroke-width="0.5" points="145.568,440.833 145.568,440.833 159.432,440.833 159.432,440.833 145.568,440.833"/>
<polyline fill="none" stroke="#000000" stroke-width="0.5" points="159.432,440.833 159.432,440.833 173.295,440.833 173.295,440.833 159.432,440.833"/>
<polyline fill="none" stroke="#000000" stroke-width="0.5" points="173.295,440.833 173.295,440.833 187.159,440.833 187.159,440.833 173.295,440.833"/>
<polyline fill="none" stroke="#000000" stroke-width="0.5" points="187.159,440.833 187.159,440.833 201.023,440.833 201.023,440.833 187.159,440.833"/>
<polyline fill="none" stroke="#000000" stroke-width="0.5" points="201.023,440.833 201.023,440.833 214.886,440.833 214.886,440.833 201.023,440.833"/>
<polyline fill="none" stroke="#000000" stroke-width="0.5" points="214.886,440.833 214.886,440.833 228.75,440.833 228.75,440.833 214.886,440.833"/>
<polyline fill="none" stroke="#000000" stroke-width="0.5" points="228.75,440.833 228.75,440.833 242.614,440.833 242.614,440.833 228.75,440.833"/>
<polyline fill="none" stroke="#000000" stroke-width="0.5" points="242.614,440.833 242.614,440.833 256.477,440.833 256.477,440.833 242.614,440.833"/>
<polyline fill="none" stroke="#000000" stroke-width="0.5" points="256.477,440.833 256.477,440.833 270.341,440.833 270.341,440.833 256.477,440.833"/>
<polyline fill="none" stroke="#000000" stroke-width="0.5" points="270.341,440.833 270.341,440.833 284.205,440.833 284.205,440.833 270.341,440.833"/>
<polyline fill="none" stroke="#000000" stroke-width="0.5" points="284.205,440.833 284.205,440.833 298.068,440.833 298.068,440.833 284.205,440.833"/>
<polyline fill="none" stroke="#000000" stroke-width="0.5" points="298.068,440.833 298.068,440.833 311.932,440.833 311.932,440.833 298.068,440.833"/>
<polyline fill="none" stroke="#000000" stroke-width="0.5" points="311.932,440.833 311.932,440.833 325.795,440.833 325.795,440.833 311.932,440.833"/>
<polyline fill="none" stroke="#000000" stroke-width="0.5" points="325.795,440.833 325.795,440.833 339.659,440.833 339.659,440.833 325.795,440.833"/>
<polyline fill="none" stroke="#000000" stroke-width="0.5" points="339.659,440.833 339.659,440.833 353.523,440.833 353.523,440.833 339.659,440.833"/>
<polyline fill="none" stroke="#000000" stroke-width="0.5" points="353.523,440.833 353.523,440.833 367.386,440.833 367.386,440.833 353.523,440.833"/>
<polyline fill="none" stroke="#000000" stroke-width="0.5" points="367.386,440.833 367.386,440.833 381.25,440.833 381.25,440.833 367.386,440.833"/>
<polyline fill="none" stroke="#000000" stroke-width="0.5" points="381.25,440.833 381.25,440.833 395.114,440.833 395.114,440.833 381.25,440.833"/>
<polyline fill="none" stroke="#000000" stroke-width="0.5" points="395.114,440.833 395.114,440.833 408.977,440.833 408.977,440.833 395.114,440.833"/>
<polyline fill="none" stroke="#000000" stroke-width="0.5" points="408.977,440.833 408.977,440.833 422.841,440.833 422.841,440.833 408.977,440.833"/>
<polyline fill="none" stroke="#000000" stroke-width="0.5" points="422.841,440.833 422.841,440.833 436.705,440.833 436.705,440.833 422.841,440.833"/>
<polyline fill="none" stroke="#000000" stroke-width="0.5" points="436.705,440.833 436.705,440.833 450.568,440.833 450.568,440.833 436.705,440.833"/>
<polyline fill="none" stroke="#000000" stroke-width="0.5" points="450.568,440.833 450.568,440.833 464.432,440.833 464.432,440.833 450.568,440.833"/>
<polyline fill="none" stroke="#000000" stroke-width="0.5" points="464.432,440.833 464.432,440.833 478.295,440.833 478.295,440.833 464.432,440.833"/>
<polyline fill="none" stroke="#000000" stroke-width="0.5" points="478.295,440.833 478.295,440.833 492.159,440.833 492.159,440.833 478.295,440.833"/>
<polyline fill="none" stroke="#000000" stroke-width="0.5" points="492.159,440.833 492.159,440.833 506.023,440.833 506.023,440.833 492.159,440.833"/>
<polyline fill="none" stroke="#ff0000" stroke-width="0.5" points="83.1818,440.833 83.1818,440.833"/>
<polyline fill="none" stroke="#000000" stroke-width="0.5" points="76.25,440.833 76.25,325.833"/>
<polyline fill="none" stroke="#000000" stroke-width="0.5" points="76.25,440.833 69.395,440.833"/>
<polyline fill="none" stroke="#000000" stroke-width="0.5" points="76.25,429.333 69.395,429.333"/>
<polyline fill="none" stroke="#000000" stroke-width="0.5" points="76.25,417.833 69.395,417.833"/>
<polyline fill="none" stroke="#000000" stroke-width="0.5" points="76.25,406.333 69.395,406.333"/>
<polyline fill="none" stroke="#000000" stroke-width="0.5" points="76.25,394.833 69.395,394.833"/>
<polyline fill="none" stroke="#000000" stroke-width="0.5" points="76.25,383.333 69.395,383.333"/>
<polyline fill="none" stroke="#000000" stroke-width="0.5" points="76.25,371.833 69.395,371.833"/>
<polyline fill="none" stroke="#000000" stroke-width="0.5" points="76.25,360.333 69.395,360.333"/>
<polyline fill="none" stroke="#000000" stroke-width="0.5" points="76.25,348.833 69.395,348.833"/>
<polyline fill="none" stroke="#000000" stroke-width="0.5" points="76.25,337.333 69.395,337.333"/>
<polyline fill="none" stroke="#000000" stroke-width="0.5" points="76.25,435.083 72.137,435.083"/>
<polyline fill="none" stroke="#000000" stroke-width="0.5" points="76.25,423.583 72.137,423.583"/>
<polyline fill="none" stroke="#000000" stroke-width="0.5" points="76.25,412.083 72.137,412.083"/>
<polyline fill="none" stroke="#000000" stroke-width="0.5" points="76.25,400.583 72.137,400.583"/>
<polyline fill="none" stroke="#000000" stroke-width="0.5" points="76.25,389.083 72.137,389.083"/>
<polyline fill="none" stroke="#000000" stroke-width="0.5" points="76.25,377.583 72.137,377.583"/>
<polyline fill="none" stroke="#000000" stroke-width="0.5" points="76.25,366.083 72.137,366.083"/>
<polyline fill="none" stroke="#000000" stroke-width="0.5" points="76.25,354.583 72.137,354.583"/>
<polyline fill="none" stroke="#000000" stroke-width="0.5" points="76.25,343.083 72.137,343.083"/>
<polyline fill="none" stroke="#000000" stroke-width="0.5" points="76.25,331.583 72.137,331.583"/>
<text fill="#000000" style="stroke:none" x="34" y="446" transform="rotate(-0, 34, 446)" font-size="10" font-family="SansSerif" font-style="normal" font-weight="normal">0e+00</text>
<text fill="#000000" style="stroke:none" x="39" y="434" transform="rotate(-0, 39, 434)" font-size="10" font-family="SansSerif" font-style="normal" font-weight="normal">1e-07</text>
<text fill="#000000" style="stroke:none" x="39" y="423" transform="rotate(-0, 39, 423)" font-size="10" font-family="SansSerif" font-style="normal" font-weight="normal">2e-07</text>
<text fill="#000000" style="stroke:none" x="39" y="411" transform="rotate(-0, 39, 411)" font-size="10" font-family="SansSerif" font-style="normal" font-weight="normal">3e-07</text>
<text fill="#000000" style="stroke:none" x="38" y="400" transform="rotate(-0, 38, 400)" font-size="10" font-family="SansSerif" font-style="normal" font-weight="normal">4e-07</text>
<text fill="#000000" style="stroke:none" x="39" y="388" transform="rotate(-0, 39, 388)" font-size="10" font-family="SansSerif" font-style="normal" font-weight="normal">5e-07</text>
<text fill="#000000" style="stroke:none" x="39" y="377" transform="rotate(-0, 39, 377)" font-size="10" font-family="SansSerif" font-style="normal" font-weight="normal">6e-07</text>
<text fill="#000000" style="stroke:none" x="39" y="365" transform="rotate(-0, 39, 365)" font-size="10" font-family="SansSerif" font-style="normal" font-weight="normal">7e-07</text>
<text fill="#000000" style="stroke:none" x="39" y="354" transform="rotate(-0, 39, 354)" font-size="10" font-family="SansSerif" font-style="normal" font-weight="normal">8e-07</text>
<text fill="#000000" style="stroke:none" x="39" y="342" transform="rotate(-0, 39, 342)" font-size="10" font-family="SansSerif" font-style="normal" font-weight="normal">9e-07</text>
<polyline fill="none" stroke="#000000" stroke-width="0.5" points="76.25,440.833 533.75,440.833"/>
<polyline fill="none" stroke="#000000" stroke-width="0.5" points="138.636,440.833 138.636,443.833"/>
<polyline fill="none" stroke="#000000" stroke-width="0.5" points="207.955,440.833 207.955,443.833"/>
<polyline fill="none" stroke="#000000" stroke-width="0.5" points="277.273,440.833 277.273,443.833"/>
<polyline fill="none" stroke="#000000" stroke-width="0.5" points="346.591,440.833 346.591,443.833"/>
<polyline fill="none" stroke="#000000" stroke-width="0.5" points="415.909,440.833 415.909,443.833"/>
<polyline fill="none" stroke="#000000" stroke-width="0.5" points="485.227,440.833 485.227,443.833"/>
<polyline fill="none" stroke="#000000" stroke-width="0.5" points="92.4242,440.833 92.4242,442.633"/>
<polyline fill="none" stroke="#000000" stroke-width="0.5" points="115.53,440.833 115.53,442.633"/>
<polyline fill="none" stroke="#000000" stroke-width="0.5" points="161.742,440.833 161.742,442.633"/>
<polyline fill="none" stroke="#000000" stroke-width="0.5" points="184.848,440.833 184.848,442.633"/>
<polyline fill="none" stroke="#000000" stroke-width="0.5" points="231.061,440.833 231.061,442.633"/>
<polyline fill="none" stroke="#000000" stroke-width="0.5" points="254.167,440.833 254.167,442.633"/>
<polyline fill="none" stroke="#000000" stroke-width="0.5" points="300.379,440.833 300.379,442.633"/>
<polyline fill="none" stroke="#000000" stroke-width="0.5" points="323.485,440.833 323.485,442.633"/>
<polyline fill="none" stroke="#000000" stroke-width="0.5" points="369.697,440.833 369.697,442.633"/>
<polyline fill="none" stroke="#000000" stroke-width="0.5" points="392.803,440.833 392.803,442.633"/>
<polyline fill="none" stroke="#000000" stroke-width="0.5" points="439.015,440.833 439.015,442.633"/>
<polyline fill="none" stroke="#000000" stroke-width="0.5" points="462.121,440.833 462.121,442.633"/>
<polyline fill="none" stroke="#000000" stroke-width="0.5" points="508.333,440.833 508.333,442.633"/>
<polyline fill="none" stroke="#000000" stroke-width="0.5" points="531.439,440.833 531.439,442.633"/>
<text fill="#000000" style="stroke:none" x="135" y="455" transform="rotate(-0, 135, 455)" font-size="10" font-family="SansSerif" font-style="normal" font-weight="normal">5</text>
<text fill="#000000" style="stroke:none" x="201" y="455" transform="rotate(-0, 201, 455)" font-size="10" font-family="SansSerif" font-style="normal" font-weight="normal">10</text>
<text fill="#000000" style="stroke:none" x="271" y="455" transform="rotate(-0, 271, 455)" font-size="10" font-family="SansSerif" font-style="normal" font-weight="normal">15</text>
<text fill="#000000" style="stroke:none" x="340" y="455" transform="rotate(-0, 340, 455)" font-size="10" font-family="SansSerif" font-style="normal" font-weight="normal">20</text>
<text fill="#000000" style="stroke:none" x="409" y="455" transform="rotate(-0, 409, 455)" font-size="10" font-family="SansSerif" font-style="normal" font-weight="normal">25</text>
<text fill="#000000" style="stroke:none" x="479" y="455" transform="rotate(-0, 479, 455)" font-size="10" font-family="SansSerif" font-style="normal" font-weight="normal">30</text>
<text fill="#000000" style="stroke:none" x="247" y="316" transform="rotate(0, 247, 316)" font-size="10" font-family="SansSerif" font-style="normal" font-weight="normal">Cpu time (total 0 sec)</text>
</g>
</svg>
