<?xml version="1.0" encoding="UTF-8" standalone="no"?>
<!-- Created with Inkscape (http://www.inkscape.org/) -->
<svg
   xmlns:dc="http://purl.org/dc/elements/1.1/"
   xmlns:cc="http://creativecommons.org/ns#"
   xmlns:rdf="http://www.w3.org/1999/02/22-rdf-syntax-ns#"
   xmlns:svg="http://www.w3.org/2000/svg"
   xmlns="http://www.w3.org/2000/svg"
   xmlns:sodipodi="http://sodipodi.sourceforge.net/DTD/sodipodi-0.dtd"
   xmlns:inkscape="http://www.inkscape.org/namespaces/inkscape"
   width="1007.0412"
   height="830.19885"
   id="svg2"
   sodipodi:version="0.32"
   inkscape:version="0.46"
   sodipodi:docname="statemachine.svg"
   inkscape:output_extension="org.inkscape.output.svg.inkscape"
   version="1.0">
  <defs
     id="defs4">
    <marker
       inkscape:stockid="Arrow1Lend"
       orient="auto"
       refY="0"
       refX="0"
       id="Arrow1Lend"
       style="overflow:visible">
      <path
         id="path3244"
         d="M 0,0 L 5,-5 L -12.5,0 L 5,5 L 0,0 z"
         style="fill-rule:evenodd;stroke:#000000;stroke-width:1pt;marker-start:none"
         transform="matrix(-0.8,0,0,-0.8,-10,0)" />
    </marker>
    <inkscape:perspective
       sodipodi:type="inkscape:persp3d"
       inkscape:vp_x="0 : 526.18109 : 1"
       inkscape:vp_y="0 : 1000 : 0"
       inkscape:vp_z="744.09448 : 526.18109 : 1"
       inkscape:persp3d-origin="372.04724 : 350.78739 : 1"
       id="perspective10" />
  </defs>
  <sodipodi:namedview
     id="base"
     pagecolor="#ffffff"
     bordercolor="#666666"
     borderopacity="1.0"
     inkscape:pageopacity="0.0"
     inkscape:pageshadow="2"
     inkscape:zoom="0.98994949"
     inkscape:cx="534.06108"
     inkscape:cy="279.35775"
     inkscape:document-units="px"
     inkscape:current-layer="layer1"
     showgrid="false"
     inkscape:window-width="1558"
     inkscape:window-height="1000"
     inkscape:window-x="1"
     inkscape:window-y="14" />
  <metadata
     id="metadata7">
    <rdf:RDF>
      <cc:Work
         rdf:about="">
        <dc:format>image/svg+xml</dc:format>
        <dc:type
           rdf:resource="http://purl.org/dc/dcmitype/StillImage" />
      </cc:Work>
    </rdf:RDF>
  </metadata>
  <g
     inkscape:label="Calque 1"
     inkscape:groupmode="layer"
     id="layer1"
     transform="translate(110.20573,380.42644)">
    <g
       id="g2426"
       transform="translate(-71.659993,-362.84594)">
      <rect
         y="169.13379"
         x="110.20305"
         height="84.627197"
         width="144.31544"
         id="rect2428"
         style="fill:none;fill-opacity:1;stroke:#000000;stroke-width:2;stroke-miterlimit:4;stroke-dasharray:none;stroke-dashoffset:0;stroke-opacity:1" />
      <g
         id="g2451">
        <text
           sodipodi:linespacing="125%"
           xml:space="preserve"
           style="font-size:22px;font-style:normal;font-weight:normal;line-height:125%;fill:#000000;fill-opacity:1;stroke:none;stroke-width:1px;stroke-linecap:butt;stroke-linejoin:miter;stroke-opacity:1;font-family:Bitstream Vera Sans"
           x="136.82103"
           y="205.10408"
           id="text2430"><tspan
             id="tspan2452"
             sodipodi:role="line"
             x="136.82103"
             y="205.10408">(1)</tspan><tspan
             id="tspan2447"
             sodipodi:role="line"
             x="136.82103"
             y="232.60408">x = x + 1</tspan></text>
      </g>
    </g>
    <g
       id="g2456"
       transform="translate(205.56187,-358.99115)">
      <rect
         y="169.13379"
         x="110.20305"
         height="84.627197"
         width="144.31544"
         id="rect2458"
         style="fill:none;fill-opacity:1;stroke:#000000;stroke-width:2;stroke-miterlimit:4;stroke-dasharray:none;stroke-dashoffset:0;stroke-opacity:1" />
      <g
         id="g2460">
        <text
           sodipodi:linespacing="125%"
           xml:space="preserve"
           style="font-size:22px;font-style:normal;font-weight:normal;line-height:125%;fill:#000000;fill-opacity:1;stroke:none;stroke-width:1px;stroke-linecap:butt;stroke-linejoin:miter;stroke-opacity:1;font-family:Bitstream Vera Sans"
           x="136.82103"
           y="205.10408"
           id="text2462"><tspan
             id="tspan2464"
             sodipodi:role="line"
             x="136.82103"
             y="205.10408">(2)</tspan><tspan
             id="tspan2466"
             sodipodi:role="line"
             x="136.82103"
             y="232.60408">x = x * 2</tspan></text>
      </g>
    </g>
    <path
       style="fill:none;fill-rule:evenodd;stroke:#000000;stroke-width:2;stroke-linecap:butt;stroke-linejoin:miter;stroke-opacity:1;stroke-miterlimit:4;stroke-dasharray:none;marker-end:url(#Arrow1Lend)"
       d="M 307.08637,231.17839 L 410.12193,231.17839"
       id="path2468"
       transform="translate(-110.20573,-380.42644)" />
    <g
       id="g4356">
      <g
         transform="translate(0,51.51778)"
         id="g3782">
        <g
           id="g3765"
           transform="translate(210.48947,-158.66492)">
          <text
             id="text3767"
             y="205.10408"
             x="151.97331"
             style="font-size:22px;font-style:normal;font-weight:normal;line-height:125%;fill:#000000;fill-opacity:1;stroke:none;stroke-width:1px;stroke-linecap:butt;stroke-linejoin:miter;stroke-opacity:1;font-family:Bitstream Vera Sans"
             xml:space="preserve"
             sodipodi:linespacing="125%"><tspan
               y="205.10408"
               x="151.97331"
               sodipodi:role="line"
               id="tspan3769">(3)</tspan><tspan
               y="232.60408"
               x="151.97331"
               sodipodi:role="line"
               id="tspan3771">x&gt;2</tspan></text>
        </g>
        <rect
           style="opacity:1;fill:none;fill-opacity:1;stroke:#000000;stroke-width:2;stroke-miterlimit:4;stroke-dasharray:none;stroke-dashoffset:0;stroke-opacity:1"
           id="rect3778"
           width="98.238739"
           height="98.23864"
           x="180.27351"
           y="259.2049"
           transform="matrix(0.7071068,-0.7071068,0.7071068,0.7071068,0,0)" />
      </g>
    </g>
    <path
       style="fill:none;fill-rule:evenodd;stroke:#000000;stroke-width:2;stroke-linecap:butt;stroke-linejoin:miter;marker-end:url(#Arrow1Lend);stroke-miterlimit:4;stroke-dasharray:none;stroke-opacity:1"
       d="M 383.75886,-92.679504 L 383.75886,10.356056"
       id="path3780" />
    <path
       style="fill:none;fill-rule:evenodd;stroke:#000000;stroke-width:2;stroke-linecap:butt;stroke-linejoin:miter;marker-end:url(#Arrow1Lend);stroke-miterlimit:4;stroke-dasharray:none;stroke-opacity:1"
       d="M 465.58122,107.3307 L 568.61678,107.3307"
       id="path3789" />
    <text
       xml:space="preserve"
       style="font-size:22px;font-style:normal;font-weight:normal;fill:#000000;fill-opacity:1;stroke:none;stroke-width:1px;stroke-linecap:butt;stroke-linejoin:miter;stroke-opacity:1;font-family:Bitstream Vera Sans"
       x="605.08136"
       y="465.53378"
       id="text3791"
       transform="translate(-110.20573,-380.42644)"><tspan
         sodipodi:role="line"
         id="tspan3793"
         x="605.08136"
         y="465.53378">yes</tspan></text>
    <path
       style="fill:none;fill-rule:evenodd;stroke:#000000;stroke-width:2;stroke-linecap:butt;stroke-linejoin:miter;marker-end:url(#Arrow1Lend);stroke-miterlimit:4;stroke-dasharray:none;stroke-opacity:1"
       d="M 378.7081,186.1226 L 378.7081,289.15816"
       id="path3795" />
    <text
       xml:space="preserve"
       style="font-size:22px;font-style:normal;font-weight:normal;fill:#000000;fill-opacity:1;stroke:none;stroke-width:1px;stroke-linecap:butt;stroke-linejoin:miter;stroke-opacity:1;font-family:Bitstream Vera Sans"
       x="519.21838"
       y="613.01605"
       id="text3797"
       transform="translate(-110.20573,-380.42644)"><tspan
         sodipodi:role="line"
         id="tspan3799"
         x="519.21838"
         y="613.01605">no</tspan></text>
    <g
       id="g3801"
       transform="translate(486.26111,-98.055773)">
      <rect
         y="169.13379"
         x="110.20305"
         height="84.627197"
         width="144.31544"
         id="rect3803"
         style="fill:none;fill-opacity:1;stroke:#000000;stroke-width:2;stroke-miterlimit:4;stroke-dasharray:none;stroke-dashoffset:0;stroke-opacity:1" />
      <g
         id="g3805">
        <text
           sodipodi:linespacing="125%"
           xml:space="preserve"
           style="font-size:22px;font-style:normal;font-weight:normal;line-height:125%;fill:#000000;fill-opacity:1;stroke:none;stroke-width:1px;stroke-linecap:butt;stroke-linejoin:miter;stroke-opacity:1;font-family:Bitstream Vera Sans"
           x="136.82103"
           y="205.10408"
           id="text3807"><tspan
             id="tspan3809"
             sodipodi:role="line"
             x="136.82103"
             y="205.10408">(4)</tspan><tspan
             id="tspan3811"
             sodipodi:role="line"
             x="136.82103"
             y="232.60408">x = x/2</tspan></text>
      </g>
    </g>
    <g
       id="g3813"
       transform="translate(200.38794,133.26916)">
      <rect
         y="169.13379"
         x="110.20305"
         height="84.627197"
         width="144.31544"
         id="rect3815"
         style="fill:none;fill-opacity:1;stroke:#000000;stroke-width:2;stroke-miterlimit:4;stroke-dasharray:none;stroke-dashoffset:0;stroke-opacity:1" />
      <g
         id="g3817">
        <text
           sodipodi:linespacing="125%"
           xml:space="preserve"
           style="font-size:22px;font-style:normal;font-weight:normal;line-height:125%;fill:#000000;fill-opacity:1;stroke:none;stroke-width:1px;stroke-linecap:butt;stroke-linejoin:miter;stroke-opacity:1;font-family:Bitstream Vera Sans"
           x="136.82103"
           y="205.10408"
           id="text3819"><tspan
             id="tspan3821"
             sodipodi:role="line"
             x="136.82103"
             y="205.10408">(5)</tspan><tspan
             id="tspan3823"
             sodipodi:role="line"
             x="136.82103"
             y="232.60408">x = x/3</tspan></text>
      </g>
    </g>
    <path
       style="fill:none;fill-rule:evenodd;stroke:#000000;stroke-width:2;stroke-linecap:butt;stroke-linejoin:miter;stroke-opacity:1;marker-end:url(#Arrow1Lend);stroke-miterlimit:4;stroke-dasharray:none"
       d="M 408.10163,728.17345 L 217.1828,728.17345 L 217.1828,292.7977"
       id="path3825"
       transform="translate(-110.20573,-380.42644)"
       sodipodi:nodetypes="ccc" />
    <g
       id="g4350"
       transform="translate(9.0913729,-12.121831)">
      <rect
         style="opacity:1;fill:none;fill-opacity:1;stroke:#000000;stroke-width:2;stroke-miterlimit:4;stroke-dasharray:none;stroke-dashoffset:0;stroke-opacity:1"
         id="rect4342"
         width="98.238739"
         height="98.23864"
         x="154.91629"
         y="666.7049"
         transform="matrix(0.7071068,-0.7071068,0.7071068,0.7071068,0,0)" />
      <text
         id="text4344"
         y="356.01318"
         x="632.84344"
         style="font-size:22px;font-style:normal;font-weight:normal;line-height:125%;fill:#000000;fill-opacity:1;stroke:none;stroke-width:1px;stroke-linecap:butt;stroke-linejoin:miter;stroke-opacity:1;font-family:Bitstream Vera Sans"
         xml:space="preserve"
         sodipodi:linespacing="125%"><tspan
           y="356.01318"
           x="632.84344"
           sodipodi:role="line"
           id="tspan4346">(6)</tspan><tspan
           y="383.51318"
           x="632.84344"
           sodipodi:role="line"
           id="tspan4348">x&lt;0</tspan></text>
    </g>
    <text
       xml:space="preserve"
       style="font-size:22px;font-style:normal;font-weight:normal;fill:#000000;fill-opacity:1;stroke:none;stroke-width:1px;stroke-linecap:butt;stroke-linejoin:miter;stroke-opacity:1;font-family:Bitstream Vera Sans"
       x="420.22345"
       y="858.48309"
       id="text4364"
       transform="translate(-110.20573,-380.42644)"><tspan
         sodipodi:role="line"
         id="tspan4366"
         x="420.22345"
         y="858.48309">Trouver une vraie machine !</tspan></text>
  </g>
</svg>
