<?xml version="1.0" encoding="UTF-8" standalone="no"?>
<!-- Created with Inkscape (http://www.inkscape.org/) -->
<svg
   xmlns:dc="http://purl.org/dc/elements/1.1/"
   xmlns:cc="http://creativecommons.org/ns#"
   xmlns:rdf="http://www.w3.org/1999/02/22-rdf-syntax-ns#"
   xmlns:svg="http://www.w3.org/2000/svg"
   xmlns="http://www.w3.org/2000/svg"
   xmlns:sodipodi="http://sodipodi.sourceforge.net/DTD/sodipodi-0.dtd"
   xmlns:inkscape="http://www.inkscape.org/namespaces/inkscape"
   width="760.96051"
   height="516.25098"
   id="svg2"
   sodipodi:version="0.32"
   inkscape:version="0.46"
   sodipodi:docname="nelder-mead-extension.svg"
   inkscape:output_extension="org.inkscape.output.svg.inkscape"
   inkscape:export-filename="D:\TclRep\tclrep_cvs\doc\neldermead\nelder.mead.extension.png"
   inkscape:export-xdpi="90"
   inkscape:export-ydpi="90"
   version="1.0">
  <defs
     id="defs4">
    <marker
       inkscape:stockid="Arrow1Lend"
       orient="auto"
       refY="0"
       refX="0"
       id="Arrow1Lend"
       style="overflow:visible">
      <path
         id="path3318"
         d="M 0,0 L 5,-5 L -12.5,0 L 5,5 L 0,0 z"
         style="fill-rule:evenodd;stroke:#000000;stroke-width:1pt;marker-start:none"
         transform="matrix(-0.8,0,0,-0.8,-10,0)" />
    </marker>
    <inkscape:perspective
       sodipodi:type="inkscape:persp3d"
       inkscape:vp_x="0 : 526.18109 : 1"
       inkscape:vp_y="0 : 1000 : 0"
       inkscape:vp_z="744.09448 : 526.18109 : 1"
       inkscape:persp3d-origin="372.04724 : 350.78739 : 1"
       id="perspective10" />
  </defs>
  <sodipodi:namedview
     id="base"
     pagecolor="#ffffff"
     bordercolor="#666666"
     borderopacity="1.0"
     inkscape:pageopacity="0.0"
     inkscape:pageshadow="2"
     inkscape:zoom="0.7"
     inkscape:cx="330.2877"
     inkscape:cy="311.45737"
     inkscape:document-units="px"
     inkscape:current-layer="layer1"
     showgrid="false"
     inkscape:window-width="1280"
     inkscape:window-height="975"
     inkscape:window-x="1769"
     inkscape:window-y="21" />
  <metadata
     id="metadata7">
    <rdf:RDF>
      <cc:Work
         rdf:about="">
        <dc:format>image/svg+xml</dc:format>
        <dc:type
           rdf:resource="http://purl.org/dc/dcmitype/StillImage" />
      </cc:Work>
    </rdf:RDF>
  </metadata>
  <g
     inkscape:label="Calque 1"
     inkscape:groupmode="layer"
     id="layer1"
     transform="translate(-73.241138,-175.12971)">
    <text
       xml:space="preserve"
       style="font-size:40px;font-style:normal;font-weight:normal;fill:#000000;fill-opacity:1;stroke:none;stroke-width:1px;stroke-linecap:butt;stroke-linejoin:miter;stroke-opacity:1;font-family:Bitstream Vera Sans"
       x="197.9899"
       y="425.05746"
       id="text3303"><tspan
         sodipodi:role="line"
         id="tspan3305"
         x="197.9899"
         y="425.05746"
         style="font-style:italic;font-weight:normal" /></text>
    <text
       xml:space="preserve"
       style="font-size:40px;font-style:normal;font-weight:bold;fill:#000000;fill-opacity:1;stroke:none;stroke-width:1px;stroke-linecap:butt;stroke-linejoin:miter;stroke-opacity:1;font-family:Bitstream Vera Sans"
       x="189.90868"
       y="417.98639"
       id="text3315"><tspan
         sodipodi:role="line"
         id="tspan3317"
         x="189.90868"
         y="417.98639" /></text>
    <path
       style="fill:none;fill-rule:evenodd;stroke:#000000;stroke-width:1;stroke-linecap:butt;stroke-linejoin:miter;stroke-miterlimit:4;stroke-dasharray:none;stroke-opacity:1"
       d="M 219.20646,335.90788 L 217.66334,195.83654 L 322.12531,296.03476 L 219.20646,335.90788 z"
       id="path2423"
       sodipodi:nodetypes="cccc" />
    <text
       xml:space="preserve"
       style="font-size:21.10450363px;font-style:normal;font-weight:normal;fill:#000000;fill-opacity:1;stroke:none;stroke-width:1px;stroke-linecap:butt;stroke-linejoin:miter;stroke-opacity:1;font-family:Bitstream Vera Sans"
       x="339.00677"
       y="428.50693"
       id="text3339"><tspan
         sodipodi:role="line"
         id="tspan3341"
         x="339.00677"
         y="428.50693">R</tspan></text>
    <text
       xml:space="preserve"
       style="font-size:21.10450363px;font-style:normal;font-weight:normal;fill:#000000;fill-opacity:1;stroke:none;stroke-width:1px;stroke-linecap:butt;stroke-linejoin:miter;stroke-opacity:1;font-family:Bitstream Vera Sans"
       x="193.64638"
       y="190.23674"
       id="text2438"><tspan
         sodipodi:role="line"
         id="tspan2440"
         x="193.64638"
         y="190.23674">H</tspan></text>
    <text
       xml:space="preserve"
       style="font-size:21.10450363px;font-style:normal;font-weight:normal;fill:#000000;fill-opacity:1;stroke:none;stroke-width:1px;stroke-linecap:butt;stroke-linejoin:miter;stroke-opacity:1;font-family:Bitstream Vera Sans"
       x="207.29414"
       y="364.93076"
       id="text2442"><tspan
         sodipodi:role="line"
         id="tspan2444"
         x="207.29414"
         y="364.93076">L</tspan></text>
    <text
       xml:space="preserve"
       style="font-size:21.10450363px;font-style:normal;font-weight:normal;fill:#000000;fill-opacity:1;stroke:none;stroke-width:1px;stroke-linecap:butt;stroke-linejoin:miter;stroke-opacity:1;font-family:Bitstream Vera Sans"
       x="336.59366"
       y="302.30127"
       id="text2446"><tspan
         sodipodi:role="line"
         id="tspan2448"
         x="336.59366"
         y="302.30127">N</tspan></text>
    <text
       xml:space="preserve"
       style="font-size:21.10450363px;font-style:normal;font-weight:normal;fill:#000000;fill-opacity:1;stroke:none;stroke-width:1px;stroke-linecap:butt;stroke-linejoin:miter;stroke-opacity:1;font-family:Bitstream Vera Sans"
       x="395.74493"
       y="513.42316"
       id="text2450"><tspan
         sodipodi:role="line"
         id="tspan2452"
         x="395.74493"
         y="513.42316">E</tspan></text>
    <path
       style="fill:none;fill-rule:evenodd;stroke:#000000;stroke-width:1;stroke-linecap:butt;stroke-linejoin:miter;stroke-miterlimit:4;stroke-dasharray:1, 3;stroke-dashoffset:0;stroke-opacity:1"
       d="M 331.92535,418.97454 L 218.99497,336.33396 L 321.94171,296.37352 L 331.92535,418.97454 z"
       id="path2454"
       sodipodi:nodetypes="cccc" />
    <path
       style="fill:none;fill-rule:evenodd;stroke:#000000;stroke-width:1;stroke-linecap:butt;stroke-linejoin:miter;stroke-miterlimit:4;stroke-dasharray:1, 3;stroke-dashoffset:0;stroke-opacity:1"
       d="M 386.39729,523.7859 L 217.92647,196.33127"
       id="path3226"
       sodipodi:nodetypes="cc" />
    <path
       sodipodi:type="arc"
       style="fill:none;stroke:#000000;stroke-width:1;stroke-miterlimit:4;stroke-dasharray:1, 4.00000001;stroke-dashoffset:0;stroke-opacity:1"
       id="path3228"
       sodipodi:cx="375.77673"
       sodipodi:cy="472.02954"
       sodipodi:rx="50.507626"
       sodipodi:ry="18.687822"
       d="M 426.28436,472.02954 A 50.507626,18.687822 0 1 1 325.26911,472.02954 A 50.507626,18.687822 0 1 1 426.28436,472.02954 z"
       transform="matrix(0.8660254,-0.5,0.5,0.8660254,-152.3352,348.10297)" />
    <path
       sodipodi:type="arc"
       style="fill:none;stroke:#000000;stroke-width:0.44742242;stroke-miterlimit:4;stroke-dasharray:0.44742241, 1.78968964;stroke-dashoffset:0;stroke-opacity:1"
       id="path3230"
       sodipodi:cx="375.77673"
       sodipodi:cy="472.02954"
       sodipodi:rx="50.507626"
       sodipodi:ry="18.687822"
       d="M 426.28436,472.02954 A 50.507626,18.687822 0 1 1 325.26911,472.02954 A 50.507626,18.687822 0 1 1 426.28436,472.02954 z"
       transform="matrix(1.9355879,-1.1175122,1.1175122,1.9355879,-842.70542,74.802419)" />
    <path
       sodipodi:type="arc"
       style="fill:none;stroke:#000000;stroke-width:0.24033611;stroke-miterlimit:4;stroke-dasharray:0.2403361, 0.96134438;stroke-dashoffset:0;stroke-opacity:1"
       id="path3232"
       sodipodi:cx="375.77673"
       sodipodi:cy="472.02954"
       sodipodi:rx="50.507626"
       sodipodi:ry="18.687822"
       d="M 426.28436,472.02954 A 50.507626,18.687822 0 1 1 325.26911,472.02954 A 50.507626,18.687822 0 1 1 426.28436,472.02954 z"
       transform="matrix(3.603393,-2.0804199,2.0804199,3.603393,-1926.4741,-353.05643)" />
    <path
       style="fill:none;fill-rule:evenodd;stroke:#000000;stroke-width:1;stroke-linecap:butt;stroke-linejoin:miter;stroke-miterlimit:4;stroke-dasharray:1, 3;stroke-dashoffset:0;stroke-opacity:1"
       d="M 385.89222,522.90203 L 219.12788,336.09319 L 321.77876,296.13275 L 385.89222,522.90203 z"
       id="path3234"
       sodipodi:nodetypes="cccc" />
    <path
       style="fill:none;fill-rule:evenodd;stroke:#000000;stroke-width:1;stroke-linecap:butt;stroke-linejoin:miter;stroke-miterlimit:4;stroke-dasharray:1, 4;stroke-dashoffset:0;stroke-opacity:1"
       d="M 140.4112,643.2504 C 230.31478,480.61584 457.5991,376.57013 609.12198,375.55998"
       id="path3236"
       sodipodi:nodetypes="cc" />
    <g
       id="g3195"
       transform="translate(257.14286,58.571429)">
      <text
         id="text3238"
         y="223.83533"
         x="397.06253"
         style="font-size:21.10450363px;font-style:normal;font-weight:normal;fill:#000000;fill-opacity:1;stroke:none;stroke-width:1px;stroke-linecap:butt;stroke-linejoin:miter;stroke-opacity:1;font-family:Bitstream Vera Sans"
         xml:space="preserve"><tspan
           y="223.83533"
           x="397.06253"
           id="tspan3240"
           sodipodi:role="line">R = Reflexion</tspan></text>
      <text
         id="text3242"
         y="132.21082"
         x="397.03162"
         style="font-size:21.10450363px;font-style:normal;font-weight:normal;fill:#000000;fill-opacity:1;stroke:none;stroke-width:1px;stroke-linecap:butt;stroke-linejoin:miter;stroke-opacity:1;font-family:Bitstream Vera Sans"
         xml:space="preserve"><tspan
           y="132.21082"
           x="397.03162"
           id="tspan3244"
           sodipodi:role="line">H = Highest</tspan></text>
      <text
         id="text3246"
         y="193.29381"
         x="397.17587"
         style="font-size:21.10450363px;font-style:normal;font-weight:normal;fill:#000000;fill-opacity:1;stroke:none;stroke-width:1px;stroke-linecap:butt;stroke-linejoin:miter;stroke-opacity:1;font-family:Bitstream Vera Sans"
         xml:space="preserve"><tspan
           y="193.29381"
           x="397.17587"
           id="tspan3248"
           sodipodi:role="line">L = Lowest</tspan></text>
      <text
         id="text3250"
         y="162.7523"
         x="397.11404"
         style="font-size:21.10450363px;font-style:normal;font-weight:normal;fill:#000000;fill-opacity:1;stroke:none;stroke-width:1px;stroke-linecap:butt;stroke-linejoin:miter;stroke-opacity:1;font-family:Bitstream Vera Sans"
         xml:space="preserve"><tspan
           y="162.7523"
           x="397.11404"
           id="tspan3252"
           sodipodi:role="line">N = Next to highest</tspan></text>
      <text
         id="text3254"
         y="254.37686"
         x="397.05222"
         style="font-size:21.10450363px;font-style:normal;font-weight:normal;fill:#000000;fill-opacity:1;stroke:none;stroke-width:1px;stroke-linecap:butt;stroke-linejoin:miter;stroke-opacity:1;font-family:Bitstream Vera Sans"
         xml:space="preserve"><tspan
           y="254.37686"
           x="397.05222"
           id="tspan3256"
           sodipodi:role="line">E = Expansion</tspan></text>
    </g>
    <path
       style="fill:none;fill-rule:evenodd;stroke:#000000;stroke-width:1;stroke-linecap:butt;stroke-linejoin:miter;stroke-miterlimit:4;stroke-dasharray:1, 4;stroke-dashoffset:0;stroke-opacity:1"
       d="M 73.741138,577.08541 C 163.64472,414.45085 414.16255,306.36453 565.68543,305.35438"
       id="path3292"
       sodipodi:nodetypes="cc" />
    <text
       xml:space="preserve"
       style="font-size:21.10450363px;font-style:normal;font-weight:normal;fill:#000000;fill-opacity:1;stroke:none;stroke-width:1px;stroke-linecap:butt;stroke-linejoin:miter;stroke-opacity:1;font-family:Bitstream Vera Sans"
       x="516.39172"
       y="663.85913"
       id="text3306"><tspan
         sodipodi:role="line"
         id="tspan3308"
         x="516.39172"
         y="663.85913">Accepted</tspan></text>
    <path
       style="fill:none;fill-rule:evenodd;stroke:#000000;stroke-width:1px;stroke-linecap:butt;stroke-linejoin:miter;marker-end:url(#Arrow1Lend);stroke-opacity:1"
       d="M 508.10673,648.30117 L 416.18285,528.09301"
       id="path3310"
       sodipodi:nodetypes="cc" />
    <path
       sodipodi:type="arc"
       style="fill:#000000;fill-opacity:1;stroke:#000000;stroke-width:1;stroke-miterlimit:4;stroke-dasharray:none;stroke-dashoffset:0;stroke-opacity:1"
       id="path2417"
       sodipodi:cx="333.85541"
       sodipodi:cy="420.00668"
       sodipodi:rx="3.5355339"
       sodipodi:ry="3.5355339"
       d="M 337.39094,420.00668 A 3.5355339,3.5355339 0 1 1 330.31987,420.00668 A 3.5355339,3.5355339 0 1 1 337.39094,420.00668 z"
       transform="translate(-1.5152288,-1.5152288)" />
    <path
       sodipodi:type="arc"
       style="fill:#000000;fill-opacity:1;stroke:#000000;stroke-width:1;stroke-miterlimit:4;stroke-dasharray:none;stroke-dashoffset:0;stroke-opacity:1"
       id="path2419"
       sodipodi:cx="333.85541"
       sodipodi:cy="420.00668"
       sodipodi:rx="3.5355339"
       sodipodi:ry="3.5355339"
       d="M 337.39094,420.00668 A 3.5355339,3.5355339 0 1 1 330.31987,420.00668 A 3.5355339,3.5355339 0 1 1 337.39094,420.00668 z"
       transform="translate(53.285557,104.80333)" />
  </g>
</svg>
