<?xml version="1.0" encoding="UTF-8" standalone="no"?>
<!-- Created with Inkscape (http://www.inkscape.org/) -->
<svg
   xmlns:dc="http://purl.org/dc/elements/1.1/"
   xmlns:cc="http://creativecommons.org/ns#"
   xmlns:rdf="http://www.w3.org/1999/02/22-rdf-syntax-ns#"
   xmlns:svg="http://www.w3.org/2000/svg"
   xmlns="http://www.w3.org/2000/svg"
   xmlns:sodipodi="http://sodipodi.sourceforge.net/DTD/sodipodi-0.dtd"
   xmlns:inkscape="http://www.inkscape.org/namespaces/inkscape"
   width="837.6604"
   height="503.00317"
   id="svg2"
   sodipodi:version="0.32"
   inkscape:version="0.46"
   sodipodi:docname="nelder-mead-contract-outside.svg"
   inkscape:output_extension="org.inkscape.output.svg.inkscape"
   inkscape:export-filename="K:\ProjetTclrep\doc\neldermead\nelder-mead-contract-outside.png"
   inkscape:export-xdpi="90"
   inkscape:export-ydpi="90"
   version="1.0">
  <defs
     id="defs4">
    <marker
       inkscape:stockid="Arrow1Lend"
       orient="auto"
       refY="0"
       refX="0"
       id="Arrow1Lend"
       style="overflow:visible">
      <path
         id="path3318"
         d="M 0,0 L 5,-5 L -12.5,0 L 5,5 L 0,0 z"
         style="fill-rule:evenodd;stroke:#000000;stroke-width:1pt;marker-start:none"
         transform="matrix(-0.8,0,0,-0.8,-10,0)" />
    </marker>
    <inkscape:perspective
       sodipodi:type="inkscape:persp3d"
       inkscape:vp_x="0 : 526.18109 : 1"
       inkscape:vp_y="0 : 1000 : 0"
       inkscape:vp_z="744.09448 : 526.18109 : 1"
       inkscape:persp3d-origin="372.04724 : 350.78739 : 1"
       id="perspective10" />
  </defs>
  <sodipodi:namedview
     id="base"
     pagecolor="#ffffff"
     bordercolor="#666666"
     borderopacity="1.0"
     inkscape:pageopacity="0.0"
     inkscape:pageshadow="2"
     inkscape:zoom="0.98994949"
     inkscape:cx="533.6731"
     inkscape:cy="336.53587"
     inkscape:document-units="px"
     inkscape:current-layer="layer1"
     showgrid="false"
     inkscape:window-width="1533"
     inkscape:window-height="975"
     inkscape:window-x="1798"
     inkscape:window-y="10" />
  <metadata
     id="metadata7">
    <rdf:RDF>
      <cc:Work
         rdf:about="">
        <dc:format>image/svg+xml</dc:format>
        <dc:type
           rdf:resource="http://purl.org/dc/dcmitype/StillImage" />
      </cc:Work>
    </rdf:RDF>
  </metadata>
  <g
     inkscape:label="Calque 1"
     inkscape:groupmode="layer"
     id="layer1"
     transform="translate(-33.845178,-66.596157)">
    <text
       xml:space="preserve"
       style="font-size:40px;font-style:normal;font-weight:normal;fill:#000000;fill-opacity:1;stroke:none;stroke-width:1px;stroke-linecap:butt;stroke-linejoin:miter;stroke-opacity:1;font-family:Bitstream Vera Sans"
       x="197.9899"
       y="425.05746"
       id="text3303"><tspan
         sodipodi:role="line"
         id="tspan3305"
         x="197.9899"
         y="425.05746"
         style="font-style:italic;font-weight:normal" /></text>
    <text
       xml:space="preserve"
       style="font-size:40px;font-style:normal;font-weight:bold;fill:#000000;fill-opacity:1;stroke:none;stroke-width:1px;stroke-linecap:butt;stroke-linejoin:miter;stroke-opacity:1;font-family:Bitstream Vera Sans"
       x="189.90868"
       y="417.98639"
       id="text3315"><tspan
         sodipodi:role="line"
         id="tspan3317"
         x="189.90868"
         y="417.98639" /></text>
    <path
       style="fill:none;fill-rule:evenodd;stroke:#000000;stroke-width:1;stroke-linecap:butt;stroke-linejoin:miter;stroke-miterlimit:4;stroke-dasharray:none;stroke-opacity:1"
       d="M 272.74455,335.90788 L 271.20143,195.83654 L 375.66339,296.03476 L 272.74455,335.90788 z"
       id="path2423"
       sodipodi:nodetypes="cccc" />
    <text
       xml:space="preserve"
       style="font-size:21.10450363px;font-style:normal;font-weight:normal;fill:#000000;fill-opacity:1;stroke:none;stroke-width:1px;stroke-linecap:butt;stroke-linejoin:miter;stroke-opacity:1;font-family:Bitstream Vera Sans"
       x="395.57532"
       y="434.06277"
       id="text3339"><tspan
         sodipodi:role="line"
         id="tspan3341"
         x="395.57532"
         y="434.06277">R</tspan></text>
    <text
       xml:space="preserve"
       style="font-size:21.10450363px;font-style:normal;font-weight:normal;fill:#000000;fill-opacity:1;stroke:none;stroke-width:1px;stroke-linecap:butt;stroke-linejoin:miter;stroke-opacity:1;font-family:Bitstream Vera Sans"
       x="247.18446"
       y="190.23674"
       id="text2438"><tspan
         sodipodi:role="line"
         id="tspan2440"
         x="247.18446"
         y="190.23674">H</tspan></text>
    <text
       xml:space="preserve"
       style="font-size:21.10450363px;font-style:normal;font-weight:normal;fill:#000000;fill-opacity:1;stroke:none;stroke-width:1px;stroke-linecap:butt;stroke-linejoin:miter;stroke-opacity:1;font-family:Bitstream Vera Sans"
       x="253.25607"
       y="352.30386"
       id="text2442"><tspan
         sodipodi:role="line"
         id="tspan2444"
         x="253.25607"
         y="352.30386">L</tspan></text>
    <text
       xml:space="preserve"
       style="font-size:21.10450363px;font-style:normal;font-weight:normal;fill:#000000;fill-opacity:1;stroke:none;stroke-width:1px;stroke-linecap:butt;stroke-linejoin:miter;stroke-opacity:1;font-family:Bitstream Vera Sans"
       x="386.09116"
       y="295.73529"
       id="text2446"><tspan
         sodipodi:role="line"
         id="tspan2448"
         x="386.09116"
         y="295.73529">N</tspan></text>
    <path
       style="fill:none;fill-rule:evenodd;stroke:#000000;stroke-width:1;stroke-linecap:butt;stroke-linejoin:miter;stroke-miterlimit:4;stroke-dasharray:1, 3;stroke-dashoffset:0;stroke-opacity:1"
       d="M 385.46343,418.97454 L 272.53305,336.33396 L 375.47979,296.37352 L 385.46343,418.97454 z"
       id="path2454"
       sodipodi:nodetypes="cccc" />
    <path
       style="fill:none;fill-rule:evenodd;stroke:#000000;stroke-width:1;stroke-linecap:butt;stroke-linejoin:miter;stroke-miterlimit:4;stroke-dasharray:1, 3;stroke-dashoffset:0;stroke-opacity:1"
       d="M 385.89222,419.74019 L 270.60234,196.65251"
       id="path3226"
       sodipodi:nodetypes="cc" />
    <path
       sodipodi:type="arc"
       style="fill:none;stroke:#000000;stroke-width:1;stroke-miterlimit:4;stroke-dasharray:1, 4.00000001;stroke-dashoffset:0;stroke-opacity:1"
       id="path3228"
       sodipodi:cx="375.77673"
       sodipodi:cy="472.02954"
       sodipodi:rx="50.507626"
       sodipodi:ry="18.687822"
       d="M 426.28436,472.02954 A 50.507626,18.687822 0 1 1 325.26911,472.02954 A 50.507626,18.687822 0 1 1 426.28436,472.02954 z"
       transform="matrix(0.8015337,-0.4627657,0.4627657,0.8015337,-162.81098,126.68935)" />
    <path
       sodipodi:type="arc"
       style="fill:none;stroke:#000000;stroke-width:0.44742242;stroke-miterlimit:4;stroke-dasharray:0.44742241, 1.78968964;stroke-dashoffset:0;stroke-opacity:1"
       id="path3230"
       sodipodi:cx="375.77673"
       sodipodi:cy="472.02954"
       sodipodi:rx="50.507626"
       sodipodi:ry="18.687822"
       d="M 426.28436,472.02954 A 50.507626,18.687822 0 1 1 325.26911,472.02954 A 50.507626,18.687822 0 1 1 426.28436,472.02954 z"
       transform="matrix(1.7914474,-1.0342926,1.0342926,1.7914474,-801.7703,-126.25889)" />
    <path
       sodipodi:type="arc"
       style="fill:none;stroke:#000000;stroke-width:0.25967363;stroke-miterlimit:4;stroke-dasharray:0.25967363, 1.03869451;stroke-dashoffset:0;stroke-opacity:1"
       id="path3232"
       sodipodi:cx="375.77673"
       sodipodi:cy="472.02954"
       sodipodi:rx="50.507626"
       sodipodi:ry="18.687822"
       d="M 426.28436,472.02954 A 50.507626,18.687822 0 1 1 325.26911,472.02954 A 50.507626,18.687822 0 1 1 426.28436,472.02954 z"
       transform="matrix(3.3350534,-1.9254939,1.9254939,3.3350534,-1804.8322,-522.25569)" />
    <path
       style="fill:none;fill-rule:evenodd;stroke:#000000;stroke-width:0.92553139;stroke-linecap:butt;stroke-linejoin:miter;stroke-miterlimit:4;stroke-dasharray:0.9255314, 3.7021256;stroke-dashoffset:0;stroke-opacity:1"
       d="M 34.307944,325.48781 C 143.7805,193.14716 369.58171,87.048967 489.61784,73.992208"
       id="path3292"
       sodipodi:nodetypes="cc" />
    <text
       xml:space="preserve"
       style="font-size:21.10450363px;font-style:normal;font-weight:normal;fill:#000000;fill-opacity:1;stroke:none;stroke-width:1px;stroke-linecap:butt;stroke-linejoin:miter;stroke-opacity:1;font-family:Bitstream Vera Sans"
       x="258.45621"
       y="565.40521"
       id="text3306"><tspan
         sodipodi:role="line"
         id="tspan3308"
         x="258.45621"
         y="565.40521">Accepted</tspan></text>
    <path
       style="fill:none;fill-rule:evenodd;stroke:#000000;stroke-width:1px;stroke-linecap:butt;stroke-linejoin:miter;marker-end:url(#Arrow1Lend);stroke-opacity:1"
       d="M 300.55628,539.03138 L 354.57225,382.77102"
       id="path3310"
       sodipodi:nodetypes="cc" />
    <path
       sodipodi:type="arc"
       style="fill:none;stroke:#000000;stroke-width:0.1514795;stroke-miterlimit:4;stroke-dasharray:0.1514795, 0.60591802;stroke-dashoffset:0;stroke-opacity:1"
       id="path3235"
       sodipodi:cx="375.77673"
       sodipodi:cy="472.02954"
       sodipodi:rx="50.507626"
       sodipodi:ry="18.687822"
       d="M 426.28436,472.02954 A 50.507626,18.687822 0 1 1 325.26911,472.02954 A 50.507626,18.687822 0 1 1 426.28436,472.02954 z"
       transform="matrix(5.7171128,-3.3007765,3.3007765,5.7171128,-3358.0596,-1127.1779)" />
    <path
       style="fill:none;fill-rule:evenodd;stroke:#000000;stroke-width:1;stroke-linecap:butt;stroke-linejoin:miter;stroke-miterlimit:4;stroke-dasharray:1, 3;stroke-dashoffset:0;stroke-opacity:1"
       d="M 358.75333,367.91758 L 273.09708,335.78462 L 375.2862,296.32926 L 358.75333,367.91758 z"
       id="path3237"
       sodipodi:nodetypes="cccc" />
    <text
       xml:space="preserve"
       style="font-size:21.10450363px;font-style:normal;font-weight:normal;fill:#000000;fill-opacity:1;stroke:none;stroke-width:1px;stroke-linecap:butt;stroke-linejoin:miter;stroke-opacity:1;font-family:Bitstream Vera Sans"
       x="363.67239"
       y="373.01199"
       id="text3239"><tspan
         sodipodi:role="line"
         id="tspan3241"
         x="363.67239"
         y="373.01199">Co</tspan></text>
    <path
       sodipodi:type="arc"
       style="fill:#000000;fill-opacity:1;stroke:#000000;stroke-width:1;stroke-miterlimit:4;stroke-dasharray:none;stroke-dashoffset:0;stroke-opacity:1"
       id="path3243"
       sodipodi:cx="304.561"
       sodipodi:cy="367.98383"
       sodipodi:rx="2.2728431"
       sodipodi:ry="2.2728431"
       d="M 306.83385,367.98383 A 2.2728431,2.2728431 0 1 1 302.28816,367.98383 A 2.2728431,2.2728431 0 1 1 306.83385,367.98383 z"
       transform="translate(53.538085,0)" />
    <path
       sodipodi:type="arc"
       style="fill:#000000;fill-opacity:1;stroke:#000000;stroke-width:1;stroke-miterlimit:4;stroke-dasharray:none;stroke-dashoffset:0;stroke-opacity:1"
       id="path3245"
       sodipodi:cx="304.561"
       sodipodi:cy="367.98383"
       sodipodi:rx="2.2728431"
       sodipodi:ry="2.2728431"
       d="M 306.83385,367.98383 A 2.2728431,2.2728431 0 1 1 302.28816,367.98383 A 2.2728431,2.2728431 0 1 1 306.83385,367.98383 z"
       transform="translate(80.812192,51.517787)" />
    <g
       id="g3198"
       transform="translate(199.00005,-352.54324)">
      <text
         id="text3238"
         y="524.6214"
         x="492.50925"
         style="font-size:21.10450363px;font-style:normal;font-weight:normal;fill:#000000;fill-opacity:1;stroke:none;stroke-width:1px;stroke-linecap:butt;stroke-linejoin:miter;stroke-opacity:1;font-family:Bitstream Vera Sans"
         xml:space="preserve"><tspan
           y="524.6214"
           x="492.50925"
           id="tspan3240"
           sodipodi:role="line">R = Reflexion</tspan></text>
      <text
         id="text3242"
         y="434.24643"
         x="492.47833"
         style="font-size:21.10450363px;font-style:normal;font-weight:normal;fill:#000000;fill-opacity:1;stroke:none;stroke-width:1px;stroke-linecap:butt;stroke-linejoin:miter;stroke-opacity:1;font-family:Bitstream Vera Sans"
         xml:space="preserve"><tspan
           y="434.24643"
           x="492.47833"
           id="tspan3244"
           sodipodi:role="line">H = Highest</tspan></text>
      <text
         id="text3246"
         y="497.1207"
         x="492.62259"
         style="font-size:21.10450363px;font-style:normal;font-weight:normal;fill:#000000;fill-opacity:1;stroke:none;stroke-width:1px;stroke-linecap:butt;stroke-linejoin:miter;stroke-opacity:1;font-family:Bitstream Vera Sans"
         xml:space="preserve"><tspan
           y="497.1207"
           x="492.62259"
           id="tspan3248"
           sodipodi:role="line">L = Lowest</tspan></text>
      <text
         id="text3250"
         y="465.68356"
         x="492.56076"
         style="font-size:21.10450363px;font-style:normal;font-weight:normal;fill:#000000;fill-opacity:1;stroke:none;stroke-width:1px;stroke-linecap:butt;stroke-linejoin:miter;stroke-opacity:1;font-family:Bitstream Vera Sans"
         xml:space="preserve"><tspan
           y="465.68356"
           x="492.56076"
           id="tspan3252"
           sodipodi:role="line">N = Next to highest</tspan></text>
      <text
         id="text3259"
         y="552.12207"
         x="494.16833"
         style="font-size:21.10450363px;font-style:normal;font-weight:normal;fill:#000000;fill-opacity:1;stroke:none;stroke-width:1px;stroke-linecap:butt;stroke-linejoin:miter;stroke-opacity:1;font-family:Bitstream Vera Sans"
         xml:space="preserve"><tspan
           y="552.12207"
           x="494.16833"
           id="tspan3261"
           sodipodi:role="line">Co = Contraction </tspan><tspan
           id="tspan3263"
           y="578.50269"
           x="494.16833"
           sodipodi:role="line">       (outside)</tspan></text>
      <text
         id="text2586"
         y="610.19745"
         x="493.97253"
         style="font-size:21.10450363px;font-style:normal;font-weight:normal;fill:#000000;fill-opacity:1;stroke:none;stroke-width:1px;stroke-linecap:butt;stroke-linejoin:miter;stroke-opacity:1;font-family:Bitstream Vera Sans"
         xml:space="preserve"><tspan
           y="610.19745"
           x="493.97253"
           id="tspan2588"
           sodipodi:role="line">f(N)≤f(R)&lt;f(H)</tspan></text>
    </g>
  </g>
</svg>
