<?xml version="1.0" encoding="UTF-8" standalone="no"?>
<svg xmlns="http://www.w3.org/2000/svg"
     xmlns:xlink="http://www.w3.org/1999/xlink"
     width="610px" height="460px" viewBox="0 0 610 460">
<title>Graphic window number 0</title>
<desc>
Creator: GL2PS 1.3.2, (C) 1999-2006 Christophe Geuzaine (geuz@geuz.org)
For: Scilab
CreationDate: Fri Nov 27 19:46:48 2009
</desc>
<defs>
</defs>
<polygon fill="#ffffff" points="0,0 610,0 610,460 0,460"/>
<g>
<polygon fill="#ffffff" points="76.25,402.5 533.75,57.5 76.25,57.5"/>
<polygon fill="#ffffff" points="76.25,402.5 533.75,402.5 533.75,57.5"/>
<polygon fill="#ffffff" points="76.25,402.5 533.75,402.5 533.75,402.5"/>
<polygon fill="#ffffff" points="76.25,402.5 76.25,57.5 76.25,57.5"/>
<polygon fill="#ffffff" points="76.25,402.5 533.75,402.5 76.25,402.5"/>
<polygon fill="#ffffff" points="76.25,402.5 76.25,57.5 76.25,402.5"/>
<text fill="#000000" x="480" y="419" transform="rotate(-0, 480, 419)" font-size="10" font-family="SansSerif" font-style="normal" font-weight="normal">0.8</text>
<text fill="#000000" x="434" y="419" transform="rotate(-0, 434, 419)" font-size="10" font-family="SansSerif" font-style="normal" font-weight="normal">0.6</text>
<text fill="#000000" x="389" y="419" transform="rotate(-0, 389, 419)" font-size="10" font-family="SansSerif" font-style="normal" font-weight="normal">0.4</text>
<text fill="#000000" x="343" y="419" transform="rotate(-0, 343, 419)" font-size="10" font-family="SansSerif" font-style="normal" font-weight="normal">0.2</text>
<text fill="#000000" x="297" y="419" transform="rotate(-0, 297, 419)" font-size="10" font-family="SansSerif" font-style="normal" font-weight="normal">0.0</text>
<text fill="#000000" x="250" y="419" transform="rotate(-0, 250, 419)" font-size="10" font-family="SansSerif" font-style="normal" font-weight="normal">-0.2</text>
<text fill="#000000" x="204" y="419" transform="rotate(-0, 204, 419)" font-size="10" font-family="SansSerif" font-style="normal" font-weight="normal">-0.4</text>
<text fill="#000000" x="158" y="419" transform="rotate(-0, 158, 419)" font-size="10" font-family="SansSerif" font-style="normal" font-weight="normal">-0.6</text>
<text fill="#000000" x="113" y="419" transform="rotate(-0, 113, 419)" font-size="10" font-family="SansSerif" font-style="normal" font-weight="normal">-0.8</text>
<text fill="#000000" x="67" y="419" transform="rotate(-0, 67, 419)" font-size="10" font-family="SansSerif" font-style="normal" font-weight="normal">-1.0</text>
<text fill="#000000" x="53" y="62" transform="rotate(-0, 53, 62)" font-size="10" font-family="SansSerif" font-style="normal" font-weight="normal">1.0</text>
<text fill="#000000" x="52" y="97" transform="rotate(-0, 52, 97)" font-size="10" font-family="SansSerif" font-style="normal" font-weight="normal">0.8</text>
<text fill="#000000" x="52" y="131" transform="rotate(-0, 52, 131)" font-size="10" font-family="SansSerif" font-style="normal" font-weight="normal">0.6</text>
<text fill="#000000" x="52" y="166" transform="rotate(-0, 52, 166)" font-size="10" font-family="SansSerif" font-style="normal" font-weight="normal">0.4</text>
<text fill="#000000" x="52" y="200" transform="rotate(-0, 52, 200)" font-size="10" font-family="SansSerif" font-style="normal" font-weight="normal">0.2</text>
<text fill="#000000" x="52" y="235" transform="rotate(-0, 52, 235)" font-size="10" font-family="SansSerif" font-style="normal" font-weight="normal">0.0</text>
<text fill="#000000" x="49" y="269" transform="rotate(-0, 49, 269)" font-size="10" font-family="SansSerif" font-style="normal" font-weight="normal">-0.2</text>
<text fill="#000000" x="49" y="304" transform="rotate(-0, 49, 304)" font-size="10" font-family="SansSerif" font-style="normal" font-weight="normal">-0.4</text>
<text fill="#000000" x="49" y="339" transform="rotate(-0, 49, 339)" font-size="10" font-family="SansSerif" font-style="normal" font-weight="normal">-0.6</text>
<text fill="#000000" x="49" y="373" transform="rotate(-0, 49, 373)" font-size="10" font-family="SansSerif" font-style="normal" font-weight="normal">-0.8</text>
<text fill="#000000" x="49" y="407" transform="rotate(-0, 49, 407)" font-size="10" font-family="SansSerif" font-style="normal" font-weight="normal">-1.0</text>
<text fill="#000000" x="526" y="419" transform="rotate(-0, 526, 419)" font-size="10" font-family="SansSerif" font-style="normal" font-weight="normal">1.0</text>
<polyline fill="none" stroke="#000000" stroke-width="1" points="510.875,402.5 510.875,405.605"/>
<polyline fill="none" stroke="#000000" stroke-width="1" points="419.375,402.5 419.375,405.605"/>
<polyline fill="none" stroke="#000000" stroke-width="1" points="373.625,402.5 373.625,405.605"/>
<polyline fill="none" stroke="#000000" stroke-width="1" points="327.875,402.5 327.875,405.605"/>
<polyline fill="none" stroke="#000000" stroke-width="1" points="282.125,402.5 282.125,405.605"/>
<polyline fill="none" stroke="#000000" stroke-width="1" points="236.375,402.5 236.375,405.605"/>
<polyline fill="none" stroke="#000000" stroke-width="1" points="190.625,402.5 190.625,405.605"/>
<polyline fill="none" stroke="#000000" stroke-width="1" points="144.875,402.5 144.875,405.605"/>
<polyline fill="none" stroke="#000000" stroke-width="1" points="99.125,402.5 99.125,405.605"/>
<polyline fill="none" stroke="#000000" stroke-width="1" points="533.75,402.5 533.75,407.675"/>
<polyline fill="none" stroke="#000000" stroke-width="1" points="488,402.5 488,407.675"/>
<polyline fill="none" stroke="#000000" stroke-width="1" points="442.25,402.5 442.25,407.675"/>
<polyline fill="none" stroke="#000000" stroke-width="1" points="396.5,402.5 396.5,407.675"/>
<polyline fill="none" stroke="#000000" stroke-width="1" points="350.75,402.5 350.75,407.675"/>
<polyline fill="none" stroke="#000000" stroke-width="1" points="305,402.5 305,407.675"/>
<polyline fill="none" stroke="#000000" stroke-width="1" points="259.25,402.5 259.25,407.675"/>
<polyline fill="none" stroke="#000000" stroke-width="1" points="213.5,402.5 213.5,407.675"/>
<polyline fill="none" stroke="#000000" stroke-width="1" points="167.75,402.5 167.75,407.675"/>
<polyline fill="none" stroke="#000000" stroke-width="1" points="122,402.5 122,407.675"/>
<polyline fill="none" stroke="#000000" stroke-width="1" points="76.25,402.5 76.25,407.675"/>
<polyline fill="none" stroke="#000000" stroke-width="1" points="76.25,402.5 533.75,402.5"/>
<polyline fill="none" stroke="#000000" stroke-width="1" points="76.25,74.75 72.1372,74.75"/>
<polyline fill="none" stroke="#000000" stroke-width="1" points="76.25,109.25 72.1372,109.25"/>
<polyline fill="none" stroke="#000000" stroke-width="1" points="76.25,143.75 72.1372,143.75"/>
<polyline fill="none" stroke="#000000" stroke-width="1" points="76.25,178.25 72.1372,178.25"/>
<polyline fill="none" stroke="#000000" stroke-width="1" points="76.25,212.75 72.1372,212.75"/>
<polyline fill="none" stroke="#000000" stroke-width="1" points="76.25,247.25 72.1372,247.25"/>
<polyline fill="none" stroke="#000000" stroke-width="1" points="76.25,281.75 72.1372,281.75"/>
<polyline fill="none" stroke="#000000" stroke-width="1" points="76.25,316.25 72.1372,316.25"/>
<polyline fill="none" stroke="#000000" stroke-width="1" points="76.25,350.75 72.1372,350.75"/>
<polyline fill="none" stroke="#000000" stroke-width="1" points="76.25,385.25 72.1372,385.25"/>
<polyline fill="none" stroke="#000000" stroke-width="1" points="76.25,57.5 69.395,57.5"/>
<polyline fill="none" stroke="#000000" stroke-width="1" points="76.25,92 69.395,92"/>
<polyline fill="none" stroke="#000000" stroke-width="1" points="76.25,126.5 69.395,126.5"/>
<polyline fill="none" stroke="#000000" stroke-width="1" points="76.25,161 69.395,161"/>
<polyline fill="none" stroke="#000000" stroke-width="1" points="76.25,195.5 69.395,195.5"/>
<polyline fill="none" stroke="#000000" stroke-width="1" points="76.25,230 69.395,230"/>
<polyline fill="none" stroke="#000000" stroke-width="1" points="76.25,264.5 69.395,264.5"/>
<polyline fill="none" stroke="#000000" stroke-width="1" points="76.25,299 69.395,299"/>
<polyline fill="none" stroke="#000000" stroke-width="1" points="76.25,333.5 69.395,333.5"/>
<polyline fill="none" stroke="#000000" stroke-width="1" points="76.25,368 69.395,368"/>
<polyline fill="none" stroke="#000000" stroke-width="1" points="76.25,402.5 69.395,402.5"/>
<polyline fill="none" stroke="#000000" stroke-width="1" points="76.25,402.5 76.25,57.5"/>
<polyline fill="none" stroke="#000000" stroke-width="1" points="465.125,402.5 465.125,405.605"/>
<text fill="#000000" x="89" y="392" transform="rotate(0, 89, 392)" font-size="10" font-family="SansSerif" font-style="normal" font-weight="normal"> 1.82</text>
<text fill="#000000" x="100" y="72" transform="rotate(0, 100, 72)" font-size="10" font-family="SansSerif" font-style="normal" font-weight="normal"> 1.64</text>
<text fill="#000000" x="112" y="375" transform="rotate(0, 112, 375)" font-size="10" font-family="SansSerif" font-style="normal" font-weight="normal"> 1.45</text>
<text fill="#000000" x="112" y="81" transform="rotate(0, 112, 81)" font-size="10" font-family="SansSerif" font-style="normal" font-weight="normal"> 1.45</text>
<text fill="#000000" x="502" y="81" transform="rotate(0, 502, 81)" font-size="10" font-family="SansSerif" font-style="normal" font-weight="normal"> 1.45</text>
<text fill="#000000" x="502" y="375" transform="rotate(0, 502, 375)" font-size="10" font-family="SansSerif" font-style="normal" font-weight="normal"> 1.45</text>
<text fill="#000000" x="125" y="366" transform="rotate(0, 125, 366)" font-size="10" font-family="SansSerif" font-style="normal" font-weight="normal"> 1.27</text>
<text fill="#000000" x="125" y="90" transform="rotate(0, 125, 90)" font-size="10" font-family="SansSerif" font-style="normal" font-weight="normal"> 1.27</text>
<text fill="#000000" x="489" y="90" transform="rotate(0, 489, 90)" font-size="10" font-family="SansSerif" font-style="normal" font-weight="normal"> 1.27</text>
<text fill="#000000" x="489" y="366" transform="rotate(0, 489, 366)" font-size="10" font-family="SansSerif" font-style="normal" font-weight="normal"> 1.27</text>
<text fill="#000000" x="138" y="355" transform="rotate(0, 138, 355)" font-size="10" font-family="SansSerif" font-style="normal" font-weight="normal"> 1.09</text>
<text fill="#000000" x="138" y="101" transform="rotate(0, 138, 101)" font-size="10" font-family="SansSerif" font-style="normal" font-weight="normal"> 1.09</text>
<text fill="#000000" x="476" y="101" transform="rotate(0, 476, 101)" font-size="10" font-family="SansSerif" font-style="normal" font-weight="normal"> 1.09</text>
<text fill="#000000" x="476" y="355" transform="rotate(0, 476, 355)" font-size="10" font-family="SansSerif" font-style="normal" font-weight="normal"> 1.09</text>
<text fill="#000000" x="500" y="203" transform="rotate(0, 500, 203)" font-size="10" font-family="SansSerif" font-style="normal" font-weight="normal"> 0.727</text>
<text fill="#000000" x="473" y="200" transform="rotate(0, 473, 200)" font-size="10" font-family="SansSerif" font-style="normal" font-weight="normal"> 0.545</text>
<text fill="#000000" x="445" y="218" transform="rotate(0, 445, 218)" font-size="10" font-family="SansSerif" font-style="normal" font-weight="normal"> 0.364</text>
<text fill="#000000" x="404" y="215" transform="rotate(0, 404, 215)" font-size="10" font-family="SansSerif" font-style="normal" font-weight="normal"> 0.182</text>
<text fill="#000000" x="100" y="384" transform="rotate(0, 100, 384)" font-size="10" font-family="SansSerif" font-style="normal" font-weight="normal"> 1.64</text>
<polyline fill="none" stroke="#000000" stroke-width="1" points="291.822,302.863 294.94,303.136 295.85,303.216 296.942,303.273 299.177,303.391 300.425,303.457 301.792,303.48 303.592,303.512 305,303.537 306.408,303.512 308.208,303.48 309.575,303.457 310.823,303.391 313.058,303.273 314.15,303.216 315.06,303.136 318.178,302.863 318.725,302.815 319.141,302.764 321.696,302.45 323.066,302.273 323.3,302.244 323.651,302.186 326.827,301.66 327.875,301.486 329.622,301.133 330.475,300.96 332.45,300.561 334.021,300.185 336.119,299.683 337.025,299.467 337.478,299.342 338.716,299 340.799,298.396 341.6,298.164 343.566,297.518 344.014,297.37 346.175,296.66 347.165,296.296 349.196,295.55 350.223,295.152 350.75,294.948 352.596,294.158 353.159,293.917 355.325,292.99 356.053,292.649 357.224,292.1 358.839,291.3 359.9,290.774 361.543,289.889 363.843,288.65 364.203,288.444 364.475,288.289 366.728,286.899 367.109,286.664 369.05,285.466 369.238,285.342 369.452,285.2 371.608,283.679 373.625,282.256 373.96,282.003 374.296,281.75 376.183,280.229 378.2,278.603 378.388,278.441 378.553,278.3 380.141,276.836 380.453,276.549 382.296,274.85 382.502,274.645 382.775,274.373 384.418,272.639 385.591,271.4 386.289,270.6 387.35,269.382 388.078,268.499 388.53,267.95 389.759,266.317 390.08,265.892 391.127,264.5 391.397,264.103 391.925,263.328 392.915,261.796 393.396,261.05 394.339,259.42 394.534,259.083 395.391,257.6 395.699,256.996 396.5,255.425 396.953,254.492 397.119,254.15 397.406,253.467 398.071,251.885 398.569,250.7 399.1,249.21 399.328,248.567 399.797,247.25 400.027,246.459 400.724,244.064 400.801,243.8 400.841,243.624 401.075,242.59 401.491,240.664 401.559,240.35 401.622,239.938 401.985,237.586 402.091,236.9 402.167,236.077 402.323,234.391 402.41,233.45 402.441,232.419 402.483,231.062 402.516,230 402.483,228.938 402.441,227.581 402.41,226.55 402.323,225.609 402.167,223.923 402.091,223.1 401.985,222.414 401.622,220.063 401.559,219.65 401.491,219.336 401.075,217.41 400.841,216.376 400.801,216.2 400.724,215.936 400.027,213.541 399.797,212.75 399.328,211.433 399.1,210.79 398.569,209.3 398.071,208.115 397.406,206.533 397.119,205.85 396.953,205.508 396.5,204.575 395.699,203.004 395.391,202.4 394.534,200.917 394.339,200.58 393.396,198.95 392.915,198.204 391.925,196.672 391.397,195.897 391.127,195.5 390.08,194.108 389.759,193.683 388.53,192.05 388.078,191.501 387.35,190.618 386.289,189.4 385.591,188.6 384.418,187.361 382.775,185.627 382.502,185.355 382.296,185.15 380.453,183.451 380.141,183.164 378.553,181.7 378.388,181.559 378.2,181.397 376.183,179.771 374.296,178.25 373.96,177.997 373.625,177.744 371.608,176.321 369.452,174.8 369.238,174.658 369.05,174.534 367.109,173.336 366.728,173.101 364.475,171.711 364.203,171.556 363.843,171.35 361.543,170.111 359.9,169.226 358.839,168.7 357.224,167.9 356.053,167.351 355.325,167.01 353.159,166.083 352.596,165.842 350.75,165.052 350.223,164.848 349.196,164.45 347.165,163.704 346.175,163.34 344.014,162.63 343.566,162.482 341.6,161.836 340.799,161.604 338.716,161 337.478,160.658 337.025,160.533 336.119,160.317 334.021,159.815 332.45,159.439 330.475,159.04 329.622,158.867 327.875,158.514 326.827,158.34 323.651,157.814 323.3,157.756 323.066,157.727 321.696,157.55 319.141,157.236 318.725,157.185 318.178,157.137 315.06,156.864 314.15,156.784 313.058,156.727 310.823,156.609 309.575,156.543 308.208,156.52 306.408,156.488 305,156.463 303.592,156.488 301.792,156.52 300.425,156.543 299.177,156.609 296.942,156.727 295.85,156.784 294.94,156.864 291.822,157.137 291.275,157.185 290.859,157.236 288.304,157.55 286.934,157.727 286.7,157.756 286.349,157.814 283.173,158.34 282.125,158.514 280.378,158.867 279.525,159.04 277.55,159.439 275.979,159.815 273.881,160.317 272.975,160.533 272.522,160.658 271.284,161 269.201,161.604 268.4,161.836 266.434,162.482 265.986,162.63 263.825,163.34 262.835,163.704 260.804,164.45 259.777,164.848 259.25,165.052 257.404,165.842 256.841,166.083 254.675,167.01 253.947,167.351 252.776,167.9 251.161,168.7 250.1,169.226 248.457,170.111 246.157,171.35 245.797,171.556 245.525,171.711 243.272,173.101 242.891,173.336 240.95,174.534 240.762,174.658 240.548,174.8 238.392,176.321 236.375,177.744 236.04,177.997 235.704,178.25 233.817,179.771 231.8,181.397 231.612,181.559 231.447,181.7 229.859,183.164 229.547,183.451 227.704,185.15 227.498,185.355 227.225,185.627 225.582,187.361 224.409,188.6 223.711,189.4 222.65,190.618 221.922,191.501 221.47,192.05 220.241,193.683 219.92,194.108 218.873,195.5 218.603,195.897 218.075,196.672 217.085,198.204 216.604,198.95 215.661,200.58 215.466,200.917 214.609,202.4 214.301,203.004 213.5,204.575 213.047,205.508 212.881,205.85 212.594,206.533 211.929,208.115 211.431,209.3 210.9,210.79 210.672,211.433 210.203,212.75 209.973,213.541 209.276,215.936 209.199,216.2 209.159,216.376 208.925,217.41 208.509,219.336 208.441,219.65 208.378,220.063 208.015,222.414 207.909,223.1 207.833,223.923 207.677,225.609 207.59,226.55 207.559,227.581 207.517,228.938 207.484,230 207.517,231.062 207.559,232.419 207.59,233.45 207.677,234.391 207.833,236.077 207.909,236.9 208.015,237.586 208.378,239.938 208.441,240.35 208.509,240.664 208.925,242.59"/>
<polyline fill="none" stroke="#0000ff" stroke-width="1" points="167.75,240.395 168.229,243.439 168.286,243.8 168.382,244.277 168.82,246.443 168.983,247.25 169.266,248.394 169.509,249.374 169.836,250.7 170.286,252.238 170.426,252.718 170.845,254.15 171.145,255.04 171.899,257.279 172.008,257.6 172.079,257.786 172.325,258.43 173.123,260.448 173.361,261.05 173.879,262.222 174.246,263.051 174.886,264.5 175.428,265.61 176.38,267.558 176.572,267.95 176.666,268.126 176.9,268.563 178.009,270.563 178.473,271.4 179.411,272.957 179.784,273.575 180.552,274.85 180.856,275.316 181.475,276.267 182.385,277.614 182.848,278.3 183.98,279.86 184.508,280.587 185.352,281.75 185.609,282.083 186.05,282.65 187.328,284.236 188.105,285.2 189.095,286.354 190.625,288.137 190.899,288.443 191.083,288.65 192.229,289.86 192.799,290.461 194.351,292.1 194.716,292.465 195.2,292.948 196.72,294.404 197.917,295.55 198.759,296.316 199.775,297.239 200.859,298.182 201.799,299 203.015,300.006 204.35,301.111 205.216,301.796 206.042,302.45 207.484,303.537 208.925,304.624 209.792,305.247 210.7,305.9 212.165,306.907 213.5,307.824 214.584,308.532 215.835,309.35 217.06,310.116 218.075,310.751 219.595,311.654 221.526,312.8 222.167,313.165 222.65,313.44 224.824,314.611 225.621,315.04 227.225,315.904 227.499,316.043 227.906,316.25 230.27,317.404 231.8,318.15 233.078,318.736 235.181,319.7 235.935,320.032 236.375,320.227 237.917,320.863 238.88,321.261 240.95,322.114 241.86,322.464 243.646,323.15 244.906,323.617 245.525,323.846 247.216,324.425 248.036,324.707 250.1,325.414 251.209,325.764 253.861,326.6 254.441,326.776 254.675,326.848 255.195,326.992 257.778,327.71 259.25,328.119 261.171,328.602 262.271,328.878 263.825,329.269 264.623,329.448 267.299,330.05 268.154,330.236 268.4,330.289 268.825,330.371 271.795,330.94 272.975,331.167 274.874,331.482 275.511,331.588 277.55,331.926 279.309,332.174 280.609,332.356 282.125,332.57 283.195,332.693 286.068,333.023 286.7,333.096 287.179,333.139 291.216,333.5 291.269,333.504 291.275,333.505 291.282,333.505 295.497,333.766 295.85,333.788 296.251,333.803 299.847,333.936 300.425,333.958 301.042,333.965 304.329,334.006 305,334.014 305.671,334.006 308.958,333.965 309.575,333.958 310.153,333.936 313.749,333.803 314.15,333.788 314.503,333.766 318.718,333.505 318.725,333.505 318.731,333.504 318.784,333.5 322.821,333.139 323.3,333.096 323.932,333.023 326.805,332.693 327.875,332.57 329.391,332.356 330.691,332.174 332.45,331.926 334.489,331.588 335.126,331.482 337.025,331.167 338.205,330.94 341.175,330.371 341.6,330.289 341.846,330.236 342.701,330.05 345.377,329.448 346.175,329.269 347.729,328.878 348.829,328.602 350.75,328.119 352.222,327.71 354.805,326.992 355.325,326.848 355.559,326.776 356.139,326.6 358.791,325.764 359.9,325.414 361.964,324.707 362.784,324.425 364.475,323.846 365.094,323.617 366.354,323.15 368.14,322.464 369.05,322.114 371.12,321.261 372.083,320.863 373.625,320.227 374.065,320.032 374.819,319.7 376.922,318.736 378.2,318.15 379.73,317.404 382.094,316.25 382.501,316.043 382.775,315.904 384.379,315.04 385.176,314.611 387.35,313.44 387.833,313.165 388.474,312.8 390.405,311.654 391.925,310.751 392.94,310.116 394.165,309.35 395.416,308.532 396.5,307.824 397.835,306.907 399.3,305.9 400.208,305.247 401.075,304.624 402.516,303.537 403.958,302.45 404.784,301.796 405.65,301.111 406.985,300.006 408.201,299 409.141,298.182 410.225,297.239 411.241,296.316 412.083,295.55 413.28,294.404 414.8,292.948 415.284,292.465 415.649,292.1 417.201,290.461 417.771,289.86 418.917,288.65 419.101,288.443 419.375,288.137 420.905,286.354 421.895,285.2 422.672,284.236 423.95,282.65 424.391,282.083 424.648,281.75 425.492,280.587 426.02,279.86 427.152,278.3 427.615,277.614 428.525,276.267 429.144,275.316 429.448,274.85 430.216,273.575 430.589,272.957 431.527,271.4 431.991,270.563 433.1,268.563 433.334,268.126 433.428,267.95 433.62,267.558 434.572,265.61 435.114,264.5 435.754,263.051 436.121,262.222 436.639,261.05 436.877,260.448 437.675,258.43 437.921,257.786 437.992,257.6 438.101,257.279 438.855,255.04 439.155,254.15 439.574,252.718 439.714,252.238 440.164,250.7 440.491,249.374 440.734,248.394 441.017,247.25 441.18,246.443 441.618,244.277 441.714,243.8 441.771,243.439 442.25,240.395 442.256,240.354 442.257,240.35 442.257,240.344 442.603,237.166 442.632,236.9 442.651,236.597 442.828,233.886 442.857,233.45 442.867,232.985 442.921,230.506 442.932,230 442.921,229.494 442.867,227.015 442.857,226.55 442.828,226.114 442.651,223.403 442.632,223.1 442.603,222.834 442.257,219.656 442.257,219.65 442.256,219.646 442.25,219.605 441.771,216.561 441.714,216.2 441.618,215.723 441.18,213.557 441.017,212.75 440.734,211.606 440.491,210.626 440.164,209.3 439.714,207.762 439.574,207.282 439.155,205.85 438.855,204.96 438.101,202.721 437.992,202.4 437.921,202.214 437.675,201.57 436.877,199.552 436.639,198.95 436.121,197.778 435.754,196.949 435.114,195.5 434.572,194.39 433.62,192.442 433.428,192.05 433.334,191.874 433.1,191.437 431.991,189.437 431.527,188.6 430.589,187.043 430.216,186.425 429.448,185.15 429.144,184.684 428.525,183.733 427.615,182.386 427.152,181.7 426.02,180.14 425.492,179.413 424.648,178.25 424.391,177.917 423.95,177.35 422.672,175.764 421.895,174.8 420.905,173.646 419.375,171.863 419.101,171.557 418.917,171.35 417.771,170.14 417.201,169.539 415.649,167.9 415.284,167.535 414.8,167.052 413.28,165.596 412.083,164.45 411.241,163.684 410.225,162.761 409.141,161.818 408.201,161 406.985,159.994 405.65,158.889 404.784,158.204 403.958,157.55 402.516,156.463 401.075,155.376 400.208,154.753 399.3,154.1 397.835,153.093 396.5,152.176 395.416,151.468 394.165,150.65 392.94,149.884 391.925,149.249 390.405,148.346 388.474,147.2 387.833,146.835 387.35,146.56 385.176,145.389 384.379,144.96 382.775,144.096 382.501,143.957 382.094,143.75 379.73,142.596 378.2,141.85 376.922,141.264 374.819,140.3 374.065,139.968 373.625,139.773 372.083,139.137 371.12,138.739 369.05,137.886 368.14,137.536 366.354,136.85 365.094,136.383 364.475,136.154 362.784,135.575 361.964,135.293 359.9,134.586 358.791,134.236 356.139,133.4 355.559,133.224 355.325,133.152 354.805,133.008 352.222,132.29 350.75,131.881 348.829,131.398 347.729,131.122 346.175,130.731 345.377,130.552 342.701,129.95 341.846,129.764 341.6,129.711 341.175,129.629 338.205,129.06 337.025,128.833 335.126,128.518 334.489,128.412 332.45,128.074 330.691,127.826 329.391,127.644 327.875,127.43 326.805,127.307 323.932,126.977 323.3,126.904 322.821,126.861 318.784,126.5 318.731,126.496 318.725,126.495 318.718,126.495 314.503,126.234 314.15,126.212 313.749,126.197 310.153,126.064 309.575,126.042 308.958,126.035 305.671,125.994 305,125.986 304.329,125.994 301.042,126.035 300.425,126.042 299.847,126.064 296.251,126.197 295.85,126.212 295.497,126.234 291.282,126.495 291.275,126.495 291.269,126.496 291.216,126.5 287.179,126.861 286.7,126.904 286.068,126.977 283.195,127.307 282.125,127.43 280.609,127.644 279.309,127.826 277.55,128.074 275.511,128.412 274.874,128.518 272.975,128.833 271.795,129.06 268.825,129.629 268.4,129.711 268.154,129.764 267.299,129.95 264.623,130.552 263.825,130.731 262.271,131.122 261.171,131.398 259.25,131.881 257.778,132.29 255.195,133.008 254.675,133.152 254.441,133.224 253.861,133.4 251.209,134.236 250.1,134.586 248.036,135.293 247.216,135.575 245.525,136.154 244.906,136.383 243.646,136.85 241.86,137.536 240.95,137.886 238.88,138.739 237.917,139.137 236.375,139.773 235.935,139.968 235.181,140.3 233.078,141.264 231.8,141.85 230.27,142.596 227.906,143.75 227.499,143.957 227.225,144.096 225.621,144.96 224.824,145.389 222.65,146.56 222.167,146.835 221.526,147.2 219.595,148.346 218.075,149.249 217.06,149.884 215.835,150.65 214.584,151.468 213.5,152.176 212.165,153.093 210.7,154.1 209.792,154.753 208.925,155.376 207.484,156.463 206.042,157.55 205.216,158.204 204.35,158.889 203.015,159.994 201.799,161 200.859,161.818 199.775,162.761 198.759,163.684 197.917,164.45 196.72,165.596 195.2,167.052 194.716,167.535 194.351,167.9 192.799,169.539 192.229,170.14 191.083,171.35 190.899,171.557 190.625,171.863 189.095,173.646 188.105,174.8 187.328,175.764 186.05,177.35 185.609,177.917 185.352,178.25 184.508,179.413 183.98,180.14 182.848,181.7 182.385,182.386 181.475,183.733 180.856,184.684 180.552,185.15 179.784,186.425 179.411,187.043 178.473,188.6 178.009,189.437 176.9,191.437 176.666,191.874 176.572,192.05 176.38,192.442 175.428,194.39 174.886,195.5 174.246,196.949 173.879,197.778 173.361,198.95 173.123,199.552 172.325,201.57 172.079,202.214 172.008,202.4 171.899,202.721 171.145,204.96 170.845,205.85 170.426,207.282 170.286,207.762 169.836,209.3 169.509,210.626 169.266,211.606 168.983,212.75 168.82,213.557 168.382,215.723 168.286,216.2 168.229,216.561 167.75,219.605 167.744,219.646 167.743,219.65 167.743,219.656 167.397,222.834 167.368,223.1 167.349,223.403 167.172,226.114 167.143,226.55 167.133,227.015 167.079,229.494 167.068,230 167.079,230.506 167.133,232.985 167.143,233.45 167.172,233.886 167.349,236.597 167.368,236.9 167.397,237.166 167.743,240.344 167.743,240.35 167.744,240.354 167.75,240.395"/>
<polyline fill="none" stroke="#00ff00" stroke-width="1" points="140.3,258.338 140.995,260.526 141.161,261.05 141.476,261.937 141.945,263.259 142.385,264.5 142.954,265.949 143.261,266.733 143.739,267.95 144.017,268.597 144.875,270.595 145.142,271.199 145.23,271.4 145.433,271.821 146.353,273.735 146.888,274.85 147.609,276.238 148.183,277.344 148.679,278.3 148.907,278.709 149.45,279.684 150.277,281.126 150.636,281.75 151.657,283.414 151.708,283.498 152.752,285.2 153.172,285.843 154.025,287.148 154.695,288.145 155.036,288.65 156.215,290.302 156.283,290.397 157.5,292.1 157.898,292.629 158.6,293.558 159.577,294.813 160.151,295.55 161.308,296.958 162.672,298.621 162.983,299 163.059,299.087 163.175,299.222 164.896,301.152 166.052,302.45 166.754,303.201 167.75,304.266 168.664,305.211 169.329,305.9 170.625,307.182 172.325,308.862 172.61,309.135 172.836,309.35 174.672,311.03 175.236,311.545 176.608,312.8 176.743,312.918 176.9,313.056 178.896,314.745 180.673,316.25 181.059,316.563 181.475,316.902 183.294,318.328 185.045,319.7 185.548,320.079 186.05,320.458 187.87,321.778 189.761,323.15 190.209,323.464 190.625,323.754 192.621,325.095 194.86,326.6 195.043,326.718 195.2,326.82 196.864,327.854 197.547,328.28 199.775,329.665 200.061,329.835 200.422,330.05 202.65,331.332 204.35,332.309 205.263,332.811 206.517,333.5 207.929,334.251 208.925,334.78 210.646,335.652 213.206,336.95 213.384,337.038 213.5,337.094 214.002,337.329 216.208,338.358 218.075,339.23 219.052,339.663 220.717,340.4 221.949,340.929 222.65,341.23 224.908,342.147 225.035,342.198 227.225,343.087 227.896,343.344 229.216,343.85 230.947,344.493 231.8,344.81 234.058,345.597 234.168,345.636 236.375,346.406 237.203,346.676 239.114,347.3 240.407,347.709 240.95,347.882 242.218,348.256 243.684,348.688 245.525,349.232 247.003,349.636 249.542,350.33 250.1,350.482 250.367,350.549 251.167,350.75 253.816,351.397 254.675,351.607 256.289,351.967 257.329,352.199 259.25,352.627 260.895,352.959 262.649,353.313 263.825,353.551 264.52,353.676 267.421,354.2 268.215,354.339 268.4,354.372 268.687,354.417 272.006,354.931 272.975,355.081 274.396,355.271 275.867,355.469 277.55,355.695 279.803,355.951 279.884,355.96 282.125,356.215 283.819,356.373 285.173,356.499 286.7,356.64 287.922,356.729 290.279,356.899 291.275,356.971 292.118,357.015 295.22,357.175 295.85,357.208 296.414,357.225 300.009,357.336 300.425,357.349 300.818,357.354 304.659,357.393 305,357.396 305.341,357.393 309.182,357.354 309.575,357.349 309.991,357.336 313.586,357.225 314.15,357.208 314.78,357.175 317.882,357.015 318.725,356.971 319.721,356.899 322.078,356.729 323.3,356.64 324.827,356.499 326.181,356.373 327.875,356.215 330.116,355.96 330.197,355.951 332.45,355.695 334.133,355.469 335.604,355.271 337.025,355.081 337.994,354.931 341.313,354.417 341.6,354.372 341.785,354.339 342.579,354.2 345.48,353.676 346.175,353.551 347.351,353.313 349.105,352.959 350.75,352.627 352.671,352.199 353.711,351.967 355.325,351.607 356.184,351.397 358.833,350.75 359.633,350.549 359.9,350.482 360.458,350.33 362.997,349.636 364.475,349.232 366.316,348.688 367.782,348.256 369.05,347.882 369.593,347.709 370.886,347.3 372.797,346.676 373.625,346.406 375.832,345.636 375.942,345.597 378.2,344.81 379.053,344.493 380.784,343.85 382.104,343.344 382.775,343.087 384.965,342.198 385.092,342.147 387.35,341.23 388.051,340.929 389.283,340.4 390.948,339.663 391.925,339.23 393.792,338.358 395.998,337.329 396.5,337.094 396.616,337.038 396.794,336.95 399.354,335.652 401.075,334.78 402.071,334.251 403.483,333.5 404.737,332.811 405.65,332.309 407.35,331.332 409.578,330.05 409.939,329.835 410.225,329.665 412.453,328.28 413.136,327.854 414.8,326.82 414.957,326.718 415.14,326.6 417.379,325.095 419.375,323.754 419.791,323.464 420.239,323.15 422.13,321.778 423.95,320.458 424.452,320.079 424.955,319.7 426.706,318.328 428.525,316.902 428.941,316.563 429.327,316.25 431.104,314.745 433.1,313.056 433.257,312.918 433.392,312.8 434.764,311.545 435.328,311.03 437.164,309.35 437.39,309.135 437.675,308.862 439.375,307.182 440.671,305.9 441.336,305.211 442.25,304.266 443.246,303.201 443.948,302.45 445.104,301.152 446.825,299.222 446.941,299.087 447.017,299 447.328,298.621 448.692,296.958 449.849,295.55 450.423,294.813 451.4,293.558 452.102,292.629 452.5,292.1 453.717,290.397 453.785,290.302 454.964,288.65 455.305,288.145 455.975,287.148 456.828,285.843 457.248,285.2 458.292,283.498 458.343,283.414 459.364,281.75 459.723,281.126 460.55,279.684 461.093,278.709 461.321,278.3 461.817,277.344 462.391,276.238 463.112,274.85 463.647,273.735 464.567,271.821 464.77,271.4 464.858,271.199 465.125,270.595 465.983,268.597 466.261,267.95 466.739,266.733 467.046,265.949 467.615,264.5 468.055,263.259 468.524,261.937 468.839,261.05 469.005,260.526 469.7,258.338 469.885,257.739 469.928,257.6 469.987,257.384 470.669,254.881 470.868,254.15 471.121,253.079 471.383,251.969 471.683,250.7 472.022,249.001 472.035,248.939 472.372,247.25 472.581,245.973 472.748,244.952 472.936,243.8 473.053,242.879 473.279,241.101 473.375,240.35 473.433,239.715 473.645,237.375 473.688,236.9 473.711,236.475 473.859,233.764 473.876,233.45 473.881,233.153 473.934,230.257 473.939,230 473.934,229.743 473.881,226.847 473.876,226.55 473.859,226.236 473.711,223.525 473.688,223.1 473.645,222.625 473.433,220.285 473.375,219.65 473.279,218.899 473.053,217.121 472.936,216.2 472.748,215.048 472.581,214.027 472.372,212.75 472.035,211.061 472.022,210.999 471.683,209.3 471.383,208.031 471.121,206.921 470.868,205.85 470.669,205.119 469.987,202.616 469.928,202.4 469.885,202.261 469.7,201.662 469.005,199.474 468.839,198.95 468.524,198.063 468.055,196.741 467.615,195.5 467.046,194.051 466.739,193.267 466.261,192.05 465.983,191.403 465.125,189.405 464.858,188.801 464.77,188.6 464.567,188.179 463.647,186.265 463.112,185.15 462.391,183.762 461.817,182.656 461.321,181.7 461.093,181.291 460.55,180.316 459.723,178.874 459.364,178.25 458.343,176.586 458.292,176.502 457.248,174.8 456.828,174.157 455.975,172.852 455.305,171.855 454.964,171.35 453.785,169.698 453.717,169.603 452.5,167.9 452.102,167.371 451.4,166.442 450.423,165.187 449.849,164.45 448.692,163.042 447.328,161.379 447.017,161 446.941,160.913 446.825,160.778 445.104,158.848 443.948,157.55 443.246,156.799 442.25,155.734 441.336,154.789 440.671,154.1 439.375,152.818 437.675,151.138 437.39,150.865 437.164,150.65 435.328,148.97 434.764,148.455 433.392,147.2 433.257,147.082 433.1,146.944 431.104,145.255 429.327,143.75 428.941,143.437 428.525,143.098 426.706,141.672 424.955,140.3 424.452,139.921 423.95,139.542 422.13,138.222 420.239,136.85 419.791,136.536 419.375,136.246 417.379,134.905 415.14,133.4 414.957,133.282 414.8,133.18 413.136,132.146 412.453,131.72 410.225,130.335 409.939,130.165 409.578,129.95 407.35,128.668 405.65,127.691 404.737,127.189 403.483,126.5 402.071,125.749 401.075,125.22 399.354,124.348 396.794,123.05 396.616,122.962 396.5,122.906 395.998,122.671 393.792,121.642 391.925,120.77 390.948,120.337 389.283,119.6 388.051,119.071 387.35,118.77 385.092,117.853 384.965,117.802 382.775,116.913 382.104,116.656 380.784,116.15 379.053,115.507 378.2,115.19 375.942,114.403 375.832,114.364 373.625,113.594 372.797,113.324 370.886,112.7 369.593,112.291 369.05,112.118 367.782,111.744 366.316,111.312 364.475,110.768 362.997,110.364 360.458,109.67 359.9,109.518 359.633,109.451 358.833,109.25 356.184,108.603 355.325,108.393 353.711,108.033 352.671,107.801 350.75,107.373 349.105,107.041 347.351,106.687 346.175,106.449 345.48,106.324 342.579,105.8 341.785,105.661 341.6,105.628 341.313,105.583 337.994,105.069 337.025,104.919 335.604,104.729 334.133,104.531 332.45,104.305 330.197,104.049 330.116,104.04 327.875,103.785 326.181,103.627 324.827,103.501 323.3,103.36 322.078,103.271 319.721,103.101 318.725,103.029 317.882,102.985 314.78,102.825 314.15,102.792 313.586,102.775 309.991,102.664 309.575,102.651 309.182,102.646 305.341,102.607 305,102.604 304.659,102.607 300.818,102.646 300.425,102.651 300.009,102.664 296.414,102.775 295.85,102.792 295.22,102.825 292.118,102.985 291.275,103.029 290.279,103.101 287.922,103.271 286.7,103.36 285.173,103.501 283.819,103.627 282.125,103.785 279.884,104.04 279.803,104.049 277.55,104.305 275.867,104.531 274.396,104.729 272.975,104.919 272.006,105.069 268.687,105.583 268.4,105.628 268.215,105.661 267.421,105.8 264.52,106.324 263.825,106.449 262.649,106.687 260.895,107.041 259.25,107.373 257.329,107.801 256.289,108.033 254.675,108.393 253.816,108.603 251.167,109.25 250.367,109.451 250.1,109.518 249.542,109.67 247.003,110.364 245.525,110.768 243.684,111.312 242.218,111.744 240.95,112.118 240.407,112.291 239.114,112.7 237.203,113.324 236.375,113.594 234.168,114.364 234.058,114.403 231.8,115.19 230.947,115.507 229.216,116.15 227.896,116.656 227.225,116.913 225.035,117.802 224.908,117.853 222.65,118.77 221.949,119.071 220.717,119.6 219.052,120.337 218.075,120.77 216.208,121.642 214.002,122.671 213.5,122.906 213.384,122.962 213.206,123.05 210.646,124.348 208.925,125.22 207.929,125.749 206.517,126.5 205.263,127.189 204.35,127.691 202.65,128.668 200.422,129.95 200.061,130.165 199.775,130.335 197.547,131.72 196.864,132.146 195.2,133.18 195.043,133.282 194.86,133.4 192.621,134.905 190.625,136.246 190.209,136.536 189.761,136.85 187.87,138.222 186.05,139.542 185.548,139.921 185.045,140.3 183.294,141.672 181.475,143.098 181.059,143.437 180.673,143.75 178.896,145.255 176.9,146.944 176.743,147.082 176.608,147.2 175.236,148.455 174.672,148.97 172.836,150.65 172.61,150.865 172.325,151.138 170.625,152.818 169.329,154.1 168.664,154.789 167.75,155.734 166.754,156.799 166.052,157.55 164.896,158.848 163.175,160.778 163.059,160.913 162.983,161 162.672,161.379 161.308,163.042 160.151,164.45 159.577,165.187 158.6,166.442 157.898,167.371 157.5,167.9 156.283,169.603 156.215,169.698 155.036,171.35 154.695,171.855 154.025,172.852 153.172,174.157 152.752,174.8 151.708,176.502 151.657,176.586 150.636,178.25 150.277,178.874 149.45,180.316 148.907,181.291 148.679,181.7 148.183,182.656 147.609,183.762 146.888,185.15 146.353,186.265 145.433,188.179 145.23,188.6 145.142,188.801 144.875,189.405 144.017,191.403 143.739,192.05 143.261,193.267 142.954,194.051 142.385,195.5 141.945,196.741 141.476,198.063 141.161,198.95 140.995,199.474 140.3,201.662 140.115,202.261 140.072,202.4 140.013,202.616 139.331,205.119 139.132,205.85 138.879,206.921 138.617,208.031 138.317,209.3 137.978,210.999 137.965,211.061 137.628,212.75 137.419,214.027 137.252,215.048 137.064,216.2 136.947,217.121 136.721,218.899 136.625,219.65 136.567,220.285 136.355,222.625 136.312,223.1 136.289,223.525 136.141,226.236 136.124,226.55 136.119,226.847 136.066,229.743 136.061,230 136.066,230.257 136.119,233.153 136.124,233.45 136.141,233.764 136.289,236.475 136.312,236.9 136.355,237.375 136.567,239.715 136.625,240.35 136.721,241.101 136.947,242.879 137.064,243.8 137.252,244.952 137.419,245.973 137.628,247.25 137.965,248.939 137.978,249.001 138.317,250.7 138.617,251.969 138.879,253.079 139.132,254.15 139.331,254.881 140.013,257.384 140.072,257.6 140.115,257.739 140.3,258.338"/>
<polyline fill="none" stroke="#00ffff" stroke-width="1" points="112.85,255.342 113.308,257.254 113.391,257.6 113.531,258.113 114.077,260.125 114.328,261.05 114.767,262.496 114.905,262.95 115.375,264.5 115.79,265.733 116.231,267.049 116.533,267.95 116.727,268.477 117.425,270.377 117.725,271.174 117.81,271.4 117.982,271.82 118.798,273.814 119.222,274.85 119.917,276.421 120.121,276.883 120.747,278.3 121.078,278.996 122,280.939 122.289,281.532 122.395,281.75 122.65,282.24 123.573,284.014 124.19,285.2 124.893,286.469 125.761,288.036 126.101,288.65 126.247,288.897 126.575,289.457 127.67,291.274 128.168,292.1 129.136,293.619 129.643,294.413 130.367,295.55 130.63,295.942 131.15,296.716 132.186,298.219 132.725,299 133.785,300.463 134.624,301.62 135.226,302.45 135.408,302.689 135.725,303.106 137.098,304.864 137.907,305.9 138.82,307.016 140.3,308.827 140.569,309.147 140.739,309.35 141.6,310.33 142.387,311.227 143.768,312.8 144.22,313.294 144.875,314.01 146.108,315.32 146.985,316.25 148.032,317.319 149.45,318.765 149.986,319.296 150.394,319.7 151.998,321.229 153.966,323.105 154.013,323.15 154.018,323.155 154.025,323.162 156.115,325.024 157.883,326.6 158.218,326.888 158.6,327.216 160.385,328.704 162,330.05 162.568,330.508 163.175,330.996 164.808,332.269 166.386,333.5 167.068,334.014 167.75,334.528 169.382,335.719 171.07,336.95 171.718,337.408 172.325,337.836 174.11,339.054 176.083,340.4 176.518,340.688 176.9,340.94 178.99,342.274 181.46,343.85 181.468,343.855 181.475,343.859 181.534,343.895 184.022,345.379 186.05,346.588 186.586,346.896 187.29,347.3 189.208,348.369 190.625,349.159 191.858,349.82 193.596,350.75 194.545,351.244 195.2,351.585 197.287,352.626 198.475,353.22 199.775,353.869 200.044,353.997 200.468,354.2 202.87,355.316 204.35,356.004 205.723,356.614 208.055,357.65 208.608,357.889 208.925,358.026 210.026,358.48 211.56,359.113 213.5,359.913 214.536,360.319 216.529,361.1 217.555,361.492 218.075,361.69 219.583,362.237 220.636,362.619 222.65,363.349 223.746,363.724 226.155,364.55 226.896,364.797 227.225,364.907 228.039,365.164 230.118,365.818 231.8,366.349 233.373,366.814 235.725,367.51 236.375,367.702 236.664,367.782 237.451,368 240.027,368.696 240.95,368.945 242.829,369.417 243.441,369.571 245.525,370.095 246.898,370.415 249.543,371.03 250.1,371.16 250.4,371.224 251.456,371.45 253.977,371.977 254.675,372.123 255.869,372.351 257.614,372.684 259.25,372.996 261.305,373.35 261.908,373.454 263.825,373.785 265.052,373.975 267.719,374.387 268.4,374.492 268.858,374.554 271.395,374.9 272.738,375.079 272.975,375.11 273.304,375.148 276.701,375.54 277.55,375.638 278.674,375.748 280.734,375.949 282.125,376.084 283.882,376.225 284.842,376.301 286.7,376.45 288.939,376.589 289.028,376.594 291.275,376.734 293.299,376.824 293.859,376.849 295.85,376.937 297.66,376.985 298.65,377.011 300.425,377.059 302.118,377.074 303.321,377.084 305,377.099 306.679,377.084 307.882,377.074 309.575,377.059 311.35,377.011 312.34,376.985 314.15,376.937 316.141,376.849 316.701,376.824 318.725,376.734 320.972,376.594 321.061,376.589 323.3,376.45 325.158,376.301 326.118,376.225 327.875,376.084 329.266,375.949 331.326,375.748 332.45,375.638 333.299,375.54 336.696,375.148 337.025,375.11 337.262,375.079 338.605,374.9 341.142,374.554 341.6,374.492 342.281,374.387 344.948,373.975 346.175,373.785 348.092,373.454 348.695,373.35 350.75,372.996 352.386,372.684 354.131,372.351 355.325,372.123 356.023,371.977 358.544,371.45 359.6,371.224 359.9,371.16 360.457,371.03 363.102,370.415 364.475,370.095 366.559,369.571 367.171,369.417 369.05,368.945 369.973,368.696 372.549,368 373.336,367.782 373.625,367.702 374.275,367.51 376.627,366.814 378.2,366.349 379.882,365.818 381.961,365.164 382.775,364.907 383.104,364.797 383.845,364.55 386.254,363.724 387.35,363.349 389.364,362.619 390.417,362.237 391.925,361.69 392.445,361.492 393.471,361.1 395.464,360.319 396.5,359.913 398.44,359.113 399.974,358.48 401.075,358.026 401.392,357.889 401.945,357.65 404.277,356.614 405.65,356.004 407.13,355.316 409.532,354.2 409.956,353.997 410.225,353.869 411.525,353.22 412.713,352.626 414.8,351.585 415.455,351.244 416.404,350.75 418.142,349.82 419.375,349.159 420.792,348.369 422.71,347.3 423.414,346.896 423.95,346.588 425.978,345.379 428.466,343.895 428.525,343.859 428.532,343.855 428.54,343.85 431.01,342.274 433.1,340.94 433.482,340.688 433.917,340.4 435.89,339.054 437.675,337.836 438.282,337.408 438.93,336.95 440.618,335.719 442.25,334.528 442.932,334.014 443.614,333.5 445.192,332.269 446.825,330.996 447.432,330.508 448,330.05 449.615,328.704 451.4,327.216 451.782,326.888 452.117,326.6 453.885,325.024 455.975,323.162 455.982,323.155 455.987,323.15 456.034,323.105 458.002,321.229 459.606,319.7 460.014,319.296 460.55,318.765 461.968,317.319 463.015,316.25 463.892,315.32 465.125,314.01 465.78,313.294 466.232,312.8 467.613,311.227 468.4,310.33 469.261,309.35 469.431,309.147 469.7,308.827 471.18,307.016 472.093,305.9 472.902,304.864 474.275,303.106 474.592,302.689 474.774,302.45 475.376,301.62 476.215,300.463 477.275,299 477.814,298.219 478.85,296.716 479.37,295.942 479.633,295.55 480.357,294.413 480.864,293.619 481.832,292.1 482.33,291.274 483.425,289.457 483.753,288.897 483.899,288.65 484.239,288.036 485.107,286.469 485.81,285.2 486.427,284.014 487.35,282.24 487.605,281.75 487.711,281.532 488,280.939 488.922,278.996 489.253,278.3 489.879,276.883 490.083,276.421 490.778,274.85 491.202,273.814 492.018,271.82 492.19,271.4 492.275,271.174 492.575,270.377 493.273,268.477 493.467,267.95 493.769,267.049 494.21,265.733 494.625,264.5 495.095,262.95 495.233,262.496 495.672,261.05 495.923,260.125 496.469,258.113 496.609,257.6 496.692,257.254 497.15,255.342 497.387,254.329 497.429,254.15 497.479,253.902 497.999,251.34 498.128,250.7 498.274,249.853 498.541,248.299 498.721,247.25 498.907,245.925 499.008,245.201 499.205,243.8 499.39,242.111 499.397,242.044 499.582,240.35 499.701,238.824 499.734,238.401 499.851,236.9 499.915,235.535 499.95,234.789 500.012,233.45 500.032,232.173 500.046,231.266 500.066,230 500.046,228.734 500.032,227.827 500.012,226.55 499.95,225.211 499.915,224.465 499.851,223.1 499.734,221.599 499.701,221.176 499.582,219.65 499.397,217.956 499.39,217.889 499.205,216.2 499.008,214.799 498.907,214.075 498.721,212.75 498.541,211.701 498.274,210.147 498.128,209.3 497.999,208.66 497.479,206.098 497.429,205.85 497.387,205.671 497.15,204.658 496.692,202.746 496.609,202.4 496.469,201.887 495.923,199.875 495.672,198.95 495.233,197.504 495.095,197.05 494.625,195.5 494.21,194.267 493.769,192.951 493.467,192.05 493.273,191.523 492.575,189.623 492.275,188.826 492.19,188.6 492.018,188.18 491.202,186.186 490.778,185.15 490.083,183.579 489.879,183.117 489.253,181.7 488.922,181.004 488,179.061 487.711,178.468 487.605,178.25 487.35,177.76 486.427,175.986 485.81,174.8 485.107,173.531 484.239,171.964 483.899,171.35 483.753,171.103 483.425,170.543 482.33,168.726 481.832,167.9 480.864,166.381 480.357,165.587 479.633,164.45 479.37,164.058 478.85,163.284 477.814,161.781 477.275,161 476.215,159.537 475.376,158.38 474.774,157.55 474.592,157.311 474.275,156.894 472.902,155.136 472.093,154.1 471.18,152.984 469.7,151.173 469.431,150.853 469.261,150.65 468.4,149.67 467.613,148.773 466.232,147.2 465.78,146.706 465.125,145.99 463.892,144.68 463.015,143.75 461.968,142.681 460.55,141.235 460.014,140.704 459.606,140.3 458.002,138.771 456.034,136.895 455.987,136.85 455.982,136.845 455.975,136.838 453.885,134.976 452.117,133.4 451.782,133.112 451.4,132.784 449.615,131.296 448,129.95 447.432,129.492 446.825,129.004 445.192,127.731 443.614,126.5 442.932,125.986 442.25,125.472 440.618,124.281 438.93,123.05 438.282,122.592 437.675,122.164 435.89,120.946 433.917,119.6 433.482,119.312 433.1,119.06 431.01,117.726 428.54,116.15 428.532,116.145 428.525,116.141 428.466,116.105 425.978,114.621 423.95,113.412 423.414,113.104 422.71,112.7 420.792,111.631 419.375,110.841 418.142,110.18 416.404,109.25 415.455,108.756 414.8,108.415 412.713,107.374 411.525,106.78 410.225,106.131 409.956,106.003 409.532,105.8 407.13,104.684 405.65,103.996 404.277,103.386 401.945,102.35 401.392,102.111 401.075,101.974 399.974,101.52 398.44,100.887 396.5,100.087 395.464,99.6812 393.471,98.8999 392.445,98.5078 391.925,98.3096 390.417,97.7632 389.364,97.3813 387.35,96.6514 386.254,96.2759 383.845,95.4502 383.104,95.2026 382.775,95.0928 381.961,94.8364 379.882,94.1816 378.2,93.6514 376.627,93.186 374.275,92.4902 373.625,92.2979 373.336,92.2178 372.549,92 369.973,91.3042 369.05,91.0552 367.171,90.583 366.559,90.4287 364.475,89.9053 363.102,89.5854 360.457,88.9702 359.9,88.8403 359.6,88.7764 358.544,88.5498 356.023,88.0234 355.325,87.8774 354.131,87.6494 352.386,87.3164 350.75,87.0044 348.695,86.6499 348.092,86.5459 346.175,86.2148 344.948,86.0254 342.281,85.6133 341.6,85.5083 341.142,85.4458 338.605,85.1001 337.262,84.9214 337.025,84.8896 336.696,84.8516 333.299,84.46 332.45,84.3618 331.326,84.2524 329.266,84.0513 327.875,83.9155 326.118,83.7754 325.158,83.6987 323.3,83.5503 321.061,83.4111 320.972,83.4058 318.725,83.2661 316.701,83.1763 316.141,83.1514 314.15,83.063 312.34,83.0151 311.35,82.9888 309.575,82.9414 307.882,82.9263 306.679,82.9155 305,82.9009 303.321,82.9155 302.118,82.9263 300.425,82.9414 298.65,82.9888 297.66,83.0151 295.85,83.063 293.859,83.1514 293.299,83.1763 291.275,83.2661 289.028,83.4058 288.939,83.4111 286.7,83.5503 284.842,83.6987 283.882,83.7754 282.125,83.9155 280.734,84.0513 278.674,84.2524 277.55,84.3618 276.701,84.46 273.304,84.8516 272.975,84.8896 272.738,84.9214 271.395,85.1001 268.858,85.4458 268.4,85.5083 267.719,85.6133 265.052,86.0254 263.825,86.2148 261.908,86.5459 261.305,86.6499 259.25,87.0044 257.614,87.3164 255.869,87.6494 254.675,87.8774 253.977,88.0234 251.456,88.5498 250.4,88.7764 250.1,88.8403 249.543,88.9702 246.898,89.5854 245.525,89.9053 243.441,90.4287 242.829,90.583 240.95,91.0552 240.027,91.3042 237.451,92 236.664,92.2178 236.375,92.2979 235.725,92.4902 233.373,93.186 231.8,93.6514 230.118,94.1816 228.039,94.8364 227.225,95.0928 226.896,95.2026 226.155,95.4502 223.746,96.2759 222.65,96.6514 220.636,97.3813 219.583,97.7632 218.075,98.3096 217.555,98.5078 216.529,98.8999 214.536,99.6812 213.5,100.087 211.56,100.887 210.026,101.52 208.925,101.974 208.608,102.111 208.055,102.35 205.723,103.386 204.35,103.996 202.87,104.684 200.468,105.8 200.044,106.003 199.775,106.131 198.475,106.78 197.287,107.374 195.2,108.415 194.545,108.756 193.596,109.25 191.858,110.18 190.625,110.841 189.208,111.631 187.29,112.7 186.586,113.104 186.05,113.412 184.022,114.621 181.534,116.105 181.475,116.141 181.468,116.145 181.46,116.15 178.99,117.726 176.9,119.06 176.518,119.312 176.083,119.6 174.11,120.946 172.325,122.164 171.718,122.592 171.07,123.05 169.382,124.281 167.75,125.472 167.068,125.986 166.386,126.5 164.808,127.731 163.175,129.004 162.568,129.492 162,129.95 160.385,131.296 158.6,132.784 158.218,133.112 157.883,133.4 156.115,134.976 154.025,136.838 154.018,136.845 154.013,136.85 153.966,136.895 151.998,138.771 150.394,140.3 149.986,140.704 149.45,141.235 148.032,142.681 146.985,143.75 146.108,144.68 144.875,145.99 144.22,146.706 143.768,147.2 142.387,148.773 141.6,149.67 140.739,150.65 140.569,150.853 140.3,151.173 138.82,152.984 137.907,154.1 137.098,155.136 135.725,156.894 135.408,157.311 135.226,157.55 134.624,158.38 133.785,159.537 132.725,161 132.186,161.781 131.15,163.284 130.63,164.058 130.367,164.45 129.643,165.587 129.136,166.381 128.168,167.9 127.67,168.726 126.575,170.543 126.247,171.103 126.101,171.35 125.761,171.964 124.893,173.531 124.19,174.8 123.573,175.986 122.65,177.76 122.395,178.25 122.289,178.468 122,179.061 121.078,181.004 120.747,181.7 120.121,183.117 119.917,183.579 119.222,185.15 118.798,186.186 117.982,188.18 117.81,188.6 117.725,188.826 117.425,189.623 116.727,191.523 116.533,192.05 116.231,192.951 115.79,194.267 115.375,195.5 114.905,197.05 114.767,197.504 114.328,198.95 114.077,199.875 113.531,201.887 113.391,202.4 113.308,202.746 112.85,204.658 112.613,205.671 112.571,205.85 112.521,206.098 112.001,208.66 111.872,209.3 111.726,210.147 111.459,211.701 111.279,212.75 111.093,214.075 110.992,214.799 110.795,216.2 110.61,217.889 110.603,217.956 110.418,219.65 110.299,221.176 110.266,221.599 110.149,223.1 110.085,224.465 110.05,225.211 109.988,226.55 109.968,227.827 109.954,228.734 109.934,230 109.954,231.266 109.968,232.173 109.988,233.45 110.05,234.789 110.085,235.535 110.149,236.9 110.266,238.401 110.299,238.824 110.418,240.35 110.603,242.044 110.61,242.111 110.795,243.8 110.992,245.201 111.093,245.925 111.279,247.25 111.459,248.299 111.726,249.853 111.872,250.7 112.001,251.34 112.521,253.902 112.571,254.15 112.613,254.329 112.85,255.342"/>
<polyline fill="none" stroke="#ff0000" stroke-width="1" points="89.9751,257.537 89.9863,257.591 89.9883,257.6 89.9912,257.612"/>
<polyline fill="none" stroke="#000000" stroke-width="1" points="218.603,264.103 218.873,264.5"/>
<polyline fill="none" stroke="#ff0000" stroke-width="1" points="90.6934,260.508 90.8247,261.05 91.043,261.855"/>
<polyline fill="none" stroke="#000000" stroke-width="1" points="291.275,302.815 291.822,302.863"/>
<polyline fill="none" stroke="#ff0000" stroke-width="1" points="91.4565,263.383 91.7593,264.5 92.2734,266.217 92.2798,266.238 92.7925,267.95"/>
<polyline fill="none" stroke="#000000" stroke-width="1" points="265.986,297.37 266.434,297.518"/>
<polyline fill="none" stroke="#ff0000" stroke-width="1" points="93.1411,269.013 93.7183,270.773 93.9238,271.4 94.0566,271.772 94.5498,273.156 95.0342,274.485 95.167,274.85 95.4272,275.512 96.0728,277.152 96.5244,278.3 97.1528,279.787 97.4478,280.485 97.9824,281.75 98.2729,282.393 99.125,284.279 99.4404,284.962 99.5503,285.2 99.8008,285.709 100.673,287.483 101.247,288.65 101.939,289.978 102.622,291.287 103.046,292.1 103.238,292.448 103.7,293.287 104.596,294.875 104.977,295.55 105.998,297.268 106.014,297.294 107.027,299 107.427,299.64 108.275,300.997 108.902,301.977 109.205,302.45 110.157,303.869 110.429,304.275 111.519,305.9 111.98,306.556 112.85,307.796 113.575,308.804 113.967,309.35 115.217,311.015 115.426,311.293 116.558,312.8 116.88,313.211 117.425,313.907 118.596,315.367 119.304,316.25 120.346,317.498 122,319.479 122.115,319.613 122.189,319.7 122.576,320.134 123.95,321.679 125.259,323.15 125.799,323.735 126.575,324.576 127.693,325.756 128.493,326.6 129.623,327.751 131.15,329.307 131.575,329.729 131.898,330.05 133.583,331.665 134.659,332.696 135.498,333.5 135.6,333.595 135.725,333.711 137.68,335.476 139.314,336.95 139.771,337.349 140.3,337.811 141.914,339.183 143.346,340.4 144.077,341.002 144.875,341.659 146.284,342.788 147.611,343.85 148.517,344.553 149.45,345.278 150.791,346.289 152.132,347.3 153.092,348.003 154.025,348.687 155.434,349.688 156.93,350.75 157.802,351.352 158.6,351.903 160.214,352.983 162.033,354.2 162.646,354.599 163.175,354.943 165.13,356.175 167.471,357.65 167.625,357.745 167.75,357.821 168.816,358.454 170.184,359.265 172.325,360.536 172.75,360.779 173.31,361.1 175.373,362.251 176.9,363.104 178.019,363.707 179.584,364.55 180.699,365.135 181.475,365.542 183.425,366.529 185.474,367.566 186.05,367.857 186.165,367.913 186.344,368 188.971,369.248 190.625,370.033 191.796,370.567 193.731,371.45 194.655,371.861 195.2,372.104 197.199,372.957 197.567,373.115 199.775,374.057 200.5,374.354 201.836,374.9 203.48,375.556 204.35,375.904 206.504,376.726 207.043,376.931 208.925,377.649 209.552,377.877 210.853,378.35 212.652,378.99 213.5,379.291 215.762,380.055 215.797,380.067 218.075,380.837 218.971,381.125 221.076,381.8 222.188,382.148 222.65,382.293 223.729,382.613 225.464,383.128 227.225,383.65 228.773,384.083 231.124,384.74 231.8,384.929 232.115,385.012 233.021,385.25 235.523,385.893 236.375,386.112 238.052,386.515 238.978,386.737 240.95,387.211 242.473,387.552 244.647,388.039 245.525,388.235 246.009,388.335 247.771,388.7 249.606,389.072 250.1,389.172 250.932,389.327 253.266,389.763 254.675,390.025 256.945,390.412 256.974,390.417 259.25,390.804 260.731,391.033 262.757,391.345 263.825,391.509 264.543,391.608 268.384,392.138 268.4,392.14 268.412,392.141 268.483,392.15 272.362,392.612 272.975,392.685 273.797,392.77 276.375,393.036 277.55,393.157 279.06,393.289 280.454,393.411 282.125,393.557 284.185,393.704 284.601,393.733 286.7,393.883 288.82,394.001 289.181,394.021 291.275,394.138 293.118,394.21 294.057,394.248 295.85,394.319 297.497,394.358 298.82,394.39 300.425,394.428 301.963,394.44 303.478,394.452 305,394.464 306.522,394.452 308.037,394.44 309.575,394.428 311.18,394.39 312.503,394.358 314.15,394.319 315.943,394.248 316.882,394.21 318.725,394.138 320.819,394.021 321.18,394.001 323.3,393.883 325.399,393.733 325.815,393.704 327.875,393.557 329.546,393.411 330.94,393.289 332.45,393.157 333.625,393.036 336.203,392.77 337.025,392.685 337.638,392.612 341.517,392.15 341.588,392.141 341.6,392.14 341.616,392.138 345.457,391.608 346.175,391.509 347.243,391.345 349.269,391.033 350.75,390.804 353.026,390.417 353.055,390.412 355.325,390.025 356.734,389.763 359.068,389.327 359.9,389.172 360.394,389.072 362.229,388.7 363.991,388.335 364.475,388.235 365.353,388.039 367.527,387.552 369.05,387.211 371.022,386.737 371.948,386.515 373.625,386.112 374.477,385.893 376.979,385.25 377.885,385.012 378.2,384.929 378.876,384.74 381.227,384.083 382.775,383.65 384.536,383.128 386.271,382.613 387.35,382.293 387.812,382.148 388.924,381.8 391.029,381.125 391.925,380.837 394.203,380.067 394.238,380.055 396.5,379.291 397.348,378.99 399.147,378.35 400.448,377.877 401.075,377.649 402.957,376.931 403.496,376.726 405.65,375.904 406.52,375.556 408.164,374.9 409.5,374.354 410.225,374.057 412.433,373.115 412.801,372.957 414.8,372.104 415.345,371.861 416.269,371.45 418.204,370.567 419.375,370.033 421.029,369.248 423.656,368 423.835,367.913 423.95,367.857 424.526,367.566 426.575,366.529 428.525,365.542 429.301,365.135 430.416,364.55 431.981,363.707 433.1,363.104 434.627,362.251 436.69,361.1 437.25,360.779 437.675,360.536 439.816,359.265 441.184,358.454 442.25,357.821 442.375,357.745 442.529,357.65 444.87,356.175 446.825,354.943 447.354,354.599 447.967,354.2 449.786,352.983 451.4,351.903 452.198,351.352 453.07,350.75 454.566,349.688 455.975,348.687 456.908,348.003 457.868,347.3 459.209,346.289 460.55,345.278 461.483,344.553 462.389,343.85 463.716,342.788 465.125,341.659 465.923,341.002 466.654,340.4 468.086,339.183 469.7,337.811 470.229,337.349 470.686,336.95 472.32,335.476 474.275,333.711 474.4,333.595 474.502,333.5 475.341,332.696 476.417,331.665 478.102,330.05 478.425,329.729 478.85,329.307 480.377,327.751 481.507,326.6 482.307,325.756 483.425,324.576 484.201,323.735 484.741,323.15 486.05,321.679 487.424,320.134 487.811,319.7 487.885,319.613 488,319.479 489.654,317.498 490.696,316.25 491.404,315.367 492.575,313.907 493.12,313.211 493.442,312.8 494.574,311.293 494.783,311.015 496.033,309.35 496.425,308.804 497.15,307.796 498.02,306.556 498.481,305.9 499.571,304.275 499.843,303.869 500.795,302.45 501.098,301.977 501.725,300.997 502.573,299.64 502.973,299 503.986,297.294 504.002,297.268 505.023,295.55 505.404,294.875 506.3,293.287 506.762,292.448 506.954,292.1 507.378,291.287 508.061,289.978 508.753,288.65 509.327,287.483 510.199,285.709 510.45,285.2 510.56,284.962 510.875,284.279 511.727,282.393 512.018,281.75 512.552,280.485 512.847,279.787 513.476,278.3 513.927,277.152 514.573,275.512 514.833,274.85 514.966,274.485 515.45,273.156 515.943,271.772 516.076,271.4 516.282,270.773 516.859,269.013 517.208,267.95 517.72,266.238 517.727,266.217 518.241,264.5 518.543,263.383 518.957,261.855 519.175,261.05 519.307,260.508 520.009,257.612 520.012,257.6 520.014,257.591 520.025,257.537 520.638,254.612 520.734,254.15 520.847,253.53 521.2,251.586 521.36,250.7 521.535,249.561 521.696,248.51 521.89,247.25 522.085,245.696 522.125,245.383 522.323,243.8 522.479,242.201 522.506,241.929 522.661,240.35 522.757,238.96 522.807,238.252 522.901,236.9 522.953,235.658 522.995,234.66 523.046,233.45 523.062,232.29 523.078,231.148 523.094,230 523.078,228.852 523.062,227.71 523.046,226.55 522.995,225.34 522.953,224.342 522.901,223.1 522.807,221.748 522.757,221.04 522.661,219.65 522.506,218.071 522.479,217.799 522.323,216.2 522.125,214.617 522.085,214.304 521.89,212.75 521.696,211.49 521.535,210.439 521.36,209.3 521.2,208.414 520.847,206.47 520.734,205.85 520.638,205.388 520.025,202.463 520.014,202.409 520.012,202.4 520.009,202.388 519.307,199.492 519.175,198.95 518.957,198.145 518.543,196.617 518.241,195.5 517.727,193.783 517.72,193.762 517.208,192.05 516.859,190.987 516.282,189.227 516.076,188.6 515.943,188.228 515.45,186.844 514.966,185.515 514.833,185.15 514.573,184.488 513.927,182.848 513.476,181.7 512.847,180.213 512.552,179.515 512.018,178.25 511.727,177.607 510.875,175.721 510.56,175.038 510.45,174.8 510.199,174.291 509.327,172.517 508.753,171.35 508.061,170.022 507.378,168.713 506.954,167.9 506.762,167.552 506.3,166.713 505.404,165.125 505.023,164.45 504.002,162.732 503.986,162.706 502.973,161 502.573,160.36 501.725,159.003 501.098,158.023 500.795,157.55 499.843,156.131 499.571,155.725 498.481,154.1 498.02,153.444 497.15,152.204 496.425,151.196 496.033,150.65 494.783,148.985 494.574,148.707 493.442,147.2 493.12,146.789 492.575,146.093 491.404,144.633 490.696,143.75 489.654,142.502 488,140.521 487.885,140.387 487.811,140.3 487.424,139.866 486.05,138.321 484.741,136.85 484.201,136.265 483.425,135.424 482.307,134.244 481.507,133.4 480.377,132.249 478.85,130.693 478.425,130.271 478.102,129.95 476.417,128.335 475.341,127.304 474.502,126.5 474.4,126.405 474.275,126.289 472.32,124.524 470.686,123.05 470.229,122.651 469.7,122.189 468.086,120.817 466.654,119.6 465.923,118.998 465.125,118.341 463.716,117.212 462.389,116.15 461.483,115.447 460.55,114.722 459.209,113.711 457.868,112.7 456.908,111.997 455.975,111.313 454.566,110.313 453.07,109.25 452.198,108.648 451.4,108.097 449.786,107.017 447.967,105.8 447.354,105.401 446.825,105.057 444.87,103.825 442.529,102.35 442.375,102.255 442.25,102.179 441.184,101.546 439.816,100.735 437.675,99.4644 437.25,99.2207 436.69,98.8999 434.627,97.7485 433.1,96.896 431.981,96.2935 430.416,95.4502 429.301,94.8647 428.525,94.4575 426.575,93.4707 424.526,92.4341 423.95,92.1431 423.835,92.0869 423.656,92 421.029,90.7524 419.375,89.9673 418.204,89.4331 416.269,88.5498 415.345,88.1392 414.8,87.8965 412.801,87.043 412.433,86.8853 410.225,85.9429 409.5,85.6465 408.164,85.1001 406.52,84.4438 405.65,84.0962 403.496,83.2744 402.957,83.0688 401.075,82.3511 400.448,82.123 399.147,81.6499 397.348,81.0103 396.5,80.709 394.238,79.9448 394.203,79.9326 391.925,79.1626 391.029,78.8755 388.924,78.2002 387.812,77.8516 387.35,77.7065 386.271,77.3867 384.536,76.8721 382.775,76.3501 381.227,75.917 378.876,75.2598 378.2,75.0708 377.885,74.9878 376.979,74.75 374.477,74.1074 373.625,73.8882 371.948,73.4854 371.022,73.2627 369.05,72.7891 367.527,72.4482 365.353,71.9614 364.475,71.7651 363.991,71.665 362.229,71.2998 360.394,70.9277 359.9,70.8276 359.068,70.6729 356.734,70.2373 355.325,69.9746 353.055,69.5879 353.026,69.5835 350.75,69.1958 349.269,68.9673 347.243,68.6553 346.175,68.4907 345.457,68.3916 341.616,67.8623 341.6,67.8604 341.588,67.8589 341.517,67.8501 337.638,67.3882 337.025,67.3149 336.203,67.2305 333.625,66.9644 332.45,66.8433 330.94,66.7114 329.546,66.5894 327.875,66.4434 325.815,66.2964 325.399,66.2666 323.3,66.1167 321.18,65.999 320.819,65.979 318.725,65.8623 316.882,65.7896 315.943,65.752 314.15,65.6812 312.503,65.6416 311.18,65.6104 309.575,65.5718 308.037,65.5601 306.522,65.5479 305,65.5356 303.478,65.5479 301.963,65.5601 300.425,65.5718 298.82,65.6104 297.497,65.6416 295.85,65.6812 294.057,65.752 293.118,65.7896 291.275,65.8623 289.181,65.979 288.82,65.999 286.7,66.1167 284.601,66.2666 284.185,66.2964 282.125,66.4434 280.454,66.5894 279.06,66.7114 277.55,66.8433 276.375,66.9644 273.797,67.2305 272.975,67.3149 272.362,67.3882 268.483,67.8501 268.412,67.8589 268.4,67.8604 268.384,67.8623 264.543,68.3916 263.825,68.4907 262.757,68.6553 260.731,68.9673 259.25,69.1958 256.974,69.5835 256.945,69.5879 254.675,69.9746 253.266,70.2373 250.932,70.6729 250.1,70.8276 249.606,70.9277 247.771,71.2998 246.009,71.665 245.525,71.7651 244.647,71.9614 242.473,72.4482 240.95,72.7891 238.978,73.2627 238.052,73.4854 236.375,73.8882 235.523,74.1074 233.021,74.75 232.115,74.9878 231.8,75.0708 231.124,75.2598 228.773,75.917 227.225,76.3501 225.464,76.8721 223.729,77.3867 222.65,77.7065 222.188,77.8516 221.076,78.2002 218.971,78.8755 218.075,79.1626 215.797,79.9326 215.762,79.9448 213.5,80.709 212.652,81.0103 210.853,81.6499 209.552,82.123 208.925,82.3511 207.043,83.0688 206.504,83.2744 204.35,84.0962 203.48,84.4438 201.836,85.1001 200.5,85.6465 199.775,85.9429 197.567,86.8853 197.199,87.043 195.2,87.8965 194.655,88.1392 193.731,88.5498 191.796,89.4331 190.625,89.9673 188.971,90.7524 186.344,92 186.165,92.0869 186.05,92.1431 185.474,92.4341 183.425,93.4707 181.475,94.4575 180.699,94.8647 179.584,95.4502 178.019,96.2935 176.9,96.896 175.373,97.7485 173.31,98.8999 172.75,99.2207 172.325,99.4644 170.184,100.735 168.816,101.546 167.75,102.179 167.625,102.255 167.471,102.35 165.13,103.825 163.175,105.057 162.646,105.401 162.033,105.8 160.214,107.017 158.6,108.097 157.802,108.648 156.93,109.25 155.434,110.313 154.025,111.313 153.092,111.997 152.132,112.7 150.791,113.711 149.45,114.722 148.517,115.447 147.611,116.15 146.284,117.212 144.875,118.341 144.077,118.998 143.346,119.6 141.914,120.817 140.3,122.189 139.771,122.651 139.314,123.05 137.68,124.524 135.725,126.289 135.6,126.405 135.498,126.5 134.659,127.304 133.583,128.335 131.898,129.95 131.575,130.271 131.15,130.693 129.623,132.249 128.493,133.4 127.693,134.244 126.575,135.424 125.799,136.265 125.259,136.85 123.95,138.321 122.576,139.866 122.189,140.3 122.115,140.387 122,140.521 120.346,142.502 119.304,143.75 118.596,144.633 117.425,146.093 116.88,146.789 116.558,147.2 115.426,148.707 115.217,148.985 113.967,150.65 113.575,151.196 112.85,152.204 111.98,153.444 111.519,154.1 110.429,155.725 110.157,156.131 109.205,157.55 108.902,158.023 108.275,159.003 107.427,160.36 107.027,161 106.014,162.706 105.998,162.732 104.977,164.45 104.596,165.125 103.7,166.713 103.238,167.552 103.046,167.9 102.622,168.713 101.939,170.022 101.247,171.35 100.673,172.517 99.8008,174.291 99.5503,174.8 99.4404,175.038 99.125,175.721 98.2729,177.607 97.9824,178.25 97.4478,179.515 97.1528,180.213 96.5244,181.7 96.0728,182.848 95.4272,184.488 95.167,185.15 95.0342,185.515 94.5498,186.844 94.0566,188.228 93.9238,188.6 93.7183,189.227 93.1411,190.987 92.7925,192.05 92.2798,193.762 92.2734,193.783 91.7593,195.5 91.4565,196.617 91.043,198.145 90.8247,198.95 90.6934,199.492 89.9912,202.388 89.9883,202.4 89.9863,202.409 89.9751,202.463 89.3623,205.388 89.2656,205.85 89.1533,206.47 88.8003,208.414 88.6396,209.3 88.4648,210.439 88.3037,211.49 88.1099,212.75 87.915,214.304 87.8755,214.617 87.6768,216.2 87.5205,217.799 87.4937,218.071 87.3394,219.65 87.2427,221.04 87.1929,221.748 87.0986,223.1 87.0469,224.342 87.0049,225.34 86.9541,226.55 86.938,227.71 86.9219,228.852 86.9063,230 86.9219,231.148 86.938,232.29 86.9541,233.45 87.0049,234.66 87.0469,235.658 87.0986,236.9 87.1929,238.252 87.2427,238.96 87.3394,240.35 87.4937,241.929 87.5205,242.201 87.6768,243.8 87.8755,245.383 87.915,245.696 88.1099,247.25 88.3037,248.51 88.4648,249.561 88.6396,250.7 88.8003,251.586 89.1533,253.53 89.2656,254.15 89.3623,254.612 89.9751,257.537"/>
<polyline fill="none" stroke="#ff00ff" stroke-width="1" points="533.75,282.003 532.739,284.438 532.422,285.2 531.759,286.702 531.61,287.037 530.897,288.65 530.448,289.61 529.337,291.978 529.28,292.1 529.251,292.158 529.175,292.312 527.989,294.656 527.537,295.55 526.695,297.13 526.436,297.616 525.698,299 525.372,299.582 524.6,300.958 524.003,302 523.746,302.45 523.041,303.626 522.587,304.382 521.675,305.9 521.145,306.745 520.025,308.527 519.669,309.082 519.497,309.35 518.958,310.155 518.139,311.377 517.185,312.8 516.586,313.657 515.45,315.284 515.001,315.912 514.76,316.25 513.88,317.434 513.365,318.127 512.196,319.7 511.71,320.33 510.875,321.41 510.014,322.5 509.501,323.15 508.278,324.642 507.279,325.862 506.674,326.6 506.528,326.772 506.3,327.04 504.72,328.858 503.685,330.05 502.893,330.931 501.725,332.229 501.035,332.979 500.556,333.5 499.133,334.995 497.583,336.624 497.272,336.95 497.22,337.003 497.15,337.074 495.247,338.965 493.803,340.4 493.264,340.919 492.575,341.582 491.236,342.84 490.162,343.85 489.183,344.742 488,345.821 487.1,346.621 486.336,347.3 484.979,348.472 483.425,349.813 482.838,350.308 482.313,350.75 480.651,352.108 478.85,353.582 478.451,353.899 478.074,354.2 476.2,355.652 474.275,357.143 473.939,357.396 473.603,357.65 471.625,359.102 469.7,360.515 469.301,360.799 468.88,361.1 466.926,362.458 465.125,363.711 464.538,364.107 463.883,364.55 462.104,365.722 460.55,366.746 459.65,367.321 458.588,368 457.158,368.892 455.975,369.63 454.636,370.44 452.968,371.45 452.088,371.969 451.4,372.376 449.497,373.465 446.99,374.9 446.895,374.953 446.825,374.992 446.392,375.227 444.233,376.395 442.25,377.468 441.56,377.83 440.565,378.35 438.843,379.231 437.675,379.828 436.095,380.608 433.684,381.8 433.328,381.972 433.1,382.082 432.122,382.538 430.503,383.292 428.525,384.214 427.664,384.601 426.218,385.25 424.785,385.879 423.95,386.246 421.865,387.127 420.945,387.516 419.375,388.18 418.926,388.362 418.093,388.7 415.937,389.557 414.8,390.008 412.914,390.728 411.292,391.345 410.225,391.752 409.869,391.882 409.134,392.15 406.77,392.995 405.65,393.395 403.637,394.082 402.635,394.424 401.075,394.956 400.479,395.15 399.097,395.6 397.271,396.182 396.5,396.428 394.664,396.984 394.02,397.18 391.925,397.815 390.739,398.156 387.631,399.05 387.426,399.107 387.35,399.129 387.188,399.172 384.047,400.01 382.775,400.349 380.636,400.887 380.191,400.999 378.2,401.499 377.189,401.738 373.96,402.5"/>
<polyline fill="none" stroke="#ff00ff" stroke-width="1" points="373.96,57.5 377.189,58.2622 378.2,58.501 380.191,59.0015 380.636,59.1133 382.775,59.6509 384.047,59.9902 387.188,60.8276 387.35,60.8706 387.426,60.8926 387.631,60.9502 390.739,61.8442 391.925,62.1851 394.02,62.8203 394.664,63.0156 396.5,63.5723 397.271,63.8184 399.097,64.3999 400.479,64.8496 401.075,65.0439 402.635,65.5762 403.637,65.918 405.65,66.6055 406.77,67.0054 409.134,67.8501 409.869,68.1182 410.225,68.248 411.292,68.6548 412.914,69.2725 414.8,69.9917 415.937,70.4429 418.093,71.2998 418.926,71.6382 419.375,71.8203 420.945,72.4839 421.865,72.8726 423.95,73.7539 424.785,74.1206 426.218,74.75 427.664,75.3994 428.525,75.7861 430.503,76.708 432.122,77.4619 433.1,77.918 433.328,78.0283 433.684,78.2002 436.095,79.3916 437.675,80.1719 438.843,80.769 440.565,81.6499 441.56,82.1704 442.25,82.5317 444.233,83.605 446.392,84.7734 446.825,85.0078 446.895,85.0469 446.99,85.1001 449.497,86.5352 451.4,87.624 452.088,88.0308 452.968,88.5498 454.636,89.5596 455.975,90.3696 457.158,91.1079 458.588,92 459.65,92.6787 460.55,93.2544 462.104,94.2783 463.883,95.4502 464.538,95.8926 465.125,96.2891 466.926,97.5415 468.88,98.8999 469.301,99.2007 469.7,99.4854 471.625,100.898 473.603,102.35 473.939,102.604 474.275,102.857 476.2,104.348 478.074,105.8 478.451,106.101 478.85,106.418 480.651,107.892 482.313,109.25 482.838,109.692 483.425,110.187 484.979,111.528 486.336,112.7 487.1,113.379 488,114.179 489.183,115.258 490.162,116.15 491.236,117.16 492.575,118.418 493.264,119.081 493.803,119.6 495.247,121.035 497.15,122.926 497.22,122.997 497.272,123.05 497.583,123.376 499.133,125.005 500.556,126.5 501.035,127.021 501.725,127.771 502.893,129.069 503.685,129.95 504.72,131.142 506.3,132.96 506.528,133.228 506.674,133.4 507.279,134.138 508.278,135.358 509.501,136.85 510.014,137.5 510.875,138.59 511.71,139.67 512.196,140.3 513.365,141.873 513.88,142.566 514.76,143.75 515.001,144.088 515.45,144.716 516.586,146.343 517.185,147.2 518.139,148.623 518.958,149.845 519.497,150.65 519.669,150.918 520.025,151.473 521.145,153.255 521.675,154.1 522.587,155.618 523.041,156.374 523.746,157.55 524.003,158 524.6,159.042 525.372,160.418 525.698,161 526.436,162.384 526.695,162.87 527.537,164.45 527.989,165.344 529.175,167.688 529.251,167.842 529.28,167.9 529.337,168.022 530.448,170.39 530.897,171.35 531.61,172.963 531.759,173.298 532.422,174.8 532.739,175.563 533.75,177.997"/>
<polyline fill="none" stroke="#ff00ff" stroke-width="1" points="76.25,177.997 77.2607,175.563 77.5776,174.8 78.2412,173.298 78.3896,172.963 79.1025,171.35 79.5522,170.39 80.6626,168.022 80.7197,167.9 80.7485,167.842 80.8252,167.688 82.0107,165.344 82.4629,164.45 83.3052,162.87 83.5645,162.384 84.3022,161 84.6284,160.418 85.3999,159.042 85.9966,158 86.2539,157.55 86.9595,156.374 87.4131,155.618 88.3247,154.1 88.855,153.255 89.9751,151.473 90.3306,150.918 90.5029,150.65 91.042,149.845 91.8613,148.623 92.8149,147.2 93.4136,146.343 94.5498,144.716 94.9985,144.088 95.2402,143.75 96.1201,142.566 96.6353,141.873 97.8042,140.3 98.29,139.67 99.125,138.59 99.9863,137.5 100.499,136.85 101.722,135.358 102.721,134.138 103.326,133.4 103.472,133.228 103.7,132.96 105.28,131.142 106.315,129.95 107.107,129.069 108.275,127.771 108.965,127.021 109.444,126.5 110.867,125.005 112.417,123.376 112.728,123.05 112.78,122.997 112.85,122.926 114.753,121.035 116.197,119.6 116.736,119.081 117.425,118.418 118.764,117.16 119.838,116.15 120.817,115.258 122,114.179 122.9,113.379 123.664,112.7 125.021,111.528 126.575,110.187 127.162,109.692 127.688,109.25 129.349,107.892 131.15,106.418 131.549,106.101 131.926,105.8 133.8,104.348 135.725,102.857 136.061,102.604 136.397,102.35 138.375,100.898 140.3,99.4854 140.699,99.2007 141.12,98.8999 143.074,97.5415 144.875,96.2891 145.462,95.8926 146.117,95.4502 147.896,94.2783 149.45,93.2544 150.35,92.6787 151.412,92 152.842,91.1079 154.025,90.3696 155.364,89.5596 157.032,88.5498 157.912,88.0308 158.6,87.624 160.503,86.5352 163.01,85.1001 163.105,85.0469 163.175,85.0078 163.608,84.7734 165.767,83.605 167.75,82.5317 168.44,82.1704 169.435,81.6499 171.157,80.769 172.325,80.1719 173.905,79.3916 176.316,78.2002 176.672,78.0283 176.9,77.918 177.878,77.4619 179.497,76.708 181.475,75.7861 182.336,75.3994 183.782,74.75 185.215,74.1206 186.05,73.7539 188.135,72.8726 189.055,72.4839 190.625,71.8203 191.074,71.6382 191.907,71.2998 194.063,70.4429 195.2,69.9917 197.086,69.2725 198.708,68.6548 199.775,68.248 200.131,68.1182 200.866,67.8501 203.23,67.0054 204.35,66.6055 206.363,65.918 207.365,65.5762 208.925,65.0439 209.521,64.8496 210.903,64.3999 212.729,63.8184 213.5,63.5723 215.336,63.0156 215.98,62.8203 218.075,62.1851 219.261,61.8442 222.369,60.9502 222.574,60.8926 222.65,60.8706 222.813,60.8276 225.953,59.9902 227.225,59.6509 229.364,59.1133 229.809,59.0015 231.8,58.501 232.811,58.2622 236.04,57.5"/>
<polyline fill="none" stroke="#ff00ff" stroke-width="1" points="76.25,282.003 77.2607,284.438 77.5776,285.2 78.2412,286.702 78.3896,287.037 79.1025,288.65 79.5522,289.61 80.6626,291.978 80.7197,292.1 80.7485,292.158 80.8252,292.312 82.0107,294.656 82.4629,295.55 83.3052,297.13 83.5645,297.616 84.3022,299 84.6284,299.582 85.3999,300.958 85.9966,302 86.2539,302.45 86.9595,303.626 87.4131,304.382 88.3247,305.9 88.855,306.745 89.9751,308.527 90.3306,309.082 90.5029,309.35 91.042,310.155 91.8613,311.377 92.8149,312.8 93.4136,313.657 94.5498,315.284 94.9985,315.912 95.2402,316.25 96.1201,317.434 96.6353,318.127 97.8042,319.7 98.29,320.33 99.125,321.41 99.9863,322.5 100.499,323.15 101.722,324.642 102.721,325.862 103.326,326.6 103.472,326.772 103.7,327.04 105.28,328.858 106.315,330.05 107.107,330.931 108.275,332.229 108.965,332.979 109.444,333.5 110.867,334.995 112.417,336.624 112.728,336.95 112.78,337.003 112.85,337.074 114.753,338.965 116.197,340.4 116.736,340.919 117.425,341.582 118.764,342.84 119.838,343.85 120.817,344.742 122,345.821 122.9,346.621 123.664,347.3 125.021,348.472 126.575,349.813 127.162,350.308 127.688,350.75 129.349,352.108 131.15,353.582 131.549,353.899 131.926,354.2 133.8,355.652 135.725,357.143 136.061,357.396 136.397,357.65 138.375,359.102 140.3,360.515 140.699,360.799 141.12,361.1 143.074,362.458 144.875,363.711 145.462,364.107 146.117,364.55 147.896,365.722 149.45,366.746 150.35,367.321 151.412,368 152.842,368.892 154.025,369.63 155.364,370.44 157.032,371.45 157.912,371.969 158.6,372.376 160.503,373.465 163.01,374.9 163.105,374.953 163.175,374.992 163.608,375.227 165.767,376.395 167.75,377.468 168.44,377.83 169.435,378.35 171.157,379.231 172.325,379.828 173.905,380.608 176.316,381.8 176.672,381.972 176.9,382.082 177.878,382.538 179.497,383.292 181.475,384.214 182.336,384.601 183.782,385.25 185.215,385.879 186.05,386.246 188.135,387.127 189.055,387.516 190.625,388.18 191.074,388.362 191.907,388.7 194.063,389.557 195.2,390.008 197.086,390.728 198.708,391.345 199.775,391.752 200.131,391.882 200.866,392.15 203.23,392.995 204.35,393.395 206.363,394.082 207.365,394.424 208.925,394.956 209.521,395.15 210.903,395.6 212.729,396.182 213.5,396.428 215.336,396.984 215.98,397.18 218.075,397.815 219.261,398.156 222.369,399.05 222.574,399.107 222.65,399.129 222.813,399.172 225.953,400.01 227.225,400.349 229.364,400.887 229.809,400.999 231.8,401.499 232.811,401.738 236.04,402.5"/>
<polyline fill="none" stroke="#ffff00" stroke-width="1" points="533.75,320.079 532.33,322.079 531.57,323.15 530.714,324.311 529.175,326.4 529.079,326.528 529.025,326.6 528.811,326.875 527.387,328.702 526.336,330.05 525.68,330.864 524.6,332.203 523.941,333.003 523.532,333.5 522.161,335.11 521.615,335.751 520.594,336.95 520.367,337.208 520.025,337.597 518.524,339.268 517.507,340.4 516.661,341.313 515.45,342.62 514.77,343.337 514.285,343.85 512.839,345.331 511.031,347.183 510.916,347.3 510.898,347.318 510.875,347.341 508.901,349.261 507.37,350.75 506.896,351.199 506.3,351.762 504.847,353.104 503.661,354.2 502.778,354.994 501.725,355.94 500.677,356.86 499.777,357.65 498.546,358.703 497.15,359.896 496.392,360.528 495.707,361.1 494.2,362.325 492.575,363.646 491.991,364.109 491.435,364.55 489.739,365.861 488,367.206 487.474,367.603 486.947,368 485.164,369.312 483.425,370.59 482.841,371.009 482.226,371.45 480.475,372.675 478.85,373.812 478.092,374.328 477.253,374.9 475.671,375.953 474.275,376.881 473.228,377.56 472.007,378.35 470.753,379.144 469.7,379.81 468.247,380.704 466.466,381.8 465.72,382.249 465.125,382.607 463.151,383.761 460.604,385.25 460.573,385.268 460.55,385.281 460.394,385.368 457.938,386.731 455.975,387.821 455.295,388.188 454.343,388.7 452.611,389.613 451.4,390.251 449.899,391.018 447.683,392.15 447.167,392.408 446.825,392.579 445.235,393.349 444.386,393.76 442.25,394.794 441.591,395.103 440.53,395.6 438.755,396.414 437.675,396.91 435.887,397.702 433.464,398.775 433.1,398.937 433.004,398.978 432.835,399.05 430.064,400.211 428.525,400.856 427.105,401.429 424.452,402.5"/>
<polyline fill="none" stroke="#ffff00" stroke-width="1" points="424.452,57.5 427.105,58.5708 428.525,59.144 430.064,59.7891 432.835,60.9502 433.004,61.022 433.1,61.063 433.464,61.2246 435.887,62.2983 437.675,63.0903 438.755,63.5859 440.53,64.3999 441.591,64.897 442.25,65.2056 444.386,66.2397 445.235,66.6509 446.825,67.4209 447.167,67.5918 447.683,67.8501 449.899,68.9819 451.4,69.7485 452.611,70.3867 454.343,71.2998 455.295,71.8125 455.975,72.1787 457.938,73.269 460.394,74.6323 460.55,74.7192 460.573,74.7324 460.604,74.75 463.151,76.2388 465.125,77.3931 465.72,77.751 466.466,78.2002 468.247,79.2959 469.7,80.1899 470.753,80.856 472.007,81.6499 473.228,82.4399 474.275,83.1187 475.671,84.0474 477.253,85.1001 478.092,85.6719 478.85,86.1885 480.475,87.3247 482.226,88.5498 482.841,88.9907 483.425,89.4097 485.164,90.6885 486.947,92 487.474,92.397 488,92.7939 489.739,94.1387 491.435,95.4502 491.991,95.8906 492.575,96.354 494.2,97.6748 495.707,98.8999 496.392,99.4717 497.15,100.104 498.546,101.297 499.777,102.35 500.677,103.14 501.725,104.06 502.778,105.006 503.661,105.8 504.847,106.896 506.3,108.238 506.896,108.801 507.37,109.25 508.901,110.739 510.875,112.659 510.898,112.682 510.916,112.7 511.031,112.817 512.839,114.669 514.285,116.15 514.77,116.663 515.45,117.38 516.661,118.687 517.507,119.6 518.524,120.732 520.025,122.403 520.367,122.792 520.594,123.05 521.615,124.249 522.161,124.89 523.532,126.5 523.941,126.997 524.6,127.797 525.68,129.136 526.336,129.95 527.387,131.298 528.811,133.125 529.025,133.4 529.079,133.472 529.175,133.6 530.714,135.689 531.57,136.85 532.33,137.921 533.75,139.921"/>
<polyline fill="none" stroke="#ffff00" stroke-width="1" points="76.25,139.921 77.6699,137.921 78.4302,136.85 79.2856,135.689 80.8252,133.6 80.9209,133.472 80.9751,133.4 81.189,133.125 82.6128,131.298 83.6636,129.95 84.3203,129.136 85.3999,127.797 86.0591,126.997 86.4683,126.5 87.8394,124.89 88.3848,124.249 89.4058,123.05 89.6328,122.792 89.9751,122.403 91.4761,120.732 92.4927,119.6 93.3394,118.687 94.5498,117.38 95.23,116.663 95.7153,116.15 97.1611,114.669 98.9692,112.817 99.084,112.7 99.1016,112.682 99.125,112.659 101.099,110.739 102.63,109.25 103.104,108.801 103.7,108.238 105.153,106.896 106.339,105.8 107.222,105.006 108.275,104.06 109.323,103.14 110.223,102.35 111.454,101.297 112.85,100.104 113.608,99.4717 114.293,98.8999 115.8,97.6748 117.425,96.354 118.009,95.8906 118.565,95.4502 120.261,94.1387 122,92.7939 122.526,92.397 123.053,92 124.836,90.6885 126.575,89.4097 127.159,88.9907 127.774,88.5498 129.525,87.3247 131.15,86.1885 131.908,85.6719 132.747,85.1001 134.329,84.0474 135.725,83.1187 136.772,82.4399 137.993,81.6499 139.247,80.856 140.3,80.1899 141.753,79.2959 143.534,78.2002 144.28,77.751 144.875,77.3931 146.849,76.2388 149.396,74.75 149.427,74.7324 149.45,74.7192 149.606,74.6323 152.062,73.269 154.025,72.1787 154.705,71.8125 155.657,71.2998 157.389,70.3867 158.6,69.7485 160.101,68.9819 162.317,67.8501 162.833,67.5918 163.175,67.4209 164.765,66.6509 165.614,66.2397 167.75,65.2056 168.409,64.897 169.47,64.3999 171.245,63.5859 172.325,63.0903 174.113,62.2983 176.536,61.2246 176.9,61.063 176.996,61.022 177.165,60.9502 179.936,59.7891 181.475,59.144 182.895,58.5708 185.548,57.5"/>
<polyline fill="none" stroke="#ffff00" stroke-width="1" points="76.25,320.079 77.6699,322.079 78.4302,323.15 79.2856,324.311 80.8252,326.4 80.9209,326.528 80.9751,326.6 81.189,326.875 82.6128,328.702 83.6636,330.05 84.3203,330.864 85.3999,332.203 86.0591,333.003 86.4683,333.5 87.8394,335.11 88.3848,335.751 89.4058,336.95 89.6328,337.208 89.9751,337.597 91.4761,339.268 92.4927,340.4 93.3394,341.313 94.5498,342.62 95.23,343.337 95.7153,343.85 97.1611,345.331 98.9692,347.183 99.084,347.3 99.1016,347.318 99.125,347.341 101.099,349.261 102.63,350.75 103.104,351.199 103.7,351.762 105.153,353.104 106.339,354.2 107.222,354.994 108.275,355.94 109.323,356.86 110.223,357.65 111.454,358.703 112.85,359.896 113.608,360.528 114.293,361.1 115.8,362.325 117.425,363.646 118.009,364.109 118.565,364.55 120.261,365.861 122,367.206 122.526,367.603 123.053,368 124.836,369.312 126.575,370.59 127.159,371.009 127.774,371.45 129.525,372.675 131.15,373.812 131.908,374.328 132.747,374.9 134.329,375.953 135.725,376.881 136.772,377.56 137.993,378.35 139.247,379.144 140.3,379.81 141.753,380.704 143.534,381.8 144.28,382.249 144.875,382.607 146.849,383.761 149.396,385.25 149.427,385.268 149.45,385.281 149.606,385.368 152.062,386.731 154.025,387.821 154.705,388.188 155.657,388.7 157.389,389.613 158.6,390.251 160.101,391.018 162.317,392.15 162.833,392.408 163.175,392.579 164.765,393.349 165.614,393.76 167.75,394.794 168.409,395.103 169.47,395.6 171.245,396.414 172.325,396.91 174.113,397.702 176.536,398.775 176.9,398.937 176.996,398.978 177.165,399.05 179.936,400.211 181.475,400.856 182.895,401.429 185.548,402.5"/>
<polyline fill="none" stroke="#ffffff" stroke-width="1" points="533.75,346.289 533.209,346.892 532.843,347.3 531.336,348.93 530.755,349.558 529.654,350.75 529.454,350.96 529.175,351.253 527.524,352.955 526.315,354.2 525.579,354.938 524.6,355.918 523.603,356.897 522.835,357.65 521.596,358.834 520.025,360.334 519.572,360.758 519.207,361.1 517.505,362.65 515.45,364.521 515.433,364.537 515.418,364.55 515.208,364.733 513.307,366.384 511.446,368 511.177,368.228 510.875,368.484 509.001,370.037 507.295,371.45 506.815,371.838 506.3,372.255 504.587,373.608 502.954,374.9 502.347,375.369 501.725,375.848 500.066,377.099 498.408,378.35 497.771,378.819 497.15,379.276 495.438,380.509 493.643,381.8 493.09,382.188 492.575,382.551 490.701,383.837 488.642,385.25 488.302,385.478 488,385.681 485.857,387.084 483.667,388.517 483.425,388.676 483.408,388.687 483.387,388.7 480.905,390.25 478.85,391.533 478.397,391.808 477.835,392.15 475.846,393.334 474.275,394.27 473.277,394.848 471.979,395.6 470.679,396.338 469.7,396.894 468.049,397.805 465.793,399.05 465.404,399.26 465.125,399.411 463.544,400.242 462.711,400.68 460.55,401.816 460.009,402.092 459.209,402.5"/>
<polyline fill="none" stroke="#ffffff" stroke-width="1" points="459.209,57.5 460.009,57.9082 460.55,58.1841 462.711,59.3203 463.544,59.7583 465.125,60.5889 465.404,60.7397 465.793,60.9502 468.049,62.1953 469.7,63.1064 470.679,63.6621 471.979,64.3999 473.277,65.1523 474.275,65.7305 475.846,66.6655 477.835,67.8501 478.397,68.1919 478.85,68.4673 480.905,69.7505 483.387,71.2998 483.408,71.313 483.425,71.3242 483.667,71.4829 485.857,72.916 488,74.3193 488.302,74.522 488.642,74.75 490.701,76.1631 492.575,77.4492 493.09,77.8115 493.643,78.2002 495.438,79.4912 497.15,80.7236 497.771,81.1812 498.408,81.6499 500.066,82.9009 501.725,84.1519 502.347,84.6313 502.954,85.1001 504.587,86.3916 506.3,87.7451 506.815,88.1616 507.295,88.5498 509.001,89.9634 510.875,91.5161 511.177,91.772 511.446,92 513.307,93.6162 515.208,95.2671 515.418,95.4502 515.433,95.4629 515.45,95.4785 517.505,97.3501 519.207,98.8999 519.572,99.2417 520.025,99.6655 521.596,101.166 522.835,102.35 523.603,103.103 524.6,104.082 525.579,105.062 526.315,105.8 527.524,107.045 529.175,108.747 529.454,109.04 529.654,109.25 530.755,110.442 531.336,111.07 532.843,112.7 533.209,113.108 533.75,113.711"/>
<polyline fill="none" stroke="#ffffff" stroke-width="1" points="76.25,113.711 76.791,113.108 77.1572,112.7 78.6636,111.07 79.2446,110.442 80.3462,109.25 80.5459,109.04 80.8252,108.747 82.4761,107.045 83.6851,105.8 84.4214,105.062 85.3999,104.082 86.3975,103.103 87.1646,102.35 88.4043,101.166 89.9751,99.6655 90.4282,99.2417 90.7935,98.8999 92.4951,97.3501 94.5498,95.4785 94.5674,95.4629 94.582,95.4502 94.7925,95.2671 96.6934,93.6162 98.5537,92 98.8228,91.772 99.125,91.5161 100.999,89.9634 102.705,88.5498 103.185,88.1616 103.7,87.7451 105.413,86.3916 107.046,85.1001 107.653,84.6313 108.275,84.1519 109.934,82.9009 111.592,81.6499 112.229,81.1812 112.85,80.7236 114.563,79.4912 116.357,78.2002 116.91,77.8115 117.425,77.4492 119.299,76.1631 121.358,74.75 121.698,74.522 122,74.3193 124.143,72.916 126.333,71.4829 126.575,71.3242 126.592,71.313 126.613,71.2998 129.095,69.7505 131.15,68.4673 131.603,68.1919 132.165,67.8501 134.154,66.6655 135.725,65.7305 136.723,65.1523 138.021,64.3999 139.321,63.6621 140.3,63.1064 141.951,62.1953 144.207,60.9502 144.596,60.7397 144.875,60.5889 146.456,59.7583 147.289,59.3203 149.45,58.1841 149.991,57.9082 150.791,57.5"/>
<polyline fill="none" stroke="#ffffff" stroke-width="1" points="76.25,346.289 76.791,346.892 77.1572,347.3 78.6636,348.93 79.2446,349.558 80.3462,350.75 80.5459,350.96 80.8252,351.253 82.4761,352.955 83.6851,354.2 84.4214,354.938 85.3999,355.918 86.3975,356.897 87.1646,357.65 88.4043,358.834 89.9751,360.334 90.4282,360.758 90.7935,361.1 92.4951,362.65 94.5498,364.521 94.5674,364.537 94.582,364.55 94.7925,364.733 96.6934,366.384 98.5537,368 98.8228,368.228 99.125,368.484 100.999,370.037 102.705,371.45 103.185,371.838 103.7,372.255 105.413,373.608 107.046,374.9 107.653,375.369 108.275,375.848 109.934,377.099 111.592,378.35 112.229,378.819 112.85,379.276 114.563,380.509 116.357,381.8 116.91,382.188 117.425,382.551 119.299,383.837 121.358,385.25 121.698,385.478 122,385.681 124.143,387.084 126.333,388.517 126.575,388.676 126.592,388.687 126.613,388.7 129.095,390.25 131.15,391.533 131.603,391.808 132.165,392.15 134.154,393.334 135.725,394.27 136.723,394.848 138.021,395.6 139.321,396.338 140.3,396.894 141.951,397.805 144.207,399.05 144.596,399.26 144.875,399.411 146.456,400.242 147.289,400.68 149.45,401.816 149.991,402.092 150.791,402.5"/>
<polyline fill="none" stroke="#000090" stroke-width="1" points="533.75,367.603 533.516,367.824 533.33,368 531.46,369.723 531.439,369.743 529.587,371.45 529.399,371.619 529.175,371.82 527.292,373.48 525.681,374.9 525.176,375.334 524.6,375.83 523.022,377.16 521.61,378.35 520.852,378.974 520.025,379.655 518.65,380.763 517.364,381.8 516.428,382.538 515.45,383.308 514.177,384.29 512.932,385.25 511.903,386.025 510.875,386.801 509.602,387.74 508.3,388.7 507.278,389.438 506.3,390.144 504.925,391.113 503.456,392.15 502.552,392.774 501.725,393.345 500.147,394.41 498.383,395.6 497.726,396.034 497.15,396.415 495.267,397.63 493.066,399.05 492.799,399.219 492.575,399.36 490.311,400.758 490.285,400.773 488,402.183 487.766,402.324 487.474,402.5"/>
<polyline fill="none" stroke="#000090" stroke-width="1" points="487.474,57.5 487.766,57.6763 488,57.8169 490.285,59.2266 490.311,59.2422 492.575,60.6396 492.799,60.7813 493.066,60.9502 495.267,62.3701 497.15,63.585 497.726,63.9658 498.383,64.3999 500.147,65.5898 501.725,66.6548 502.552,67.2261 503.456,67.8501 504.925,68.8867 506.3,69.8564 507.278,70.5625 508.3,71.2998 509.602,72.2603 510.875,73.1992 511.903,73.9746 512.932,74.75 514.177,75.71 515.45,76.6919 516.428,77.4624 517.364,78.2002 518.65,79.2368 520.025,80.3452 520.852,81.0264 521.61,81.6499 523.022,82.8398 524.6,84.1699 525.176,84.6655 525.681,85.1001 527.292,86.52 529.175,88.1797 529.399,88.3813 529.587,88.5498 531.439,90.2573 531.46,90.2769 533.33,92 533.516,92.1763 533.75,92.397"/>
<polyline fill="none" stroke="#000090" stroke-width="1" points="76.25,92.397 76.4839,92.1763 76.6699,92 78.54,90.2769 78.5605,90.2573 80.4131,88.5498 80.6011,88.3813 80.8252,88.1797 82.708,86.52 84.3193,85.1001 84.8242,84.6655 85.3999,84.1699 86.978,82.8398 88.3901,81.6499 89.1479,81.0264 89.9751,80.3452 91.3496,79.2368 92.6357,78.2002 93.5718,77.4624 94.5498,76.6919 95.8232,75.71 97.0684,74.75 98.0967,73.9746 99.125,73.1992 100.398,72.2603 101.7,71.2998 102.722,70.5625 103.7,69.8564 105.075,68.8867 106.544,67.8501 107.448,67.2261 108.275,66.6548 109.853,65.5898 111.617,64.3999 112.274,63.9658 112.85,63.585 114.733,62.3701 116.934,60.9502 117.201,60.7813 117.425,60.6396 119.689,59.2422 119.715,59.2266 122,57.8169 122.234,57.6763 122.526,57.5"/>
<polyline fill="none" stroke="#000090" stroke-width="1" points="76.25,367.603 76.4839,367.824 76.6699,368 78.54,369.723 78.5605,369.743 80.4131,371.45 80.6011,371.619 80.8252,371.82 82.708,373.48 84.3193,374.9 84.8242,375.334 85.3999,375.83 86.978,377.16 88.3901,378.35 89.1479,378.974 89.9751,379.655 91.3496,380.763 92.6357,381.8 93.5718,382.538 94.5498,383.308 95.8232,384.29 97.0684,385.25 98.0967,386.025 99.125,386.801 100.398,387.74 101.7,388.7 102.722,389.438 103.7,390.144 105.075,391.113 106.544,392.15 107.448,392.774 108.275,393.345 109.853,394.41 111.617,395.6 112.274,396.034 112.85,396.415 114.733,397.63 116.934,399.05 117.201,399.219 117.425,399.36 119.689,400.758 119.715,400.773 122,402.183 122.234,402.324 122.526,402.5"/>
<polyline fill="none" stroke="#0000b0" stroke-width="1" points="533.75,386.025 532.051,387.419 530.49,388.7 529.853,389.211 529.175,389.755 527.621,390.978 526.131,392.15 525.374,392.733 524.6,393.329 523.094,394.464 521.588,395.6 520.798,396.183 520.025,396.754 518.471,397.878 516.85,399.05 516.128,399.562 515.45,400.042 513.751,401.219 511.903,402.5"/>
<polyline fill="none" stroke="#0000b0" stroke-width="1" points="511.903,57.5 513.751,58.7808 515.45,59.9585 516.128,60.4385 516.85,60.9502 518.471,62.1221 520.025,63.2456 520.798,63.8169 521.588,64.3999 523.094,65.5356 524.6,66.6714 525.374,67.2666 526.131,67.8501 527.621,69.022 529.175,70.2446 529.853,70.7886 530.49,71.2998 532.051,72.5811 533.75,73.9746"/>
<polyline fill="none" stroke="#0000b0" stroke-width="1" points="76.25,73.9746 77.9487,72.5811 79.5103,71.2998 80.147,70.7886 80.8252,70.2446 82.3794,69.022 83.8691,67.8501 84.6265,67.2666 85.3999,66.6714 86.9063,65.5356 88.4121,64.3999 89.2017,63.8169 89.9751,63.2456 91.5293,62.1221 93.1504,60.9502 93.8721,60.4385 94.5498,59.9585 96.2485,58.7808 98.0967,57.5"/>
<polyline fill="none" stroke="#0000b0" stroke-width="1" points="76.25,386.025 77.9487,387.419 79.5103,388.7 80.147,389.211 80.8252,389.755 82.3794,390.978 83.8691,392.15 84.6265,392.733 85.3999,393.329 86.9063,394.464 88.4121,395.6 89.2017,396.183 89.9751,396.754 91.5293,397.878 93.1504,399.05 93.8721,399.562 94.5498,400.042 96.2485,401.219 98.0967,402.5"/>
<polyline fill="none" stroke="#000000" stroke-width="1" points="290.859,302.764 291.275,302.815"/>
<polyline fill="none" stroke="#000000" stroke-width="1" points="288.304,302.45 290.859,302.764"/>
<polyline fill="none" stroke="#000000" stroke-width="1" points="286.934,302.273 288.304,302.45"/>
<polyline fill="none" stroke="#000000" stroke-width="1" points="286.7,302.244 286.934,302.273"/>
<polyline fill="none" stroke="#000000" stroke-width="1" points="286.349,302.186 286.7,302.244"/>
<polyline fill="none" stroke="#000000" stroke-width="1" points="283.173,301.66 286.349,302.186"/>
<polyline fill="none" stroke="#000000" stroke-width="1" points="282.125,301.486 283.173,301.66"/>
<polyline fill="none" stroke="#000000" stroke-width="1" points="280.378,301.133 282.125,301.486"/>
<polyline fill="none" stroke="#000000" stroke-width="1" points="279.525,300.96 280.378,301.133"/>
<polyline fill="none" stroke="#000000" stroke-width="1" points="277.55,300.561 279.525,300.96"/>
<polyline fill="none" stroke="#000000" stroke-width="1" points="275.979,300.185 277.55,300.561"/>
<polyline fill="none" stroke="#000000" stroke-width="1" points="273.881,299.683 275.979,300.185"/>
<polyline fill="none" stroke="#000000" stroke-width="1" points="272.975,299.467 273.881,299.683"/>
<polyline fill="none" stroke="#000000" stroke-width="1" points="272.522,299.342 272.975,299.467"/>
<polyline fill="none" stroke="#000000" stroke-width="1" points="271.284,299 272.522,299.342"/>
<polyline fill="none" stroke="#000000" stroke-width="1" points="269.201,298.396 271.284,299"/>
<polyline fill="none" stroke="#000000" stroke-width="1" points="268.4,298.164 269.201,298.396"/>
<polyline fill="none" stroke="#ff0000" stroke-width="1" points="91.043,261.855 91.4565,263.383"/>
<polyline fill="none" stroke="#000000" stroke-width="1" points="266.434,297.518 268.4,298.164"/>
<polyline fill="none" stroke="#000000" stroke-width="1" points="263.825,296.66 265.986,297.37"/>
<polyline fill="none" stroke="#000000" stroke-width="1" points="262.835,296.296 263.825,296.66"/>
<polyline fill="none" stroke="#000000" stroke-width="1" points="260.804,295.55 262.835,296.296"/>
<polyline fill="none" stroke="#000000" stroke-width="1" points="259.777,295.152 260.804,295.55"/>
<polyline fill="none" stroke="#000000" stroke-width="1" points="259.25,294.948 259.777,295.152"/>
<polyline fill="none" stroke="#000000" stroke-width="1" points="257.404,294.158 259.25,294.948"/>
<polyline fill="none" stroke="#000000" stroke-width="1" points="256.841,293.917 257.404,294.158"/>
<polyline fill="none" stroke="#000000" stroke-width="1" points="254.675,292.99 256.841,293.917"/>
<polyline fill="none" stroke="#000000" stroke-width="1" points="253.947,292.649 254.675,292.99"/>
<polyline fill="none" stroke="#000000" stroke-width="1" points="252.776,292.1 253.947,292.649"/>
<polyline fill="none" stroke="#000000" stroke-width="1" points="251.161,291.3 252.776,292.1"/>
<polyline fill="none" stroke="#000000" stroke-width="1" points="250.1,290.774 251.161,291.3"/>
<polyline fill="none" stroke="#000000" stroke-width="1" points="248.457,289.889 250.1,290.774"/>
<polyline fill="none" stroke="#000000" stroke-width="1" points="246.157,288.65 248.457,289.889"/>
<polyline fill="none" stroke="#000000" stroke-width="1" points="245.797,288.444 246.157,288.65"/>
<polyline fill="none" stroke="#000000" stroke-width="1" points="245.525,288.289 245.797,288.444"/>
<polyline fill="none" stroke="#000000" stroke-width="1" points="243.272,286.899 245.525,288.289"/>
<polyline fill="none" stroke="#000000" stroke-width="1" points="242.891,286.664 243.272,286.899"/>
<polyline fill="none" stroke="#000000" stroke-width="1" points="240.95,285.466 242.891,286.664"/>
<polyline fill="none" stroke="#000000" stroke-width="1" points="240.762,285.342 240.95,285.466"/>
<polyline fill="none" stroke="#000000" stroke-width="1" points="240.548,285.2 240.762,285.342"/>
<polyline fill="none" stroke="#000000" stroke-width="1" points="238.392,283.679 240.548,285.2"/>
<polyline fill="none" stroke="#000000" stroke-width="1" points="218.075,263.328 218.603,264.103"/>
<polyline fill="none" stroke="#000000" stroke-width="1" points="217.085,261.796 218.075,263.328"/>
<polyline fill="none" stroke="#000000" stroke-width="1" points="216.604,261.05 217.085,261.796"/>
<polyline fill="none" stroke="#000000" stroke-width="1" points="215.661,259.42 216.604,261.05"/>
<polyline fill="none" stroke="#000000" stroke-width="1" points="215.466,259.083 215.661,259.42"/>
<polyline fill="none" stroke="#000000" stroke-width="1" points="214.609,257.6 215.466,259.083"/>
<polyline fill="none" stroke="#000000" stroke-width="1" points="214.301,256.996 214.609,257.6"/>
<polyline fill="none" stroke="#000000" stroke-width="1" points="213.5,255.425 214.301,256.996"/>
<polyline fill="none" stroke="#000000" stroke-width="1" points="213.047,254.492 213.5,255.425"/>
<polyline fill="none" stroke="#000000" stroke-width="1" points="212.881,254.15 213.047,254.492"/>
<polyline fill="none" stroke="#000000" stroke-width="1" points="212.594,253.467 212.881,254.15"/>
<polyline fill="none" stroke="#000000" stroke-width="1" points="236.375,282.256 238.392,283.679"/>
<polyline fill="none" stroke="#000000" stroke-width="1" points="236.04,282.003 236.375,282.256"/>
<polyline fill="none" stroke="#000000" stroke-width="1" points="235.704,281.75 236.04,282.003"/>
<polyline fill="none" stroke="#000000" stroke-width="1" points="233.817,280.229 235.704,281.75"/>
<polyline fill="none" stroke="#000000" stroke-width="1" points="231.8,278.603 233.817,280.229"/>
<polyline fill="none" stroke="#000000" stroke-width="1" points="231.612,278.441 231.8,278.603"/>
<polyline fill="none" stroke="#000000" stroke-width="1" points="231.447,278.3 231.612,278.441"/>
<polyline fill="none" stroke="#000000" stroke-width="1" points="229.859,276.836 231.447,278.3"/>
<polyline fill="none" stroke="#000000" stroke-width="1" points="229.547,276.549 229.859,276.836"/>
<polyline fill="none" stroke="#000000" stroke-width="1" points="227.704,274.85 229.547,276.549"/>
<polyline fill="none" stroke="#000000" stroke-width="1" points="227.498,274.645 227.704,274.85"/>
<polyline fill="none" stroke="#000000" stroke-width="1" points="227.225,274.373 227.498,274.645"/>
<polyline fill="none" stroke="#000000" stroke-width="1" points="225.582,272.639 227.225,274.373"/>
<polyline fill="none" stroke="#000000" stroke-width="1" points="224.409,271.4 225.582,272.639"/>
<polyline fill="none" stroke="#000000" stroke-width="1" points="223.711,270.6 224.409,271.4"/>
<polyline fill="none" stroke="#000000" stroke-width="1" points="222.65,269.382 223.711,270.6"/>
<polyline fill="none" stroke="#000000" stroke-width="1" points="221.922,268.499 222.65,269.382"/>
<polyline fill="none" stroke="#000000" stroke-width="1" points="221.47,267.95 221.922,268.499"/>
<polyline fill="none" stroke="#000000" stroke-width="1" points="220.241,266.317 221.47,267.95"/>
<polyline fill="none" stroke="#000000" stroke-width="1" points="219.92,265.892 220.241,266.317"/>
<polyline fill="none" stroke="#ff0000" stroke-width="1" points="92.7925,267.95 93.1411,269.013"/>
<polyline fill="none" stroke="#000000" stroke-width="1" points="218.873,264.5 219.92,265.892"/>
<polyline fill="none" stroke="#000000" stroke-width="1" points="211.929,251.885 212.594,253.467"/>
<polyline fill="none" stroke="#000000" stroke-width="1" points="211.431,250.7 211.929,251.885"/>
<polyline fill="none" stroke="#000000" stroke-width="1" points="210.9,249.21 211.431,250.7"/>
<polyline fill="none" stroke="#000000" stroke-width="1" points="210.672,248.567 210.9,249.21"/>
<polyline fill="none" stroke="#000000" stroke-width="1" points="210.203,247.25 210.672,248.567"/>
<polyline fill="none" stroke="#000000" stroke-width="1" points="209.973,246.459 210.203,247.25"/>
<polyline fill="none" stroke="#000000" stroke-width="1" points="209.276,244.064 209.973,246.459"/>
<polyline fill="none" stroke="#000000" stroke-width="1" points="209.199,243.8 209.276,244.064"/>
<polyline fill="none" stroke="#000000" stroke-width="1" points="209.159,243.624 209.199,243.8"/>
<polyline fill="none" stroke="#000000" stroke-width="1" points="208.925,242.59 209.159,243.624"/>
<polyline fill="none" stroke="#ff0000" stroke-width="1" points="89.9912,257.612 90.6934,260.508"/>
</g>
</svg>
