<?xml version="1.0" encoding="UTF-8" standalone="no"?>
<svg xmlns="http://www.w3.org/2000/svg"
     xmlns:xlink="http://www.w3.org/1999/xlink"
     width="610px" height="460px" viewBox="0 0 610 460">
<title>Graphic window number 0</title>
<desc>
Creator: GL2PS 1.3.2, (C) 1999-2006 Christophe Geuzaine (geuz@geuz.org)
For: Scilab
CreationDate: Fri Nov 27 19:44:26 2009
</desc>
<defs>
</defs>
<polygon fill="#ffffff" points="0,0 610,0 610,460 0,460"/>
<g>
<polygon fill="#ffffff" points="76.25,402.5 533.75,57.5 76.25,57.5"/>
<polygon fill="#ffffff" points="76.25,402.5 533.75,402.5 533.75,57.5"/>
<polygon fill="#ffffff" points="76.25,402.5 533.75,402.5 533.75,402.5"/>
<polygon fill="#ffffff" points="76.25,402.5 76.25,57.5 76.25,57.5"/>
<polygon fill="#ffffff" points="76.25,402.5 533.75,402.5 76.25,402.5"/>
<polygon fill="#ffffff" points="76.25,402.5 76.25,57.5 76.25,402.5"/>
<text fill="#000000" x="480" y="419" transform="rotate(-0, 480, 419)" font-size="10" font-family="SansSerif" font-style="normal" font-weight="normal">0.8</text>
<text fill="#000000" x="434" y="419" transform="rotate(-0, 434, 419)" font-size="10" font-family="SansSerif" font-style="normal" font-weight="normal">0.6</text>
<text fill="#000000" x="389" y="419" transform="rotate(-0, 389, 419)" font-size="10" font-family="SansSerif" font-style="normal" font-weight="normal">0.4</text>
<text fill="#000000" x="343" y="419" transform="rotate(-0, 343, 419)" font-size="10" font-family="SansSerif" font-style="normal" font-weight="normal">0.2</text>
<text fill="#000000" x="297" y="419" transform="rotate(-0, 297, 419)" font-size="10" font-family="SansSerif" font-style="normal" font-weight="normal">0.0</text>
<text fill="#000000" x="250" y="419" transform="rotate(-0, 250, 419)" font-size="10" font-family="SansSerif" font-style="normal" font-weight="normal">-0.2</text>
<text fill="#000000" x="204" y="419" transform="rotate(-0, 204, 419)" font-size="10" font-family="SansSerif" font-style="normal" font-weight="normal">-0.4</text>
<text fill="#000000" x="158" y="419" transform="rotate(-0, 158, 419)" font-size="10" font-family="SansSerif" font-style="normal" font-weight="normal">-0.6</text>
<text fill="#000000" x="113" y="419" transform="rotate(-0, 113, 419)" font-size="10" font-family="SansSerif" font-style="normal" font-weight="normal">-0.8</text>
<text fill="#000000" x="67" y="419" transform="rotate(-0, 67, 419)" font-size="10" font-family="SansSerif" font-style="normal" font-weight="normal">-1.0</text>
<text fill="#000000" x="53" y="62" transform="rotate(-0, 53, 62)" font-size="10" font-family="SansSerif" font-style="normal" font-weight="normal">1.0</text>
<text fill="#000000" x="52" y="97" transform="rotate(-0, 52, 97)" font-size="10" font-family="SansSerif" font-style="normal" font-weight="normal">0.8</text>
<text fill="#000000" x="52" y="131" transform="rotate(-0, 52, 131)" font-size="10" font-family="SansSerif" font-style="normal" font-weight="normal">0.6</text>
<text fill="#000000" x="52" y="166" transform="rotate(-0, 52, 166)" font-size="10" font-family="SansSerif" font-style="normal" font-weight="normal">0.4</text>
<text fill="#000000" x="52" y="200" transform="rotate(-0, 52, 200)" font-size="10" font-family="SansSerif" font-style="normal" font-weight="normal">0.2</text>
<text fill="#000000" x="52" y="235" transform="rotate(-0, 52, 235)" font-size="10" font-family="SansSerif" font-style="normal" font-weight="normal">0.0</text>
<text fill="#000000" x="49" y="269" transform="rotate(-0, 49, 269)" font-size="10" font-family="SansSerif" font-style="normal" font-weight="normal">-0.2</text>
<text fill="#000000" x="49" y="304" transform="rotate(-0, 49, 304)" font-size="10" font-family="SansSerif" font-style="normal" font-weight="normal">-0.4</text>
<text fill="#000000" x="49" y="339" transform="rotate(-0, 49, 339)" font-size="10" font-family="SansSerif" font-style="normal" font-weight="normal">-0.6</text>
<text fill="#000000" x="49" y="373" transform="rotate(-0, 49, 373)" font-size="10" font-family="SansSerif" font-style="normal" font-weight="normal">-0.8</text>
<text fill="#000000" x="49" y="407" transform="rotate(-0, 49, 407)" font-size="10" font-family="SansSerif" font-style="normal" font-weight="normal">-1.0</text>
<text fill="#000000" x="526" y="419" transform="rotate(-0, 526, 419)" font-size="10" font-family="SansSerif" font-style="normal" font-weight="normal">1.0</text>
<polyline fill="none" stroke="#000000" stroke-width="1" points="510.875,402.5 510.875,405.605"/>
<polyline fill="none" stroke="#000000" stroke-width="1" points="419.375,402.5 419.375,405.605"/>
<polyline fill="none" stroke="#000000" stroke-width="1" points="373.625,402.5 373.625,405.605"/>
<polyline fill="none" stroke="#000000" stroke-width="1" points="327.875,402.5 327.875,405.605"/>
<polyline fill="none" stroke="#000000" stroke-width="1" points="282.125,402.5 282.125,405.605"/>
<polyline fill="none" stroke="#000000" stroke-width="1" points="236.375,402.5 236.375,405.605"/>
<polyline fill="none" stroke="#000000" stroke-width="1" points="190.625,402.5 190.625,405.605"/>
<polyline fill="none" stroke="#000000" stroke-width="1" points="144.875,402.5 144.875,405.605"/>
<polyline fill="none" stroke="#000000" stroke-width="1" points="99.125,402.5 99.125,405.605"/>
<polyline fill="none" stroke="#000000" stroke-width="1" points="533.75,402.5 533.75,407.675"/>
<polyline fill="none" stroke="#000000" stroke-width="1" points="488,402.5 488,407.675"/>
<polyline fill="none" stroke="#000000" stroke-width="1" points="442.25,402.5 442.25,407.675"/>
<polyline fill="none" stroke="#000000" stroke-width="1" points="396.5,402.5 396.5,407.675"/>
<polyline fill="none" stroke="#000000" stroke-width="1" points="350.75,402.5 350.75,407.675"/>
<polyline fill="none" stroke="#000000" stroke-width="1" points="305,402.5 305,407.675"/>
<polyline fill="none" stroke="#000000" stroke-width="1" points="259.25,402.5 259.25,407.675"/>
<polyline fill="none" stroke="#000000" stroke-width="1" points="213.5,402.5 213.5,407.675"/>
<polyline fill="none" stroke="#000000" stroke-width="1" points="167.75,402.5 167.75,407.675"/>
<polyline fill="none" stroke="#000000" stroke-width="1" points="122,402.5 122,407.675"/>
<polyline fill="none" stroke="#000000" stroke-width="1" points="76.25,402.5 76.25,407.675"/>
<polyline fill="none" stroke="#000000" stroke-width="1" points="76.25,402.5 533.75,402.5"/>
<polyline fill="none" stroke="#000000" stroke-width="1" points="76.25,74.75 72.1372,74.75"/>
<polyline fill="none" stroke="#000000" stroke-width="1" points="76.25,109.25 72.1372,109.25"/>
<polyline fill="none" stroke="#000000" stroke-width="1" points="76.25,143.75 72.1372,143.75"/>
<polyline fill="none" stroke="#000000" stroke-width="1" points="76.25,178.25 72.1372,178.25"/>
<polyline fill="none" stroke="#000000" stroke-width="1" points="76.25,212.75 72.1372,212.75"/>
<polyline fill="none" stroke="#000000" stroke-width="1" points="76.25,247.25 72.1372,247.25"/>
<polyline fill="none" stroke="#000000" stroke-width="1" points="76.25,281.75 72.1372,281.75"/>
<polyline fill="none" stroke="#000000" stroke-width="1" points="76.25,316.25 72.1372,316.25"/>
<polyline fill="none" stroke="#000000" stroke-width="1" points="76.25,350.75 72.1372,350.75"/>
<polyline fill="none" stroke="#000000" stroke-width="1" points="76.25,385.25 72.1372,385.25"/>
<polyline fill="none" stroke="#000000" stroke-width="1" points="76.25,57.5 69.395,57.5"/>
<polyline fill="none" stroke="#000000" stroke-width="1" points="76.25,92 69.395,92"/>
<polyline fill="none" stroke="#000000" stroke-width="1" points="76.25,126.5 69.395,126.5"/>
<polyline fill="none" stroke="#000000" stroke-width="1" points="76.25,161 69.395,161"/>
<polyline fill="none" stroke="#000000" stroke-width="1" points="76.25,195.5 69.395,195.5"/>
<polyline fill="none" stroke="#000000" stroke-width="1" points="76.25,230 69.395,230"/>
<polyline fill="none" stroke="#000000" stroke-width="1" points="76.25,264.5 69.395,264.5"/>
<polyline fill="none" stroke="#000000" stroke-width="1" points="76.25,299 69.395,299"/>
<polyline fill="none" stroke="#000000" stroke-width="1" points="76.25,333.5 69.395,333.5"/>
<polyline fill="none" stroke="#000000" stroke-width="1" points="76.25,368 69.395,368"/>
<polyline fill="none" stroke="#000000" stroke-width="1" points="76.25,402.5 69.395,402.5"/>
<polyline fill="none" stroke="#000000" stroke-width="1" points="76.25,402.5 76.25,57.5"/>
<polyline fill="none" stroke="#000000" stroke-width="1" points="465.125,402.5 465.125,405.605"/>
<text fill="#000000" x="495" y="199" transform="rotate(0, 495, 199)" font-size="10" font-family="SansSerif" font-style="normal" font-weight="normal"> 0.7</text>
<text fill="#000000" x="431" y="212" transform="rotate(0, 431, 212)" font-size="10" font-family="SansSerif" font-style="normal" font-weight="normal"> 0.3</text>
<text fill="#000000" x="376" y="211" transform="rotate(0, 376, 211)" font-size="10" font-family="SansSerif" font-style="normal" font-weight="normal"> 0.1</text>
<text fill="#000000" x="467" y="211" transform="rotate(0, 467, 211)" font-size="10" font-family="SansSerif" font-style="normal" font-weight="normal"> 0.5</text>
<polyline fill="none" stroke="#000000" stroke-width="1" points="321.584,283.044 323.3,282.751 324.33,282.526 327.875,281.75 327.875,281.75 327.875,281.75 327.875,281.75 331.192,280.801 332.45,280.441 334.411,279.779 335.595,279.378 337.025,278.895 337.545,278.692 338.55,278.3 340.511,277.479 341.6,277.022 343.368,276.183 346.175,274.85 346.175,274.85 346.175,274.85 346.175,274.85 348.774,273.36 350.75,272.228 351.347,271.85 352.057,271.4 353.765,270.224 355.325,269.15 356.121,268.55 356.917,267.95 358.34,266.774 359.9,265.486 360.497,264.95 360.998,264.5 362.5,263.01 364.475,261.05 364.475,261.05 364.475,261.05 364.475,261.05 366.243,258.933 367.355,257.6 367.961,256.779 369.05,255.3 369.57,254.542 369.839,254.15 370.479,253.072 371.011,252.179 371.89,250.7 372.367,249.751 373.625,247.25 373.625,247.25 373.625,247.25 373.625,247.25 374.654,244.576 374.953,243.8 375.341,242.506 375.551,241.803 375.986,240.35 376.294,238.913 376.44,238.227 376.724,236.9 376.854,235.885 377.056,234.313 377.167,233.45 377.199,232.695 377.285,230.69 377.314,230 377.285,229.31 377.199,227.305 377.167,226.55 377.056,225.688 376.854,224.115 376.724,223.1 376.44,221.773 376.294,221.087 375.986,219.65 375.551,218.197 375.341,217.494 374.953,216.2 374.654,215.424 373.625,212.75 373.625,212.75 373.625,212.75 373.625,212.75 372.367,210.249 371.89,209.3 371.011,207.821 370.479,206.928 369.839,205.85 369.57,205.458 369.05,204.7 367.961,203.221 367.355,202.4 366.243,201.067 364.475,198.95 364.475,198.95 364.475,198.95 364.475,198.95 362.5,196.99 360.998,195.5 360.497,195.05 359.9,194.514 358.34,193.226 356.917,192.05 356.121,191.45 355.325,190.85 353.765,189.776 352.057,188.6 351.347,188.15 350.75,187.772 348.774,186.64 346.175,185.15 346.175,185.15 346.175,185.15 346.175,185.15 343.368,183.817 341.6,182.978 340.511,182.521 338.55,181.7 337.545,181.308 337.025,181.105 335.595,180.622 334.411,180.221 332.45,179.559 331.192,179.199 327.875,178.25 327.875,178.25 327.875,178.25 327.875,178.25 324.33,177.474 323.3,177.249 321.584,176.956 320.651,176.797 318.725,176.469 316.819,176.237 315.91,176.127 314.15,175.913 312.804,175.815 310.719,175.663 309.575,175.579 308.574,175.555 305.915,175.49 305,175.468 304.085,175.49 301.426,175.555 300.425,175.579 299.281,175.663 297.196,175.815 295.85,175.913 294.09,176.127 293.181,176.237 291.275,176.469 289.349,176.797 288.416,176.956 286.7,177.249 285.67,177.474 282.125,178.25 282.125,178.25 282.125,178.25 282.125,178.25 278.808,179.199 277.55,179.559 275.589,180.221 274.405,180.622 272.975,181.105 272.455,181.308 271.45,181.7 269.489,182.521 268.4,182.978 266.632,183.817 263.825,185.15 263.825,185.15 263.825,185.15 263.825,185.15 261.226,186.64 259.25,187.772 258.653,188.15 257.943,188.6 256.235,189.776 254.675,190.85 253.879,191.45 253.083,192.05 251.66,193.226 250.1,194.514 249.503,195.05 249.002,195.5 247.5,196.99 245.525,198.95 245.525,198.95 245.525,198.95 245.525,198.95 243.757,201.067 242.645,202.4 242.039,203.221 240.95,204.7 240.43,205.458 240.161,205.85 239.521,206.928 238.989,207.821 238.11,209.3 237.633,210.249 236.375,212.75 236.375,212.75 236.375,212.75 236.375,212.75 235.346,215.424 235.047,216.2 234.659,217.494 234.449,218.197 234.014,219.65 233.706,221.087 233.56,221.773 233.276,223.1 233.146,224.115 232.944,225.688 232.833,226.55 232.801,227.305 232.715,229.31 232.686,230 232.715,230.69 232.801,232.695 232.833,233.45 232.944,234.313 233.146,235.885 233.276,236.9 233.56,238.227 233.706,238.913 234.014,240.35 234.449,241.803 234.659,242.506 235.047,243.8 235.346,244.576 236.375,247.25 236.375,247.25 236.375,247.25 236.375,247.25"/>
<polyline fill="none" stroke="#0000ff" stroke-width="1" points="181.475,245.717 181.77,247.027 181.82,247.25 181.911,247.579 182.547,249.892 182.77,250.7 183.19,251.994 183.416,252.687 183.892,254.15 184.368,255.418 184.846,256.692 185.187,257.6 185.396,258.093 186.05,259.629 186.521,260.695 186.678,261.05 187.051,261.805 187.75,263.219 188.382,264.5 189.037,265.698 190.015,267.49 190.266,267.95 190.378,268.137 190.625,268.55 191.833,270.49 192.399,271.4 193.345,272.799 194.247,274.131 194.733,274.85 194.899,275.077 195.2,275.489 196.56,277.274 197.341,278.3 198.27,279.435 199.775,281.274 200.022,281.563 200.182,281.75 201.082,282.736 201.882,283.611 203.333,285.2 203.764,285.642 204.35,286.246 205.734,287.606 206.797,288.65 207.752,289.535 208.925,290.622 209.828,291.419 210.599,292.1 211.975,293.25 213.5,294.524 214.162,295.051 214.791,295.55 216.433,296.789 218.075,298.027 218.737,298.5 219.435,299 221.125,300.15 222.65,301.188 223.553,301.769 224.611,302.45 226.052,303.334 227.225,304.055 228.609,304.856 230.414,305.9 231.213,306.342 231.8,306.667 233.907,307.761 235.068,308.364 236.375,309.043 236.622,309.164 237.006,309.35 239.445,310.485 240.95,311.185 242.31,311.774 244.678,312.8 245.224,313.027 245.525,313.152 246.478,313.519 248.245,314.199 250.1,314.912 251.307,315.339 253.879,316.25 254.428,316.437 254.675,316.521 255.285,316.71 257.662,317.448 259.25,317.941 260.949,318.418 262.824,318.945 263.825,319.227 264.296,319.345 265.709,319.7 267.747,320.193 268.4,320.351 269.604,320.608 271.293,320.968 272.975,321.327 274.916,321.687 275.834,321.856 277.55,322.173 278.622,322.341 281.689,322.821 282.125,322.89 282.42,322.927 284.158,323.15 286.343,323.419 286.7,323.464 287.177,323.509 290.39,323.818 291.275,323.903 292.373,323.978 294.554,324.127 295.85,324.216 297.346,324.278 298.848,324.34 300.425,324.405 302.12,324.428 303.284,324.444 305,324.467 306.716,324.444 307.88,324.428 309.575,324.405 311.152,324.34 312.654,324.278 314.15,324.216 315.446,324.127 317.627,323.978 318.725,323.903 319.61,323.818 322.823,323.509 323.3,323.464 323.657,323.419 325.842,323.15 327.58,322.927 327.875,322.89 328.311,322.821 331.378,322.341 332.45,322.173 334.166,321.856 335.084,321.687 337.025,321.327 338.707,320.968 340.396,320.608 341.6,320.351 342.253,320.193 344.291,319.7 345.704,319.345 346.175,319.227 347.176,318.945 349.051,318.418 350.75,317.941 352.338,317.448 354.715,316.71 355.325,316.521 355.572,316.437 356.121,316.25 358.693,315.339 359.9,314.912 361.755,314.199 363.522,313.519 364.475,313.152 364.776,313.027 365.322,312.8 367.69,311.774 369.05,311.185 370.555,310.485 372.994,309.35 373.378,309.164 373.625,309.043 374.932,308.364 376.093,307.761 378.2,306.667 378.787,306.342 379.586,305.9 381.391,304.856 382.775,304.055 383.948,303.334 385.389,302.45 386.447,301.769 387.35,301.188 388.875,300.15 390.565,299 391.263,298.5 391.925,298.027 393.567,296.789 395.209,295.55 395.838,295.051 396.5,294.524 398.025,293.25 399.401,292.1 400.172,291.419 401.075,290.622 402.248,289.535 403.203,288.65 404.266,287.606 405.65,286.246 406.236,285.642 406.667,285.2 408.118,283.611 408.918,282.736 409.818,281.75 409.978,281.563 410.225,281.274 411.73,279.435 412.659,278.3 413.44,277.274 414.8,275.489 415.101,275.077 415.267,274.85 415.753,274.131 416.655,272.799 417.601,271.4 418.167,270.49 419.375,268.55 419.622,268.137 419.734,267.95 419.985,267.49 420.963,265.698 421.618,264.5 422.25,263.219 422.949,261.805 423.322,261.05 423.479,260.695 423.95,259.629 424.604,258.093 424.813,257.6 425.154,256.692 425.632,255.418 426.108,254.15 426.584,252.687 426.81,251.994 427.23,250.7 427.453,249.892 428.089,247.579 428.18,247.25 428.23,247.027 428.525,245.717 428.882,244.069 428.941,243.8 429.001,243.44 429.411,241.018 429.523,240.35 429.623,239.522 429.821,237.877 429.939,236.9 430.021,235.772 430.103,234.64 430.188,233.45 430.219,232.172 430.241,231.294 430.272,230 430.241,228.706 430.219,227.828 430.188,226.55 430.103,225.36 430.021,224.228 429.939,223.1 429.821,222.123 429.623,220.478 429.523,219.65 429.411,218.982 429.001,216.56 428.941,216.2 428.882,215.931 428.525,214.283 428.23,212.973 428.18,212.75 428.089,212.421 427.453,210.108 427.23,209.3 426.81,208.006 426.584,207.313 426.108,205.85 425.632,204.582 425.154,203.308 424.813,202.4 424.604,201.907 423.95,200.371 423.479,199.305 423.322,198.95 422.949,198.195 422.25,196.781 421.618,195.5 420.963,194.302 419.985,192.51 419.734,192.05 419.622,191.863 419.375,191.45 418.167,189.51 417.601,188.6 416.655,187.201 415.753,185.869 415.267,185.15 415.101,184.923 414.8,184.511 413.44,182.726 412.659,181.7 411.73,180.565 410.225,178.726 409.978,178.437 409.818,178.25 408.918,177.264 408.118,176.389 406.667,174.8 406.236,174.358 405.65,173.754 404.266,172.394 403.203,171.35 402.248,170.465 401.075,169.378 400.172,168.581 399.401,167.9 398.025,166.75 396.5,165.476 395.838,164.949 395.209,164.45 393.567,163.211 391.925,161.973 391.263,161.5 390.565,161 388.875,159.85 387.35,158.812 386.447,158.231 385.389,157.55 383.948,156.666 382.775,155.945 381.391,155.144 379.586,154.1 378.787,153.658 378.2,153.333 376.093,152.239 374.932,151.636 373.625,150.957 373.378,150.836 372.994,150.65 370.555,149.515 369.05,148.815 367.69,148.226 365.322,147.2 364.776,146.973 364.475,146.848 363.522,146.481 361.755,145.801 359.9,145.088 358.693,144.661 356.121,143.75 355.572,143.563 355.325,143.479 354.715,143.29 352.338,142.552 350.75,142.059 349.051,141.582 347.176,141.055 346.175,140.773 345.704,140.655 344.291,140.3 342.253,139.807 341.6,139.649 340.396,139.392 338.707,139.032 337.025,138.673 335.084,138.313 334.166,138.144 332.45,137.827 331.378,137.659 328.311,137.179 327.875,137.11 327.58,137.073 325.842,136.85 323.657,136.581 323.3,136.536 322.823,136.491 319.61,136.182 318.725,136.097 317.627,136.022 315.446,135.873 314.15,135.784 312.654,135.722 311.152,135.66 309.575,135.595 307.88,135.572 306.716,135.556 305,135.533 303.284,135.556 302.12,135.572 300.425,135.595 298.848,135.66 297.346,135.722 295.85,135.784 294.554,135.873 292.373,136.022 291.275,136.097 290.39,136.182 287.177,136.491 286.7,136.536 286.343,136.581 284.158,136.85 282.42,137.073 282.125,137.11 281.689,137.179 278.622,137.659 277.55,137.827 275.834,138.144 274.916,138.313 272.975,138.673 271.293,139.032 269.604,139.392 268.4,139.649 267.747,139.807 265.709,140.3 264.296,140.655 263.825,140.773 262.824,141.055 260.949,141.582 259.25,142.059 257.662,142.552 255.285,143.29 254.675,143.479 254.428,143.563 253.879,143.75 251.307,144.661 250.1,145.088 248.245,145.801 246.478,146.481 245.525,146.848 245.224,146.973 244.678,147.2 242.31,148.226 240.95,148.815 239.445,149.515 237.006,150.65 236.622,150.836 236.375,150.957 235.068,151.636 233.907,152.239 231.8,153.333 231.213,153.658 230.414,154.1 228.609,155.144 227.225,155.945 226.052,156.666 224.611,157.55 223.553,158.231 222.65,158.812 221.125,159.85 219.435,161 218.737,161.5 218.075,161.973 216.433,163.211 214.791,164.45 214.162,164.949 213.5,165.476 211.975,166.75 210.599,167.9 209.828,168.581 208.925,169.378 207.752,170.465 206.797,171.35 205.734,172.394 204.35,173.754 203.764,174.358 203.333,174.8 201.882,176.389 201.082,177.264 200.182,178.25 200.022,178.437 199.775,178.726 198.27,180.565 197.341,181.7 196.56,182.726 195.2,184.511 194.899,184.923 194.733,185.15 194.247,185.869 193.345,187.201 192.399,188.6 191.833,189.51 190.625,191.45 190.378,191.863 190.266,192.05 190.015,192.51 189.037,194.302 188.382,195.5 187.75,196.781 187.051,198.195 186.678,198.95 186.521,199.305 186.05,200.371 185.396,201.907 185.187,202.4 184.846,203.308 184.368,204.582 183.892,205.85 183.416,207.313 183.19,208.006 182.77,209.3 182.547,210.108 181.911,212.421 181.82,212.75 181.77,212.973 181.475,214.283 181.118,215.931 181.059,216.2 180.999,216.56 180.589,218.982 180.477,219.65 180.377,220.478 180.179,222.123 180.061,223.1 179.979,224.228 179.897,225.36 179.812,226.55 179.781,227.828 179.759,228.706 179.728,230 179.759,231.294 179.781,232.172 179.812,233.45 179.897,234.64 179.979,235.772 180.061,236.9 180.179,237.877 180.377,239.522 180.477,240.35 180.589,241.018 180.999,243.44 181.059,243.8 181.118,244.069 181.475,245.717"/>
<polyline fill="none" stroke="#00ff00" stroke-width="1" points="144.875,247.25 145.504,250.226 145.604,250.7 145.773,251.377 146.214,253.14 146.466,254.15 146.908,255.683 146.999,255.998 147.461,257.6 147.854,258.804 148.306,260.188 148.588,261.05 148.774,261.56 149.45,263.411 149.769,264.259 149.86,264.5 150.047,264.95 150.854,266.892 151.293,267.95 151.992,269.483 152.257,270.067 152.864,271.4 153.18,272.038 154.025,273.746 154.432,274.543 154.588,274.85 154.988,275.576 155.766,276.987 156.488,278.3 157.14,279.401 158.473,281.654 158.53,281.75 158.552,281.786 158.6,281.861 160.06,284.099 160.779,285.2 161.603,286.386 163.175,288.65 163.175,288.65 163.175,288.65 163.175,288.65 164.843,290.842 165.8,292.1 166.536,293.015 167.75,294.524 168.274,295.155 168.603,295.55 170.084,297.24 170.266,297.447 171.627,299 171.913,299.311 172.325,299.757 173.819,301.323 174.894,302.45 175.756,303.313 176.9,304.456 177.74,305.266 178.397,305.9 179.782,307.176 181.475,308.737 181.849,309.068 182.166,309.35 183.991,310.902 186.05,312.653 186.144,312.729 186.229,312.8 188.383,314.491 190.625,316.25 190.625,316.25 190.625,316.25 192.958,317.94 195.2,319.565 195.293,319.629 195.395,319.7 197.716,321.252 199.775,322.629 200.148,322.868 200.588,323.15 202.657,324.426 204.35,325.471 205.19,325.966 206.265,326.6 207.781,327.462 208.925,328.113 210.419,328.923 212.496,330.05 213.088,330.36 213.5,330.576 215.559,331.603 215.834,331.74 218.075,332.857 218.599,333.104 219.435,333.5 221.436,334.416 222.65,334.971 224.318,335.692 227.225,336.95 227.225,336.95 227.225,336.95 227.225,336.95 230.228,338.136 231.8,338.757 233.26,339.299 236.228,340.4 236.327,340.436 236.375,340.453 236.502,340.496 239.49,341.501 240.95,341.992 242.69,342.538 244.562,343.124 245.525,343.425 245.932,343.543 246.989,343.85 249.254,344.487 250.1,344.726 251.868,345.183 252.642,345.383 254.675,345.91 256.079,346.242 258.653,346.85 259.25,346.991 259.569,347.059 260.695,347.3 263.149,347.81 263.825,347.95 264.969,348.163 266.804,348.503 268.4,348.8 270.524,349.148 270.942,349.217 272.975,349.55 274.314,349.74 276.651,350.072 277.55,350.2 278.179,350.276 282.125,350.75 282.125,350.75 282.125,350.75 282.125,350.75 286.186,351.138 286.7,351.188 287.343,351.235 290.336,351.458 291.275,351.527 292.384,351.586 294.586,351.703 295.85,351.771 297.263,351.815 298.941,351.869 300.425,351.916 301.994,351.933 303.412,351.948 305,351.965 306.588,351.948 308.006,351.933 309.575,351.916 311.059,351.869 312.737,351.815 314.15,351.771 315.414,351.703 317.616,351.586 318.725,351.527 319.664,351.458 322.657,351.235 323.3,351.188 323.814,351.138 327.875,350.75 327.875,350.75 327.875,350.75 327.875,350.75 331.821,350.276 332.45,350.2 333.349,350.072 335.686,349.74 337.025,349.55 339.058,349.217 339.476,349.148 341.6,348.8 343.196,348.503 345.031,348.163 346.175,347.95 346.851,347.81 349.305,347.3 350.431,347.059 350.75,346.991 351.347,346.85 353.921,346.242 355.325,345.91 357.358,345.383 358.132,345.183 359.9,344.726 360.746,344.487 363.011,343.85 364.068,343.543 364.475,343.425 365.438,343.124 367.31,342.538 369.05,341.992 370.51,341.501 373.498,340.496 373.625,340.453 373.673,340.436 373.772,340.4 376.74,339.299 378.2,338.757 379.772,338.136 382.775,336.95 382.775,336.95 382.775,336.95 382.775,336.95 385.682,335.692 387.35,334.971 388.564,334.416 390.565,333.5 391.401,333.104 391.925,332.857 394.166,331.74 394.441,331.603 396.5,330.576 396.912,330.36 397.504,330.05 399.581,328.923 401.075,328.113 402.219,327.462 403.735,326.6 404.81,325.966 405.65,325.471 407.343,324.426 409.412,323.15 409.852,322.868 410.225,322.629 412.284,321.252 414.605,319.7 414.707,319.629 414.8,319.565 417.042,317.94 419.375,316.25 419.375,316.25 419.375,316.25 421.617,314.491 423.771,312.8 423.856,312.729 423.95,312.653 426.009,310.902 427.834,309.35 428.151,309.068 428.525,308.737 430.218,307.176 431.603,305.9 432.26,305.266 433.1,304.456 434.244,303.313 435.106,302.45 436.181,301.323 437.675,299.757 438.087,299.311 438.373,299 439.734,297.447 439.916,297.24 441.397,295.55 441.726,295.155 442.25,294.524 443.464,293.015 444.2,292.1 445.157,290.842 446.825,288.65 446.825,288.65 446.825,288.65 446.825,288.65 448.397,286.386 449.221,285.2 449.94,284.099 451.4,281.861 451.448,281.786 451.47,281.75 451.527,281.654 452.86,279.401 453.512,278.3 454.234,276.987 455.012,275.576 455.412,274.85 455.568,274.543 455.975,273.746 456.82,272.038 457.136,271.4 457.743,270.067 458.008,269.483 458.707,267.95 459.146,266.892 459.953,264.95 460.14,264.5 460.231,264.259 460.55,263.411 461.226,261.56 461.412,261.05 461.694,260.188 462.146,258.804 462.539,257.6 463.001,255.998 463.092,255.683 463.534,254.15 463.786,253.14 464.227,251.377 464.396,250.7 464.496,250.226 465.125,247.25 465.125,247.25 465.125,247.25 465.125,247.25 465.64,244.188 465.705,243.8 465.769,243.315 466.063,241.058 466.156,240.35 466.234,239.514 466.389,237.854 466.478,236.9 466.538,235.834 466.609,234.569 466.671,233.45 466.693,232.267 466.713,231.198 466.736,230 466.713,228.802 466.693,227.733 466.671,226.55 466.609,225.431 466.538,224.166 466.478,223.1 466.389,222.146 466.234,220.486 466.156,219.65 466.063,218.942 465.769,216.685 465.705,216.2 465.64,215.812 465.125,212.75 465.125,212.75 465.125,212.75 465.125,212.75 464.496,209.774 464.396,209.3 464.227,208.623 463.786,206.86 463.534,205.85 463.092,204.317 463.001,204.002 462.539,202.4 462.146,201.196 461.694,199.813 461.412,198.95 461.226,198.44 460.55,196.589 460.231,195.741 460.14,195.5 459.953,195.05 459.146,193.108 458.707,192.05 458.008,190.517 457.743,189.933"/>
<polyline fill="none" stroke="#000000" stroke-width="1" points="253.879,268.55 254.675,269.15"/>
<polyline fill="none" stroke="#00ff00" stroke-width="1" points="457.136,188.6 456.82,187.962"/>
<polyline fill="none" stroke="#000000" stroke-width="1" points="320.651,283.203 321.584,283.044"/>
<polyline fill="none" stroke="#00ff00" stroke-width="1" points="455.975,186.254 455.568,185.457 455.412,185.15 455.012,184.424 454.234,183.013 453.512,181.7"/>
<polyline fill="none" stroke="#000000" stroke-width="1" points="314.15,284.087 315.91,283.873"/>
<polyline fill="none" stroke="#00ff00" stroke-width="1" points="452.86,180.599 451.527,178.346 451.47,178.25 451.448,178.214 451.4,178.139 449.94,175.901 449.221,174.8 448.397,173.614 446.825,171.35 446.825,171.35 446.825,171.35 446.825,171.35 445.157,169.158 444.2,167.9 443.464,166.985 442.25,165.476 441.726,164.845 441.397,164.45 439.916,162.76 439.734,162.553 438.373,161 438.087,160.689 437.675,160.243 436.181,158.677 435.106,157.55 434.244,156.688 433.1,155.544 432.26,154.734 431.603,154.1 430.218,152.824 428.525,151.263 428.151,150.932 427.834,150.65 426.009,149.098 423.95,147.347 423.856,147.271 423.771,147.2 421.617,145.509 419.375,143.75 419.375,143.75 419.375,143.75 417.042,142.06 414.8,140.435 414.707,140.371 414.605,140.3 412.284,138.748 410.225,137.371 409.852,137.132 409.412,136.85 407.343,135.574 405.65,134.529 404.81,134.034 403.735,133.4 402.219,132.538 401.075,131.887 399.581,131.077 397.504,129.95 396.912,129.64 396.5,129.424 394.441,128.397 394.166,128.26 391.925,127.143 391.401,126.896 390.565,126.5 388.564,125.584 387.35,125.029 385.682,124.308 382.775,123.05 382.775,123.05 382.775,123.05 382.775,123.05 379.772,121.864 378.2,121.243 376.74,120.701 373.772,119.6 373.673,119.564 373.625,119.547 373.498,119.504 370.51,118.499 369.05,118.008 367.31,117.462 365.438,116.876 364.475,116.575 364.068,116.457 363.011,116.15 360.746,115.513 359.9,115.274 358.132,114.817 357.358,114.617 355.325,114.09 353.921,113.758 351.347,113.15 350.75,113.009 350.431,112.941 349.305,112.7 346.851,112.19 346.175,112.05 345.031,111.837 343.196,111.497 341.6,111.2 339.476,110.852 339.058,110.783 337.025,110.45 335.686,110.26 333.349,109.928 332.45,109.8 331.821,109.724 327.875,109.25 327.875,109.25 327.875,109.25 327.875,109.25 323.814,108.862 323.3,108.813 322.657,108.765 319.664,108.542 318.725,108.473 317.616,108.414 315.414,108.297 314.15,108.229 312.737,108.185 311.059,108.131 309.575,108.084 308.006,108.067 306.588,108.052 305,108.035 303.412,108.052 301.994,108.067 300.425,108.084 298.941,108.131 297.263,108.185 295.85,108.229 294.586,108.297 292.384,108.414 291.275,108.473 290.336,108.542 287.343,108.765 286.7,108.813 286.186,108.862 282.125,109.25 282.125,109.25 282.125,109.25 282.125,109.25 278.179,109.724 277.55,109.8 276.651,109.928 274.314,110.26 272.975,110.45 270.942,110.783 270.524,110.852 268.4,111.2 266.804,111.497 264.969,111.837 263.825,112.05 263.149,112.19 260.695,112.7 259.569,112.941 259.25,113.009 258.653,113.15 256.079,113.758 254.675,114.09 252.642,114.617 251.868,114.817 250.1,115.274 249.254,115.513 246.989,116.15 245.932,116.457 245.525,116.575 244.562,116.876 242.69,117.462 240.95,118.008 239.49,118.499 236.502,119.504 236.375,119.547 236.327,119.564 236.228,119.6 233.26,120.701 231.8,121.243 230.228,121.864 227.225,123.05 227.225,123.05 227.225,123.05 227.225,123.05 224.318,124.308 222.65,125.029 221.436,125.584 219.435,126.5 218.599,126.896 218.075,127.143 215.834,128.26 215.559,128.397 213.5,129.424 213.088,129.64 212.496,129.95 210.419,131.077 208.925,131.887 207.781,132.538 206.265,133.4 205.19,134.034 204.35,134.529 202.657,135.574 200.588,136.85 200.148,137.132 199.775,137.371 197.716,138.748 195.395,140.3 195.293,140.371 195.2,140.435 192.958,142.06 190.625,143.75 190.625,143.75 190.625,143.75 188.383,145.509 186.229,147.2 186.144,147.271 186.05,147.347 183.991,149.098 182.166,150.65 181.849,150.932 181.475,151.263 179.782,152.824 178.397,154.1 177.74,154.734 176.9,155.544 175.756,156.688 174.894,157.55 173.819,158.677 172.325,160.243 171.913,160.689 171.627,161 170.266,162.553 170.084,162.76 168.603,164.45 168.274,164.845 167.75,165.476 166.536,166.985 165.8,167.9 164.843,169.158 163.175,171.35 163.175,171.35 163.175,171.35 163.175,171.35 161.603,173.614 160.779,174.8 160.06,175.901 158.6,178.139 158.552,178.214 158.53,178.25 158.473,178.346 157.14,180.599 156.488,181.7 155.766,183.013 154.988,184.424 154.588,185.15 154.432,185.457 154.025,186.254 153.18,187.962 152.864,188.6 152.257,189.933 151.992,190.517 151.293,192.05 150.854,193.108 150.047,195.05 149.86,195.5 149.769,195.741 149.45,196.589 148.774,198.44 148.588,198.95 148.306,199.813 147.854,201.196 147.461,202.4 146.999,204.002 146.908,204.317 146.466,205.85 146.214,206.86 145.773,208.623 145.604,209.3 145.504,209.774 144.875,212.75 144.875,212.75 144.875,212.75 144.875,212.75 144.36,215.812 144.295,216.2 144.231,216.685 143.937,218.942 143.844,219.65 143.766,220.486 143.611,222.146 143.522,223.1 143.462,224.166 143.391,225.431 143.329,226.55 143.307,227.733 143.287,228.802 143.264,230 143.287,231.198 143.307,232.267 143.329,233.45 143.391,234.569 143.462,235.834 143.522,236.9 143.611,237.854 143.766,239.514 143.844,240.35 143.937,241.058 144.231,243.315 144.295,243.8 144.36,244.188 144.875,247.25 144.875,247.25 144.875,247.25 144.875,247.25"/>
<polyline fill="none" stroke="#00ffff" stroke-width="1" points="117.425,258.615 117.985,260.627 118.103,261.05 118.311,261.718 118.843,263.431 119.176,264.5 119.757,266.191 119.789,266.283 120.362,267.95 120.724,268.912 121.527,271.043 121.661,271.4 121.741,271.595 122,272.228 122.836,274.22 123.1,274.85 123.672,276.11 123.985,276.803 124.664,278.3 125.177,279.354 126.209,281.474 126.343,281.75 126.409,281.875 126.575,282.195 127.719,284.337 128.179,285.2 129.07,286.768 129.382,287.317 130.14,288.65 130.456,289.174 131.15,290.326 131.898,291.536 132.248,292.1 133.317,293.734 133.396,293.856 134.505,295.55 134.922,296.155 135.725,297.319 136.501,298.415 136.916,299 138.133,300.634 138.441,301.048 139.485,302.45 139.787,302.836 140.3,303.493 141.504,304.992 142.233,305.9 143.258,307.12 144.875,309.043 145.036,309.229 145.14,309.35 145.707,309.977 146.886,311.283 148.256,312.8 148.752,313.326 149.45,314.067 150.673,315.328 151.567,316.25 152.629,317.303 154.025,318.685 154.617,319.254 155.081,319.7 156.662,321.162 158.6,322.955 158.718,323.061 158.818,323.15 160.315,324.444 160.849,324.904 162.812,326.6 162.984,326.744 163.175,326.903 165.191,328.53 167.075,330.05 167.407,330.309 167.75,330.576 169.688,332.038 171.627,333.5 171.982,333.759 172.325,334.009 174.341,335.43 176.499,336.95 176.709,337.094 176.9,337.224 179.149,338.704 179.759,339.106 181.475,340.236 181.593,340.311 181.734,340.4 184.111,341.862 186.05,343.054 186.642,343.404 187.396,343.85 189.229,344.902 190.625,345.704 191.848,346.378 193.52,347.3 194.502,347.826 195.2,348.2 197.211,349.233 198.943,350.123 199.775,350.55 199.936,350.629 200.182,350.75 202.733,351.969 204.35,352.742 205.554,353.292 207.542,354.2 208.412,354.586 208.925,354.814 210.784,355.602 211.333,355.834 213.5,356.752 214.276,357.065 215.729,357.65 217.272,358.255 218.075,358.57 220.322,359.406 220.483,359.466 222.65,360.272 223.398,360.536 225.003,361.1 226.531,361.624 227.225,361.862 228.993,362.433 229.72,362.668 231.8,363.34 232.944,363.688 235.785,364.55 236.208,364.675 236.375,364.725 236.741,364.826 239.552,365.604 240.95,365.991 242.936,366.503 243.854,366.739 245.525,367.17 246.361,367.37 249.002,368 249.841,368.195 250.1,368.255 250.573,368.357 253.399,368.962 254.675,369.235 256.886,369.667 257.007,369.691 259.25,370.129 260.668,370.38 262.939,370.782 263.825,370.939 264.385,371.027 267.054,371.45 268.171,371.623 268.4,371.658 268.736,371.704 272.042,372.154 272.975,372.281 274.282,372.436 275.978,372.636 277.55,372.822 279.647,373.031 279.983,373.065 282.125,373.279 284.064,373.438 284.845,373.501 286.7,373.653 288.225,373.75 289.891,373.856 291.275,373.944 292.471,373.999 294.794,374.104 295.85,374.152 296.808,374.178 299.567,374.253 300.425,374.276 301.242,374.284 304.219,374.311 305,374.318 305.781,374.311 308.758,374.284 309.575,374.276 310.433,374.253 313.192,374.178 314.15,374.152 315.206,374.104 317.529,373.999 318.725,373.944 320.109,373.856 321.775,373.75 323.3,373.653 325.155,373.501 325.936,373.438 327.875,373.279 330.017,373.065 330.353,373.031 332.45,372.822 334.022,372.636 335.718,372.436 337.025,372.281 337.958,372.154 341.264,371.704 341.6,371.658 341.829,371.623 342.946,371.45 345.615,371.027 346.175,370.939 347.061,370.782 349.332,370.38 350.75,370.129 352.993,369.691 353.114,369.667 355.325,369.235 356.601,368.962 359.427,368.357 359.9,368.255 360.159,368.195 360.998,368 363.639,367.37 364.475,367.17 366.146,366.739 367.064,366.503 369.05,365.991 370.448,365.604 373.259,364.826 373.625,364.725 373.792,364.675 374.215,364.55 377.056,363.688 378.2,363.34 380.28,362.668 381.007,362.433 382.775,361.862 383.469,361.624 384.997,361.1 386.602,360.536 387.35,360.272 389.517,359.466 389.678,359.406 391.925,358.57 392.728,358.255 394.271,357.65 395.724,357.065 396.5,356.752 398.667,355.834 399.216,355.602 401.075,354.814 401.588,354.586 402.458,354.2 404.446,353.292 405.65,352.742 407.267,351.969 409.818,350.75 410.064,350.629 410.225,350.55 411.057,350.123 412.789,349.233 414.8,348.2 415.498,347.826 416.48,347.3 418.152,346.378 419.375,345.704 420.771,344.902 422.604,343.85 423.358,343.404 423.95,343.054 425.889,341.862 428.266,340.4 428.407,340.311 428.525,340.236 430.241,339.106 430.851,338.704 433.1,337.224 433.291,337.094 433.501,336.95 435.659,335.43 437.675,334.009 438.018,333.759 438.373,333.5 440.312,332.038 442.25,330.576 442.593,330.309 442.925,330.05 444.809,328.53 446.825,326.903 447.016,326.744 447.188,326.6 449.151,324.904 449.685,324.444 451.182,323.15 451.282,323.061 451.4,322.955 453.338,321.162 454.919,319.7 455.383,319.254 455.975,318.685 457.371,317.303 458.433,316.25 459.327,315.328 460.55,314.067 461.248,313.326 461.744,312.8 463.114,311.283 464.293,309.977 464.86,309.35 464.964,309.229 465.125,309.043 466.742,307.12 467.767,305.9 468.496,304.992 469.7,303.493 470.213,302.836 470.515,302.45 471.559,301.048 471.867,300.634 473.084,299 473.499,298.415 474.275,297.319 475.078,296.155 475.495,295.55 476.604,293.856 476.683,293.734 477.752,292.1 478.102,291.536 478.85,290.326 479.544,289.174 479.86,288.65 480.618,287.317 480.93,286.768 481.821,285.2 482.281,284.337 483.425,282.195 483.591,281.875 483.657,281.75 483.791,281.474 484.823,279.354 485.336,278.3 486.015,276.803 486.328,276.11 486.9,274.85 487.164,274.22 488,272.228 488.259,271.595 488.339,271.4 488.473,271.043 489.276,268.912 489.638,267.95 490.211,266.283 490.243,266.191 490.824,264.5 491.157,263.431 491.689,261.718 491.897,261.05 492.015,260.627 492.575,258.615 492.804,257.772 492.851,257.6 492.912,257.346 493.509,254.854 493.677,254.15 493.882,253.164 494.147,251.886 494.394,250.7 494.672,249.119 494.716,248.865 495,247.25 495.21,245.788 495.295,245.199 495.497,243.8 495.625,242.65 495.766,241.394 495.882,240.35 495.954,239.448 496.094,237.696 496.158,236.9 496.192,236.178 496.292,234.097 496.323,233.45 496.333,232.834 496.369,230.589 496.378,230 496.369,229.411 496.333,227.166 496.323,226.55 496.292,225.903 496.192,223.822 496.158,223.1 496.094,222.304 495.954,220.552 495.882,219.65 495.766,218.606 495.625,217.35 495.497,216.2 495.295,214.801 495.21,214.212 495,212.75 494.716,211.135 494.672,210.881 494.394,209.3 494.147,208.114 493.882,206.836 493.677,205.85 493.509,205.146 492.912,202.654 492.851,202.4 492.804,202.228 492.575,201.385 492.015,199.373 491.897,198.95 491.689,198.282 491.157,196.569 490.824,195.5 490.243,193.809 490.211,193.717 489.638,192.05 489.276,191.088 488.473,188.957 488.339,188.6 488.259,188.405 488,187.772 487.164,185.78 486.9,185.15 486.328,183.89 486.015,183.197 485.336,181.7 484.823,180.646 483.791,178.526 483.657,178.25 483.591,178.125 483.425,177.805 482.281,175.663 481.821,174.8 480.93,173.232 480.618,172.683 479.86,171.35 479.544,170.826 478.85,169.674 478.102,168.464 477.752,167.9 476.683,166.266 476.604,166.144 475.495,164.45 475.078,163.845 474.275,162.681 473.499,161.585 473.084,161 471.867,159.366 471.559,158.952 470.515,157.55 470.213,157.164 469.7,156.507 468.496,155.008 467.767,154.1 466.742,152.88 465.125,150.957 464.964,150.771 464.86,150.65 464.293,150.023 463.114,148.717 461.744,147.2 461.248,146.674 460.55,145.933 459.327,144.672 458.433,143.75 457.371,142.697 455.975,141.315 455.383,140.746 454.919,140.3 453.338,138.838 451.4,137.045 451.282,136.939 451.182,136.85 449.685,135.556 449.151,135.096 447.188,133.4 447.016,133.256 446.825,133.097 444.809,131.47 442.925,129.95 442.593,129.691 442.25,129.424 440.312,127.962 438.373,126.5 438.018,126.241 437.675,125.991 435.659,124.57 433.501,123.05 433.291,122.906 433.1,122.776 430.851,121.296 430.241,120.894 428.525,119.764 428.407,119.689 428.266,119.6 425.889,118.138 423.95,116.946 423.358,116.596 422.604,116.15 420.771,115.098 419.375,114.296 418.152,113.622 416.48,112.7 415.498,112.174 414.8,111.8 412.789,110.767 411.057,109.877 410.225,109.45 410.064,109.371 409.818,109.25 407.267,108.031 405.65,107.258 404.446,106.708 402.458,105.8 401.588,105.414 401.075,105.186 399.216,104.398 398.667,104.166 396.5,103.248 395.724,102.935 394.271,102.35 392.728,101.745 391.925,101.43 389.678,100.594 389.517,100.534 387.35,99.728 386.602,99.4644 384.997,98.8999 383.469,98.3765 382.775,98.1382 381.007,97.5669 380.28,97.332 378.2,96.6597 377.056,96.3125 374.215,95.4502 373.792,95.3247 373.625,95.2754 373.259,95.1738 370.448,94.396 369.05,94.0088 367.064,93.4971 366.146,93.2607 364.475,92.8296 363.639,92.6304 360.998,92 360.159,91.8047 359.9,91.7446 359.427,91.6431 356.601,91.0381 355.325,90.7646 353.114,90.3325 352.993,90.3086 350.75,89.8706 349.332,89.6196 347.061,89.2178 346.175,89.061 345.615,88.9727 342.946,88.5498 341.829,88.3774 341.6,88.3423 341.264,88.2964 337.958,87.8457 337.025,87.7188 335.718,87.5645 334.022,87.3643 332.45,87.1782 330.353,86.9688 330.017,86.9351 327.875,86.7212 325.936,86.5625 325.155,86.4985 323.3,86.3472 321.775,86.25 320.109,86.144 318.725,86.0562 317.529,86.0015 315.206,85.896 314.15,85.8481 313.192,85.8223 310.433,85.7471 309.575,85.7236 308.758,85.7163 305.781,85.689 305,85.6821 304.219,85.689 301.242,85.7163 300.425,85.7236 299.567,85.7471 296.808,85.8223 295.85,85.8481 294.794,85.896 292.471,86.0015 291.275,86.0562 289.891,86.144 288.225,86.25 286.7,86.3472 284.845,86.4985 284.064,86.5625 282.125,86.7212 279.983,86.9351 279.647,86.9688 277.55,87.1782 275.978,87.3643 274.282,87.5645 272.975,87.7188 272.042,87.8457 268.736,88.2964 268.4,88.3423 268.171,88.3774 267.054,88.5498 264.385,88.9727 263.825,89.061 262.939,89.2178 260.668,89.6196 259.25,89.8706 257.007,90.3086 256.886,90.3325 254.675,90.7646 253.399,91.0381 250.573,91.6431 250.1,91.7446 249.841,91.8047 249.002,92 246.361,92.6304 245.525,92.8296 243.854,93.2607 242.936,93.4971 240.95,94.0088 239.552,94.396 236.741,95.1738 236.375,95.2754 236.208,95.3247 235.785,95.4502 232.944,96.3125 231.8,96.6597 229.72,97.332 228.993,97.5669 227.225,98.1382 226.531,98.3765 225.003,98.8999 223.398,99.4644 222.65,99.728 220.483,100.534 220.322,100.594 218.075,101.43 217.272,101.745 215.729,102.35 214.276,102.935 213.5,103.248 211.333,104.166 210.784,104.398 208.925,105.186 208.412,105.414 207.542,105.8 205.554,106.708 204.35,107.258 202.733,108.031 200.182,109.25 199.936,109.371 199.775,109.45 198.943,109.877 197.211,110.767 195.2,111.8 194.502,112.174 193.52,112.7 191.848,113.622 190.625,114.296 189.229,115.098 187.396,116.15 186.642,116.596 186.05,116.946 184.111,118.138 181.734,119.6 181.593,119.689 181.475,119.764 179.759,120.894 179.149,121.296 176.9,122.776 176.709,122.906 176.499,123.05 174.341,124.57 172.325,125.991 171.982,126.241 171.627,126.5 169.688,127.962 167.75,129.424 167.407,129.691 167.075,129.95 165.191,131.47 163.175,133.097 162.984,133.256 162.812,133.4 160.849,135.096 160.315,135.556 158.818,136.85 158.718,136.939 158.6,137.045 156.662,138.838 155.081,140.3 154.617,140.746 154.025,141.315 152.629,142.697 151.567,143.75 150.673,144.672 149.45,145.933 148.752,146.674 148.256,147.2 146.886,148.717 145.707,150.023 145.14,150.65 145.036,150.771 144.875,150.957 143.258,152.88 142.233,154.1 141.504,155.008 140.3,156.507 139.787,157.164 139.485,157.55 138.441,158.952 138.133,159.366 136.916,161 136.501,161.585 135.725,162.681 134.922,163.845 134.505,164.45 133.396,166.144 133.317,166.266 132.248,167.9 131.898,168.464 131.15,169.674 130.456,170.826 130.14,171.35 129.382,172.683 129.07,173.232 128.179,174.8 127.719,175.663 126.575,177.805 126.409,178.125 126.343,178.25 126.209,178.526 125.177,180.646 124.664,181.7 123.985,183.197 123.672,183.89 123.1,185.15 122.836,185.78 122,187.772 121.741,188.405 121.661,188.6 121.527,188.957 120.724,191.088 120.362,192.05 119.789,193.717 119.757,193.809 119.176,195.5 118.843,196.569 118.311,198.282 118.103,198.95 117.985,199.373 117.425,201.385 117.196,202.228 117.149,202.4 117.088,202.654 116.491,205.146 116.323,205.85 116.118,206.836 115.853,208.114 115.606,209.3 115.328,210.881 115.284,211.135 115,212.75 114.79,214.212 114.705,214.801 114.503,216.2 114.375,217.35 114.234,218.606 114.118,219.65 114.046,220.552 113.906,222.304 113.842,223.1 113.808,223.822 113.708,225.903 113.677,226.55 113.667,227.166 113.631,229.411 113.622,230 113.631,230.589 113.667,232.834 113.677,233.45 113.708,234.097 113.808,236.178 113.842,236.9 113.906,237.696 114.046,239.448 114.118,240.35 114.234,241.394 114.375,242.65 114.503,243.8 114.705,245.199 114.79,245.788 115,247.25 115.284,248.865 115.328,249.119 115.606,250.7 115.853,251.886 116.118,253.164 116.323,254.15 116.491,254.854 117.088,257.346 117.149,257.6 117.196,257.772 117.425,258.615"/>
<polyline fill="none" stroke="#000000" stroke-width="1" points="318.725,283.531 320.651,283.203"/>
<polyline fill="none" stroke="#000000" stroke-width="1" points="316.819,283.763 318.725,283.531"/>
<polyline fill="none" stroke="#00ff00" stroke-width="1" points="456.82,187.962 455.975,186.254"/>
<polyline fill="none" stroke="#000000" stroke-width="1" points="315.91,283.873 316.819,283.763"/>
<polyline fill="none" stroke="#000000" stroke-width="1" points="312.804,284.185 314.15,284.087"/>
<polyline fill="none" stroke="#000000" stroke-width="1" points="310.719,284.337 312.804,284.185"/>
<polyline fill="none" stroke="#000000" stroke-width="1" points="309.575,284.421 310.719,284.337"/>
<polyline fill="none" stroke="#000000" stroke-width="1" points="308.574,284.445 309.575,284.421"/>
<polyline fill="none" stroke="#000000" stroke-width="1" points="305.915,284.51 308.574,284.445"/>
<polyline fill="none" stroke="#000000" stroke-width="1" points="305,284.532 305.915,284.51"/>
<polyline fill="none" stroke="#000000" stroke-width="1" points="304.085,284.51 305,284.532"/>
<polyline fill="none" stroke="#000000" stroke-width="1" points="301.426,284.445 304.085,284.51"/>
<polyline fill="none" stroke="#000000" stroke-width="1" points="300.425,284.421 301.426,284.445"/>
<polyline fill="none" stroke="#000000" stroke-width="1" points="299.281,284.337 300.425,284.421"/>
<polyline fill="none" stroke="#000000" stroke-width="1" points="297.196,284.185 299.281,284.337"/>
<polyline fill="none" stroke="#000000" stroke-width="1" points="295.85,284.087 297.196,284.185"/>
<polyline fill="none" stroke="#000000" stroke-width="1" points="294.09,283.873 295.85,284.087"/>
<polyline fill="none" stroke="#000000" stroke-width="1" points="293.181,283.763 294.09,283.873"/>
<polyline fill="none" stroke="#000000" stroke-width="1" points="291.275,283.531 293.181,283.763"/>
<polyline fill="none" stroke="#000000" stroke-width="1" points="289.349,283.203 291.275,283.531"/>
<polyline fill="none" stroke="#000000" stroke-width="1" points="288.416,283.044 289.349,283.203"/>
<polyline fill="none" stroke="#000000" stroke-width="1" points="286.7,282.751 288.416,283.044"/>
<polyline fill="none" stroke="#000000" stroke-width="1" points="285.67,282.526 286.7,282.751"/>
<polyline fill="none" stroke="#000000" stroke-width="1" points="282.125,281.75 285.67,282.526"/>
<polyline fill="none" stroke="#000000" stroke-width="1" points="282.125,281.75 282.125,281.75 282.125,281.75"/>
<polyline fill="none" stroke="#000000" stroke-width="1" points="253.083,267.95 253.879,268.55"/>
<polyline fill="none" stroke="#000000" stroke-width="1" points="251.66,266.774 253.083,267.95"/>
<polyline fill="none" stroke="#000000" stroke-width="1" points="250.1,265.486 251.66,266.774"/>
<polyline fill="none" stroke="#000000" stroke-width="1" points="249.503,264.95 250.1,265.486"/>
<polyline fill="none" stroke="#000000" stroke-width="1" points="249.002,264.5 249.503,264.95"/>
<polyline fill="none" stroke="#000000" stroke-width="1" points="247.5,263.01 249.002,264.5"/>
<polyline fill="none" stroke="#000000" stroke-width="1" points="245.525,261.05 247.5,263.01"/>
<polyline fill="none" stroke="#000000" stroke-width="1" points="245.525,261.05 245.525,261.05 245.525,261.05 245.525,261.05"/>
<polyline fill="none" stroke="#000000" stroke-width="1" points="243.757,258.933 245.525,261.05"/>
<polyline fill="none" stroke="#000000" stroke-width="1" points="282.125,281.75 282.125,281.75"/>
<polyline fill="none" stroke="#000000" stroke-width="1" points="278.808,280.801 282.125,281.75"/>
<polyline fill="none" stroke="#000000" stroke-width="1" points="277.55,280.441 278.808,280.801"/>
<polyline fill="none" stroke="#000000" stroke-width="1" points="275.589,279.779 277.55,280.441"/>
<polyline fill="none" stroke="#000000" stroke-width="1" points="274.405,279.378 275.589,279.779"/>
<polyline fill="none" stroke="#000000" stroke-width="1" points="272.975,278.895 274.405,279.378"/>
<polyline fill="none" stroke="#000000" stroke-width="1" points="272.455,278.692 272.975,278.895"/>
<polyline fill="none" stroke="#000000" stroke-width="1" points="271.45,278.3 272.455,278.692"/>
<polyline fill="none" stroke="#000000" stroke-width="1" points="269.489,277.479 271.45,278.3"/>
<polyline fill="none" stroke="#000000" stroke-width="1" points="268.4,277.022 269.489,277.479"/>
<polyline fill="none" stroke="#000000" stroke-width="1" points="266.632,276.183 268.4,277.022"/>
<polyline fill="none" stroke="#000000" stroke-width="1" points="263.825,274.85 266.632,276.183"/>
<polyline fill="none" stroke="#000000" stroke-width="1" points="263.825,274.85 263.825,274.85 263.825,274.85 263.825,274.85"/>
<polyline fill="none" stroke="#000000" stroke-width="1" points="261.226,273.36 263.825,274.85"/>
<polyline fill="none" stroke="#000000" stroke-width="1" points="259.25,272.228 261.226,273.36"/>
<polyline fill="none" stroke="#000000" stroke-width="1" points="258.653,271.85 259.25,272.228"/>
<polyline fill="none" stroke="#000000" stroke-width="1" points="257.943,271.4 258.653,271.85"/>
<polyline fill="none" stroke="#000000" stroke-width="1" points="256.235,270.224 257.943,271.4"/>
<polyline fill="none" stroke="#00ff00" stroke-width="1" points="453.512,181.7 452.86,180.599"/>
<polyline fill="none" stroke="#000000" stroke-width="1" points="254.675,269.15 256.235,270.224"/>
<polyline fill="none" stroke="#000000" stroke-width="1" points="242.645,257.6 243.757,258.933"/>
<polyline fill="none" stroke="#000000" stroke-width="1" points="242.039,256.779 242.645,257.6"/>
<polyline fill="none" stroke="#000000" stroke-width="1" points="240.95,255.3 242.039,256.779"/>
<polyline fill="none" stroke="#000000" stroke-width="1" points="240.43,254.542 240.95,255.3"/>
<polyline fill="none" stroke="#000000" stroke-width="1" points="240.161,254.15 240.43,254.542"/>
<polyline fill="none" stroke="#000000" stroke-width="1" points="239.521,253.072 240.161,254.15"/>
<polyline fill="none" stroke="#000000" stroke-width="1" points="238.989,252.179 239.521,253.072"/>
<polyline fill="none" stroke="#000000" stroke-width="1" points="238.11,250.7 238.989,252.179"/>
<polyline fill="none" stroke="#000000" stroke-width="1" points="237.633,249.751 238.11,250.7"/>
<polyline fill="none" stroke="#000000" stroke-width="1" points="236.375,247.25 237.633,249.751"/>
<polyline fill="none" stroke="#00ff00" stroke-width="1" points="457.743,189.933 457.136,188.6"/>
</g>
</svg>
