<?xml version="1.0" encoding="UTF-8" standalone="no"?>
<!-- Created with Inkscape (http://www.inkscape.org/) -->
<svg
   xmlns:dc="http://purl.org/dc/elements/1.1/"
   xmlns:cc="http://creativecommons.org/ns#"
   xmlns:rdf="http://www.w3.org/1999/02/22-rdf-syntax-ns#"
   xmlns:svg="http://www.w3.org/2000/svg"
   xmlns="http://www.w3.org/2000/svg"
   xmlns:sodipodi="http://sodipodi.sourceforge.net/DTD/sodipodi-0.dtd"
   xmlns:inkscape="http://www.inkscape.org/namespaces/inkscape"
   width="707.5863"
   height="347.71429"
   id="svg2567"
   sodipodi:version="0.32"
   inkscape:version="0.46"
   sodipodi:docname="convex-functionphi.svg"
   inkscape:output_extension="org.inkscape.output.svg.inkscape"
   inkscape:export-filename="/media/SCILAB/SVN-Books/OptimizationInScilab/introoptim/convex-functionphi.png"
   inkscape:export-xdpi="90.019997"
   inkscape:export-ydpi="90.019997"
   version="1.0">
  <defs
     id="defs2569">
    <marker
       inkscape:stockid="Arrow1Lend"
       orient="auto"
       refY="0"
       refX="0"
       id="Arrow1Lend"
       style="overflow:visible">
      <path
         id="path3952"
         d="M 0,0 L 5,-5 L -12.5,0 L 5,5 L 0,0 z"
         style="fill-rule:evenodd;stroke:#000000;stroke-width:1pt;marker-start:none"
         transform="matrix(-0.8,0,0,-0.8,-10,0)" />
    </marker>
    <inkscape:perspective
       sodipodi:type="inkscape:persp3d"
       inkscape:vp_x="0 : 526.18109 : 1"
       inkscape:vp_y="0 : 1000 : 0"
       inkscape:vp_z="744.09448 : 526.18109 : 1"
       inkscape:persp3d-origin="372.04724 : 350.78739 : 1"
       id="perspective2575" />
  </defs>
  <sodipodi:namedview
     id="base"
     pagecolor="#ffffff"
     bordercolor="#666666"
     borderopacity="1.0"
     gridtolerance="10000"
     guidetolerance="10"
     objecttolerance="10"
     inkscape:pageopacity="0.0"
     inkscape:pageshadow="2"
     inkscape:zoom="0.98994949"
     inkscape:cx="226.23257"
     inkscape:cy="273.22527"
     inkscape:document-units="px"
     inkscape:current-layer="layer1"
     showgrid="false"
     inkscape:window-width="1280"
     inkscape:window-height="975"
     inkscape:window-x="-4"
     inkscape:window-y="-4">
    <inkscape:grid
       type="xygrid"
       id="grid4732"
       visible="true"
       enabled="true" />
  </sodipodi:namedview>
  <metadata
     id="metadata2572">
    <rdf:RDF>
      <cc:Work
         rdf:about="">
        <dc:format>image/svg+xml</dc:format>
        <dc:type
           rdf:resource="http://purl.org/dc/dcmitype/StillImage" />
      </cc:Work>
    </rdf:RDF>
  </metadata>
  <g
     inkscape:label="Layer 1"
     inkscape:groupmode="layer"
     id="layer1"
     transform="translate(18.562097,-418.50504)">
    <path
       sodipodi:type="arc"
       style="stroke-width:2;stroke-miterlimit:4;stroke-dasharray:none;stroke-dashoffset:0"
       id="path3207"
       sodipodi:cx="393.39285"
       sodipodi:cy="345.04074"
       sodipodi:rx="3.3928571"
       sodipodi:ry="3.3928571"
       d="M 396.78571,345.04074 A 3.3928571,3.3928571 0 1 1 390,345.04074 A 3.3928571,3.3928571 0 1 1 396.78571,345.04074 z"
       transform="matrix(0.869856,0,0,0.869856,-121.11319,205.20246)" />
    <path
       style="fill:none;fill-rule:evenodd;stroke:#000000;stroke-width:2;stroke-linecap:butt;stroke-linejoin:miter;marker-end:url(#Arrow1Lend);stroke-miterlimit:4;stroke-dasharray:none;stroke-opacity:1"
       d="M 151.42857,765.21933 L 151.42857,419.50504"
       id="path2406" />
    <path
       style="fill:none;fill-rule:evenodd;stroke:#000000;stroke-width:2;stroke-linecap:butt;stroke-linejoin:miter;marker-end:url(#Arrow1Lend);stroke-miterlimit:4;stroke-dasharray:none;stroke-opacity:1"
       d="M 97.142857,716.6479 L 664.28571,716.6479"
       id="path2408" />
    <path
       style="fill:none;fill-rule:evenodd;stroke:#000000;stroke-width:2;stroke-linecap:butt;stroke-linejoin:miter;stroke-miterlimit:4;stroke-dasharray:none;stroke-opacity:1"
       d="M 195.96959,432.12852 C 195.96959,432.12852 265.56101,680.55504 361.92177,680.52452 C 459.7111,680.49355 574.62812,536.58033 574.62812,536.58033"
       id="path4216"
       sodipodi:nodetypes="czc" />
    <path
       sodipodi:type="arc"
       style="stroke-width:2;stroke-miterlimit:4;stroke-dasharray:none;stroke-dashoffset:0"
       id="path4218"
       sodipodi:cx="393.39285"
       sodipodi:cy="345.04074"
       sodipodi:rx="3.3928571"
       sodipodi:ry="3.3928571"
       d="M 396.78571,345.04074 A 3.3928571,3.3928571 0 1 1 390,345.04074 A 3.3928571,3.3928571 0 1 1 396.78571,345.04074 z"
       transform="matrix(0.869856,0,0,0.869856,178.51915,294.54785)" />
    <path
       style="fill:none;fill-rule:evenodd;stroke:#000000;stroke-width:2;stroke-linecap:butt;stroke-linejoin:miter;stroke-miterlimit:4;stroke-dasharray:none;stroke-opacity:1"
       d="M 166.67517,489.43237 L 575.83771,610.68042"
       id="path4220"
       sodipodi:nodetypes="cc" />
    <text
       xml:space="preserve"
       style="font-size:32.92952347px;font-style:normal;font-weight:normal;fill:#000000;fill-opacity:1;stroke:none;stroke-width:1px;stroke-linecap:butt;stroke-linejoin:miter;stroke-opacity:1;font-family:Bitstream Vera Sans"
       x="209.53267"
       y="754.20233"
       id="text4222"><tspan
         sodipodi:role="line"
         id="tspan4224"
         x="209.53267"
         y="754.20233">0</tspan></text>
    <text
       xml:space="preserve"
       style="font-size:32.92952347px;font-style:normal;font-weight:normal;fill:#000000;fill-opacity:1;stroke:none;stroke-width:1px;stroke-linecap:butt;stroke-linejoin:miter;stroke-opacity:1;font-family:Bitstream Vera Sans"
       x="510.96124"
       y="750.77759"
       id="text4226"><tspan
         sodipodi:role="line"
         id="tspan4228"
         x="510.96124"
         y="750.77759">1</tspan></text>
    <path
       style="fill:none;fill-rule:evenodd;stroke:#000000;stroke-width:1;stroke-linecap:butt;stroke-linejoin:miter;stroke-miterlimit:4;stroke-dasharray:1, 3;stroke-dashoffset:0;stroke-opacity:1"
       d="M 220,504.50504 L 220,725.21933"
       id="path4230" />
    <path
       style="fill:none;fill-rule:evenodd;stroke:#000000;stroke-width:1;stroke-linecap:butt;stroke-linejoin:miter;stroke-miterlimit:4;stroke-dasharray:1, 3;stroke-dashoffset:0;stroke-opacity:1"
       d="M 520.54545,594.30081 L 520.54545,727.15795"
       id="path4232"
       sodipodi:nodetypes="cc" />
    <path
       style="fill:none;fill-rule:evenodd;stroke:#000000;stroke-width:1;stroke-linecap:butt;stroke-linejoin:miter;stroke-miterlimit:4;stroke-dasharray:1, 3;stroke-dashoffset:0;stroke-opacity:1"
       d="M 515.94645,594.76308 L 141.66285,594.76308"
       id="path4234"
       sodipodi:nodetypes="cc" />
    <path
       style="fill:none;fill-rule:evenodd;stroke:#000000;stroke-width:1;stroke-linecap:butt;stroke-linejoin:miter;stroke-miterlimit:4;stroke-dasharray:1, 3;stroke-dashoffset:0;stroke-opacity:1"
       d="M 220.47683,504.8595 L 143.17808,504.8595"
       id="path4236"
       sodipodi:nodetypes="cc" />
    <text
       xml:space="preserve"
       style="font-size:32.92952347px;font-style:normal;font-weight:normal;fill:#000000;fill-opacity:1;stroke:none;stroke-width:1px;stroke-linecap:butt;stroke-linejoin:miter;stroke-opacity:1;font-family:Bitstream Vera Sans"
       x="-19.687618"
       y="601.513"
       id="text4238"><tspan
         sodipodi:role="line"
         id="tspan4240"
         x="-19.687618"
         y="601.513">Φ(1)=f(y)</tspan></text>
    <text
       xml:space="preserve"
       style="font-size:32.92952347px;font-style:normal;font-weight:normal;fill:#000000;fill-opacity:1;stroke:none;stroke-width:1px;stroke-linecap:butt;stroke-linejoin:miter;stroke-opacity:1;font-family:Bitstream Vera Sans"
       x="-19.687618"
       y="512.22723"
       id="text4242"><tspan
         sodipodi:role="line"
         id="tspan4244"
         x="-19.687618"
         y="512.22723">Φ(0)=f(x)</tspan></text>
    <text
       xml:space="preserve"
       style="font-size:32.92952347px;font-style:normal;font-weight:normal;fill:#000000;fill-opacity:1;stroke:none;stroke-width:1px;stroke-linecap:butt;stroke-linejoin:miter;stroke-opacity:1;font-family:Bitstream Vera Sans"
       x="672.17352"
       y="753.26984"
       id="text2400"><tspan
         sodipodi:role="line"
         id="tspan2402"
         x="672.17352"
         y="753.26984">θ</tspan></text>
    <path
       style="fill:none;fill-rule:evenodd;stroke:#000000;stroke-width:2;stroke-linecap:butt;stroke-linejoin:miter;marker-end:url(#Arrow1Lend);stroke-miterlimit:4;stroke-dasharray:none;stroke-opacity:1"
       d="M 449.51789,475.56507 L 374.7666,526.0727"
       id="path2404"
       sodipodi:nodetypes="cc" />
    <text
       xml:space="preserve"
       style="font-size:32.92952347px;font-style:normal;font-weight:normal;fill:#000000;fill-opacity:1;stroke:none;stroke-width:1px;stroke-linecap:butt;stroke-linejoin:miter;stroke-opacity:1;font-family:Bitstream Vera Sans"
       x="360.50168"
       y="458.38568"
       id="text3697"><tspan
         sodipodi:role="line"
         id="tspan3699"
         x="360.50168"
         y="458.38568">θΦ(1)+(1-θ)Φ(0)</tspan></text>
  </g>
</svg>
