<?xml version="1.0" encoding="UTF-8" standalone="no"?>
<!-- Created with Inkscape (http://www.inkscape.org/) -->
<svg
   xmlns:dc="http://purl.org/dc/elements/1.1/"
   xmlns:cc="http://creativecommons.org/ns#"
   xmlns:rdf="http://www.w3.org/1999/02/22-rdf-syntax-ns#"
   xmlns:svg="http://www.w3.org/2000/svg"
   xmlns="http://www.w3.org/2000/svg"
   xmlns:sodipodi="http://sodipodi.sourceforge.net/DTD/sodipodi-0.dtd"
   xmlns:inkscape="http://www.inkscape.org/namespaces/inkscape"
   width="759.37323"
   height="221.05518"
   id="svg2567"
   sodipodi:version="0.32"
   inkscape:version="0.46"
   sodipodi:docname="convexset-3examples.svg"
   inkscape:output_extension="org.inkscape.output.svg.inkscape"
   inkscape:export-filename="/media/SCILAB/SVN-Books/OptimizationInScilab/introoptim/convexset-3examples.png"
   inkscape:export-xdpi="90.019997"
   inkscape:export-ydpi="90.019997"
   version="1.0">
  <defs
     id="defs2569">
    <marker
       inkscape:stockid="Arrow1Lend"
       orient="auto"
       refY="0"
       refX="0"
       id="Arrow1Lend"
       style="overflow:visible">
      <path
         id="path3952"
         d="M 0,0 L 5,-5 L -12.5,0 L 5,5 L 0,0 z"
         style="fill-rule:evenodd;stroke:#000000;stroke-width:1pt;marker-start:none"
         transform="matrix(-0.8,0,0,-0.8,-10,0)" />
    </marker>
    <inkscape:perspective
       sodipodi:type="inkscape:persp3d"
       inkscape:vp_x="0 : 526.18109 : 1"
       inkscape:vp_y="0 : 1000 : 0"
       inkscape:vp_z="744.09448 : 526.18109 : 1"
       inkscape:persp3d-origin="372.04724 : 350.78739 : 1"
       id="perspective2575" />
  </defs>
  <sodipodi:namedview
     id="base"
     pagecolor="#ffffff"
     bordercolor="#666666"
     borderopacity="1.0"
     gridtolerance="10000"
     guidetolerance="10"
     objecttolerance="10"
     inkscape:pageopacity="0.0"
     inkscape:pageshadow="2"
     inkscape:zoom="0.35"
     inkscape:cx="-21.621191"
     inkscape:cy="685.06237"
     inkscape:document-units="px"
     inkscape:current-layer="layer1"
     showgrid="true"
     inkscape:window-width="1280"
     inkscape:window-height="986"
     inkscape:window-x="0"
     inkscape:window-y="11">
    <inkscape:grid
       type="xygrid"
       id="grid4732"
       visible="true"
       enabled="true" />
  </sodipodi:namedview>
  <metadata
     id="metadata2572">
    <rdf:RDF>
      <cc:Work
         rdf:about="">
        <dc:format>image/svg+xml</dc:format>
        <dc:type
           rdf:resource="http://purl.org/dc/dcmitype/StillImage" />
      </cc:Work>
    </rdf:RDF>
  </metadata>
  <g
     inkscape:label="Layer 1"
     inkscape:groupmode="layer"
     id="layer1"
     transform="translate(-51.626808,-150.36218)">
    <g
       id="g3246"
       transform="translate(-9.7999724,0)">
      <path
         sodipodi:nodetypes="czzzz"
         id="path3188"
         d="M 400.96706,166.53045 C 305.59458,205.9912 286.10687,362.39512 360.45295,365.92813 C 436.03885,369.52008 393.95299,281.1274 433.13351,269.1672 C 472.31402,257.20699 511.08634,351.26152 558.57466,272.27419 C 606.61286,192.37226 497.39955,126.63112 400.96706,166.53045 z"
         style="fill:#000000;fill-opacity:0.25098039;fill-rule:evenodd;stroke:#000000;stroke-width:1.37450135;stroke-linecap:butt;stroke-linejoin:miter;stroke-miterlimit:4;stroke-dasharray:none;stroke-opacity:1" />
      <g
         transform="matrix(0.869856,0,0,0.869856,29.656437,34.300196)"
         id="g3196">
        <path
           style="fill:none;fill-rule:evenodd;stroke:#000000;stroke-width:1px;stroke-linecap:butt;stroke-linejoin:miter;stroke-opacity:1"
           d="M 392.85714,345.21933 L 541.42857,258.07647"
           id="path3190" />
        <path
           sodipodi:type="arc"
           style="stroke-width:2;stroke-miterlimit:4;stroke-dasharray:none;stroke-dashoffset:0"
           id="path3192"
           sodipodi:cx="393.39285"
           sodipodi:cy="345.04074"
           sodipodi:rx="3.3928571"
           sodipodi:ry="3.3928571"
           d="M 396.78571,345.04074 A 3.3928571,3.3928571 0 1 1 390,345.04074 A 3.3928571,3.3928571 0 1 1 396.78571,345.04074 z" />
        <path
           sodipodi:type="arc"
           style="stroke-width:2;stroke-miterlimit:4;stroke-dasharray:none;stroke-dashoffset:0"
           id="path3194"
           sodipodi:cx="393.39285"
           sodipodi:cy="345.04074"
           sodipodi:rx="3.3928571"
           sodipodi:ry="3.3928571"
           d="M 396.78571,345.04074 A 3.3928571,3.3928571 0 1 1 390,345.04074 A 3.3928571,3.3928571 0 1 1 396.78571,345.04074 z"
           transform="translate(147.32143,-86.249988)" />
      </g>
    </g>
    <g
       id="g3239"
       transform="translate(1.2588028e-6,0)">
      <path
         sodipodi:nodetypes="czzzz"
         id="path2410"
         d="M 101.77996,159.83785 C 55.526641,182.06434 41.460426,280.10323 60.722338,318.93614 C 79.98425,357.76905 134.72114,379.68303 175.68368,367.17885 C 216.64622,354.67467 278.17982,281.48098 263.95757,232.71513 C 249.73533,183.94927 148.03328,137.61136 101.77996,159.83785 z"
         style="fill:#000000;fill-opacity:0.25098039;fill-rule:evenodd;stroke:#000000;stroke-width:1.43701684;stroke-linecap:butt;stroke-linejoin:miter;stroke-miterlimit:4;stroke-dasharray:none;stroke-opacity:1" />
      <g
         transform="translate(-296.33779,-21.310109)"
         id="g3201">
        <path
           style="fill:none;fill-rule:evenodd;stroke:#000000;stroke-width:1px;stroke-linecap:butt;stroke-linejoin:miter;stroke-opacity:1"
           d="M 392.85714,345.21933 L 541.42857,258.07647"
           id="path3203" />
        <path
           sodipodi:type="arc"
           style="stroke-width:2;stroke-miterlimit:4;stroke-dasharray:none;stroke-dashoffset:0"
           id="path3205"
           sodipodi:cx="393.39285"
           sodipodi:cy="345.04074"
           sodipodi:rx="3.3928571"
           sodipodi:ry="3.3928571"
           d="M 396.78571,345.04074 A 3.3928571,3.3928571 0 1 1 390,345.04074 A 3.3928571,3.3928571 0 1 1 396.78571,345.04074 z" />
        <path
           sodipodi:type="arc"
           style="stroke-width:2;stroke-miterlimit:4;stroke-dasharray:none;stroke-dashoffset:0"
           id="path3207"
           sodipodi:cx="393.39285"
           sodipodi:cy="345.04074"
           sodipodi:rx="3.3928571"
           sodipodi:ry="3.3928571"
           d="M 396.78571,345.04074 A 3.3928571,3.3928571 0 1 1 390,345.04074 A 3.3928571,3.3928571 0 1 1 396.78571,345.04074 z"
           transform="translate(147.32143,-86.249988)" />
      </g>
    </g>
    <g
       id="g3253"
       transform="translate(3.0517578e-5,0)">
      <rect
         y="152.36218"
         x="600"
         height="210"
         width="210"
         id="rect3225"
         style="fill:#000000;fill-opacity:0.25098039;stroke:#000000;stroke-width:2;stroke-miterlimit:4;stroke-dasharray:none;stroke-dashoffset:0;stroke-opacity:1" />
      <path
         id="path3227"
         d="M 645,152.36218 L 755,152.36218"
         style="fill:none;fill-rule:evenodd;stroke:#ffffff;stroke-width:4;stroke-linecap:butt;stroke-linejoin:miter;stroke-miterlimit:4;stroke-dasharray:none;stroke-opacity:1" />
    </g>
    <g
       id="g2405"
       transform="matrix(0.7645574,0,0,0.7645574,2.9629428,15.482343)">
      <text
         id="text2397"
         y="429.09805"
         x="138.7634"
         style="font-size:43.07004929px;font-style:normal;font-weight:normal;fill:#000000;fill-opacity:1;stroke:none;stroke-width:1px;stroke-linecap:butt;stroke-linejoin:miter;stroke-opacity:1;font-family:Bitstream Vera Sans"
         xml:space="preserve"><tspan
           y="429.09805"
           x="138.7634"
           id="tspan2399"
           sodipodi:role="line">x</tspan></text>
      <text
         id="text2401"
         y="437.36218"
         x="160"
         style="font-size:30.82241821px;font-style:normal;font-weight:normal;fill:#000000;fill-opacity:1;stroke:none;stroke-width:1px;stroke-linecap:butt;stroke-linejoin:miter;stroke-opacity:1;font-family:Bitstream Vera Sans"
         xml:space="preserve"><tspan
           y="437.36218"
           x="160"
           id="tspan2403"
           sodipodi:role="line">1</tspan></text>
    </g>
    <g
       id="g2411"
       transform="matrix(0.7645574,0,0,0.7645574,98.907418,-100.70791)">
      <text
         id="text2413"
         y="429.09805"
         x="138.7634"
         style="font-size:43.07004929px;font-style:normal;font-weight:normal;fill:#000000;fill-opacity:1;stroke:none;stroke-width:1px;stroke-linecap:butt;stroke-linejoin:miter;stroke-opacity:1;font-family:Bitstream Vera Sans"
         xml:space="preserve"><tspan
           y="429.09805"
           x="138.7634"
           id="tspan2415"
           sodipodi:role="line">x</tspan></text>
      <text
         id="text2417"
         y="437.36218"
         x="160"
         style="font-size:30.82241821px;font-style:normal;font-weight:normal;fill:#000000;fill-opacity:1;stroke:none;stroke-width:1px;stroke-linecap:butt;stroke-linejoin:miter;stroke-opacity:1;font-family:Bitstream Vera Sans"
         xml:space="preserve"><tspan
           y="437.36218"
           x="160"
           id="tspan2419"
           sodipodi:role="line">2</tspan></text>
    </g>
    <g
       id="g2421"
       transform="matrix(0.7645574,0,0,0.7645574,223.90742,-10.707909)">
      <text
         id="text2423"
         y="429.09805"
         x="138.7634"
         style="font-size:43.07004929px;font-style:normal;font-weight:normal;fill:#000000;fill-opacity:1;stroke:none;stroke-width:1px;stroke-linecap:butt;stroke-linejoin:miter;stroke-opacity:1;font-family:Bitstream Vera Sans"
         xml:space="preserve"><tspan
           y="429.09805"
           x="138.7634"
           id="tspan2425"
           sodipodi:role="line">x</tspan></text>
      <text
         id="text2427"
         y="437.36218"
         x="160"
         style="font-size:30.82241821px;font-style:normal;font-weight:normal;fill:#000000;fill-opacity:1;stroke:none;stroke-width:1px;stroke-linecap:butt;stroke-linejoin:miter;stroke-opacity:1;font-family:Bitstream Vera Sans"
         xml:space="preserve"><tspan
           y="437.36218"
           x="160"
           id="tspan2429"
           sodipodi:role="line">1</tspan></text>
    </g>
    <g
       id="g2431"
       transform="matrix(0.7645574,0,0,0.7645574,378.90742,-80.707909)">
      <text
         id="text2433"
         y="429.09805"
         x="138.7634"
         style="font-size:43.07004929px;font-style:normal;font-weight:normal;fill:#000000;fill-opacity:1;stroke:none;stroke-width:1px;stroke-linecap:butt;stroke-linejoin:miter;stroke-opacity:1;font-family:Bitstream Vera Sans"
         xml:space="preserve"><tspan
           y="429.09805"
           x="138.7634"
           id="tspan2435"
           sodipodi:role="line">x</tspan></text>
      <text
         id="text2437"
         y="437.36218"
         x="160"
         style="font-size:30.82241821px;font-style:normal;font-weight:normal;fill:#000000;fill-opacity:1;stroke:none;stroke-width:1px;stroke-linecap:butt;stroke-linejoin:miter;stroke-opacity:1;font-family:Bitstream Vera Sans"
         xml:space="preserve"><tspan
           y="437.36218"
           x="160"
           id="tspan2439"
           sodipodi:role="line">2</tspan></text>
    </g>
  </g>
</svg>
