<?xml version="1.0" encoding="UTF-8" standalone="no"?>
<!-- Created with Inkscape (http://www.inkscape.org/) -->

<svg
   xmlns:dc="http://purl.org/dc/elements/1.1/"
   xmlns:cc="http://creativecommons.org/ns#"
   xmlns:rdf="http://www.w3.org/1999/02/22-rdf-syntax-ns#"
   xmlns:svg="http://www.w3.org/2000/svg"
   xmlns="http://www.w3.org/2000/svg"
   xmlns:xlink="http://www.w3.org/1999/xlink"
   xmlns:sodipodi="http://sodipodi.sourceforge.net/DTD/sodipodi-0.dtd"
   xmlns:inkscape="http://www.inkscape.org/namespaces/inkscape"
   version="1.1"
   width="150"
   height="91"
   id="svg3039"
   inkscape:version="0.48.2 r9819"
   sodipodi:docname="IMPRIMANTE.svg">
  <sodipodi:namedview
     pagecolor="#ffffff"
     bordercolor="#666666"
     borderopacity="1"
     objecttolerance="10"
     gridtolerance="10"
     guidetolerance="10"
     inkscape:pageopacity="0"
     inkscape:pageshadow="2"
     inkscape:window-width="1280"
     inkscape:window-height="962"
     id="namedview2995"
     showgrid="false"
     inkscape:zoom="2.54"
     inkscape:cx="40.31763"
     inkscape:cy="45.5"
     inkscape:window-x="-8"
     inkscape:window-y="-8"
     inkscape:window-maximized="1"
     inkscape:current-layer="svg3039" />
  <metadata
     id="metadata3045">
    <rdf:RDF>
      <cc:Work
         rdf:about="">
        <dc:format>image/svg+xml</dc:format>
        <dc:type
           rdf:resource="http://purl.org/dc/dcmitype/StillImage" />
        <dc:title />
      </cc:Work>
    </rdf:RDF>
  </metadata>
  <defs
     id="defs3043" />
  <image
     y="1.3031489"
     x="20.665346"
     id="image3029"
     xlink:href="data:image/png;base64,iVBORw0KGgoAAAANSUhEUgAAAZ0AAAFJCAYAAABAcPCbAAAABHNCSVQICAgIfAhkiAAAIABJREFU eJzsvWuQZOd5Hvacvl+m57qzszeAgADwAlCKQBKUSYCkEsYSTbliJ/qR/HFFtssuxZUqVSqKrahi pRTlR1JR9MNlUymr7MiKXCWVSrKVUihbpEiaIClBIsUiRQIEQOwudhe7M7tz6fu9++TH4Pnm6Xe+ c/r0zCwAEuep6uruc/3Od855n++9fkH/848iRYoUbw7q7/lSGIYhxuMxxuMxms0mBoMBWq0WGo0G er0ems0mOp0OWq0Wer0eWq0W+v0+xuMxwjDEdDrFdDrF0tISHnzwQfzgD/4gnnjiCTz42ieDN/v6 UqSwCFLSSZHibPDag/8+HA6H6Ha7aLfbaLfb6HQ66PV6GI1GuHv3LsbjMbrdLhqNBsIwRLfbRb/f R6fTwWQyQa/XQy6XQ6FQwHQ6BQCQlEqlEqbTKcIwRBiGCIJDTplMJphOpxiPx5hMJhiNRqhWq3jv e9+Lj3/84/iRH/kRrH3nIykBpXhLICWdFG97NB7/cjiZTNDtdjEcDp1WwU+328VgMHDre73eDKl0 u12MRiOMx2NMp1NMJhP3ITkEQYBisYggCDAcDtHv91GtVrG8vIwwDNHv9xGGIdrtNrLZLDY3N137 crmc02gymQyy2SxyuRyCIJjRdCaTCYbDIQBgPB6jXq8jCAI89dRT+NjHPoafWP9HKfGkeNORkk6K 7ws0n/hK2O/30ev10O/30e12nVmq2+2i2+3i7t27GI1G6PV66Ha76PV67kOyoSah3/ydzWYBwJFI EATIZDKuDSQCRSaTQS6XQzabxWg0QjabdeazTCaDBx54APl8HoPBANPpFLu7u+j3+3j44YeRz+cB APl8HtPp1B1fz8n//CbZjcdjR46DwQBhGOKjH/0ofuqnfgpbVz+ekk+KNw25N7sBKVIQB+9+NqTw 1w81jXq97siCmga1hkbj72A0GjlTk34oiLPZLMIwBHBIBvwAmNFISBSAn2D43/4Ow9BpIkoE+j+b zWI8HiObzWJ/fx/FYhG1Wg2TyQQAHCmWy2Wsra0hk8kcIx2eCwCy2SwKhYLThthuEmun03Ea2Ve+ 8hW89tpr+Jmf+f3wkbt/IyWeFG8KUtJJcabYf9cXQ9UgKPAGgwHu3buHwWDgBKH1ebRaf3vGN6Gf 6XSKfD6P8XgMAG40Xy6XUSwWMRgMnB+EJqZKpYJisYjpdDoj+AE/cSgRWbJREpn3oWZjj0PSC4IA tVoNvV4Pq6ur2NjYmCGVRqOBarWKjY0N10Zeg5KOkhzJZzgcIgxDrK+vY319He12G81mE/1+H3t7 e9jb28Mv/dIv4Rd+4f8Nf2DnP0uJJ8UbjpR0UjjsvfM/hGp+4ofmp52dHUcaXE6T1nA4RLvdxnj8 t2c0DpLDeDx2I3aaq1TTAOCEapSWQIGbzWYdoRUKBayuriKTyTjCOTg4QBAEWFtbQ7VaxWQycYRF Ac3zqtDmsble12UymWOajG6j12JNYLzmXC6Hfr/v+oHnz+VyGA6HM9v0+/0ZrS2TyaDf7wM4Ihz2 I885HA6xubmJcrmMbreLXC6HjY0NbGxsoNlsYm1tDd/85jcxHo/xK7/yK/jH//iPw9TUluKNRko6 30c4ePezIZ3JjKBqtVpO02g0Go4cuE41kW737ziSUNLgh4Kb2kYul0Mul3MClttTSObzeeTzeRQK BecTobDkyF8JgL91RG81DTrRm80mwjBEpVLB+vo6yuUy8vk8ut2u2/fy5ctYWVnBcDhEPp93Ap4a BdvBZWy3akTAETFNJhO3joKfmksmk8FoNJohWl4r+zOTyaDVaqFcLqPdbmN3dxf7+/vI5XLodrvI ZDJoNpvY3d3Fzs4OSqWS6+9cLofRaHTMz8Q+CoIAhUIBzWYThUIBtVoNq6ur7trK5TIGgwE++MEP 4lvf+haef/55fOpTn8IvfuINezxTpACQks5bDvce/XzIsNp+v4/BYIBms4nxeOzyNhqNBhqNBtrt Nnq9HgaDwevrf9r5OIbDoSMACkdC/1vhqlDBn8/nkc1mnSmLkVYPPPCAI5QgCDAajbC/v49SqYRL ly5hMBigXC5jMpnMmJnsRzUbEpk1aQFwPgsA+Na3voW9vT089thjGI1GyOfzKBaLmEwmePHFF3Hh wgWsr6+jXq+jVCrNmLrUTMU+ol8kDMNjviFqOdzemv5U+2DUGpdzm+FwiNFo5CLdyuUybty44TTD MAwxGAywvLyM3d1dlMtlR2YAZkKo9X4SJO18Pu/Mm8vLy1haWkKxWES1WkWj0cADDzyAer2OZ599 Fr/3H/0v4X9x8RdSbSfFG4aUdO4D7j7yuZCkQVMVI6qobRwcHLjEP0YYHWocfx/T6dQJpyAIZsJv 7QibwicMQ2e20fVqrgL8/osos5bVPCiYKYhv3bqFSqWCjY0NZ55iW4MgwOXLl2dIJp/PR/pKAMxE ZykZ6m8ly1qthkajgel0ikKhAODI95HNZp2Zajweu/60fagfaidRpKNkokEK2ue6HdvL/4xgYx8N BgMEQeAGFWwDTW2NRsNFpLHfldz0ftr7xwHLYDBAr9dzpFOr1bC7u4tz585hd3cXf/zHf4wP/o// Lrxy8xMp8aR4Q5CSzinwjcq/Dv/yL/8S3/nOd7Czs4NWq4XxeIzB4O+6Ua06xXO5HHq9nhsx0/yk WgAJRx3g2Wx2ZrRtNQEduVsfg42cUhOVfqKc4VxniWI6naLf76NWq+Gxxx5z5BiGIfb29tDtdrG1 tYVyuexG9TpCVyFN2GU+AmCQAP06BwcHuH37NpaWlhxJHxwcoNls4saNG2i1WhgOh848xuPpMRU2 78WasrSNus4uB3DMDMdzE4fPyiEp2LZQ29W+95nW9Dng/kwQHQ6HGA6HGAwGKJVK6PV6WF9fx2Aw cNrP1772NXz+85/H30ozJ1K8QUhJZ0F8q/Zb4Wc/+1l89atfxe3b/x36/b4TxlaIUiAwKZCmD47C p9MpVldX3SgXgBuRr62toVgsAjjUACaTCUql0jGyoQZBgtBv64ynJmFNXPaYwOwIWpcx9JjaxXg8 RrVaxWAwQD6fdyN6jrKLxSJGo5EbfVszlApt9SNRgKopKwgCDAYD1yeNRgOtVgt37tzB8vKy68dW q4XBYIDbt2+j1+sBOAqJtiRmSY/ntLk6AJw2Z4nEt0z7zl4z+5I+LiUiXht9OdTgVMPjs+bTZLUt NMvxuRqPx2i1Wu6eVKtV1Ot1fOELX0hJJ8UbhpR0EuKV878f/uqv/ip2d38Ze3t7GI/HWFpaQq1W c0RRqVSOCQLVDih8M5kM9vf30Ww2sbm56fwQuVzOmdq2trZw4cIFTKfTGfKxmoxqK+PxODZPBPBr ExqWy28d7av5iZpGEAQuIOHu3bvodDpOO2Nk2a1bt7CysuICD9R8ZU1XbI/PlKjkxJDgTCaDTqeD MAydyZLtp8+p2Wy667fCXa/fLotaz/3j9vGRA9dVKpUZzZdJocPh0N1bnoOkUywWZ0x/OgDQPuM5 7H0mGLlH7bTT6bgB0YsvvogX1383fNf+T6YmthT3HSnpJMC/b/6f4b/+1V9EtVpFJpPBysrKzIi2 XC670FxqD9Q2lAAKhYITCq+++iquXr2KBx98EOvr605gNBoN3Lt3D6urq7hy5QrCMESxWJzRXFSw qFmG5KSjdAo5OvnVvGQFvC0gabUOkisjsQ5DpMe4deuW0/im0yna7Ta63S5u3bqFZrOJIAgwHo+9 5iZLgj4i0m3YRkbpBUGATqczQ0Zsc6fTQaFQcJn91pRmoUKd8PmTVJhHbesjB7uO5lbNweFvtlfN grq/T7OxJjftUxYTLRQKbmBDv890OsWLL76Idx1V3kmR4r4hJZ05+I2X/2H4u7/7KTz++OPOXJHN Zp1TtlQqOcFWKpUAzGa7WyEWhqHLxbh69Sqy2exMZBUFDoXBdDp1DmfrP+B61vyir8WXWKlaizVj WYFuTUt2GYU9TWjb29sA4DQaRs81Gg1X+kUFvhXe1qxlf7NvaL7TfqRzXtep6YpEYmuVWU1ASVmX 2f/6baGkaomB/aLXp8TAQAEmeeq2vmfJ1zZrprP+IOb58DmmRjiZTPDSSy8BKemkeAOQkk4M/s32 L4X/6l/9U3zwgx9EPp/HvXv3kMlksLq6iq2tLayurs4454FZ05T98AWvVqsuOml3d3cm3LhYLGJ3 dxfVahXr6+szGgt9KLTPW02BJiYrvNWXwGV2dAzMmmks6XC9+mboBN/b23OEy+3ozB4MBsdCsXkO +9snqLmc5kktZ6MaT6VScdva6wSOBDeJl0St540ikyjNxtdObq9ak+1nTUxlTg8HD1wehqG7zz7/ kK9dvNc2OpHbFYtFdDqdmWe1VCphe3sb169fB55OdJkpUpwKKelE4OVz/yb8Jz//9/GBD3wAw+EQ N27cwMbGBpaXl12mO6Op1ORjczdU89CAgZs3byKTyeDu3btuXTabRbPZRC6Xw927d1GpVFx0G3A0 mlXSUXAEGyeUfCYru12ckFUCC8NwxixEUmIuzXA4RKFQcMKSwo7XEgWrKXB/m/HPYAZGp2UyGVf5 oFAooNPpOPNip9OZ0YZ8znclCW2nmjPjoMdWqM+MbeRxmfekZtNiseiSQXmNNsDDB6uJ6fUEQYB+ v+98RNPpYVmhVquFtbU13LhxI/baUqQ4K6SkE4Ff//Vfx+rqqsuhqNVqWFtbc/W9ONkWS8FwxO3z UZB0+D8IAuzt7aHRaGBvb8+FSdNkxdwSlnPhOsCf2GnJhLBCUke99lh6vCgzUqlUcqSnApRmGyUV e644kvHB5wuxpisVwFotgPtbc1dc30RpWGcJjXDUAA/VcnhOGwadBD5i0m+aI+njo89xOByi2Wzi zkOfCS9e/6tpMEGK+4qUdDz44uhT4ac//TN4/PHHsbe3h3w+j0uXLjn/AbO9WYOM2f9WcABHyYE0 69DHQSc8S9xbf8poNEKn05kJU+bxrCaggkzh03TiECV4rckKwEyyZxiGx7QI+nGm06nL9J8HHku/ fe1XzYf9wkgv7kMNzBexFnXdlsz1t48EF4VeF8lGr439REIg6SQlP73/voGDJWr6jzjVwvXr13Hx VFeYIsV8pKTjwe/8zu8gn8+7jHYmNrbb7RnSYaFLmtNIOgr1i+RyOQwGAycoC4XCjDmO26utv1Qq uZkkSWA0GakAA+aPzFVoE3GmGruOCa/AUd01+le0PA6d/hp1FWcWsueN0kJUe+G1UCPQBFsKbfXh qOYVpcn5zGtx2y8KbZsSovpfSDIMfFDSXOT8VrsLgsCF1OuxmOM1Ho9x7do1fOjhU11iihRzkZKO wSvnfz/80z/9r7C5uYlGo4FKpYJMJoNer+dMEUo4dALrS+6LkNJ1KgjpHCcoTEksFFBJnNzzzFlR 5rN5wswSB6+Pv2kOpJBnEmy32/USXRSiNBxCTU48v5qo9DxWsEcRjNVK7bKzIhwen+THwUMQHIbS axIoSXtR0rF94Hs2VEvmsRk59+qrrwIp6aS4z0hJx+CrX/3qzCySy8vLLmQZgEuQ1CKNfIlpYrLh yOprULMJzWrArEDRisKAP2GSx1SSU5+KPSYQbV6zGhOXWSiRklxsVBnPq3XgotrjgzWx2f2sv8JW jOY1WE3HdxzfufXaz5JweFx9jiaTCYrFIsrl8kxNO70un/YchXnt1FwvnzZ38+bNxS8qRYoFkZKO wTe+8Q03HwmrI5N0NLRVTWIUvhQQPm1HKwhwZK5OXQqCXC6HYrE4Y7azdn0VhloSxWfT199xBBAV VKBQAUjSzOfzzuRmfS2auHoSwokiBjVTsW/Yj7wWJXftKwsfud4vnw7Px7D3TCaDcrnsws2tvwWY 74eLareej7A1/Ow8QHfu3MHBu58N177zkTSYIMV9Q0o6Btvb2wjD0NU5Y7FEliXxZepbkxM/aqMH 4NVqoqpHk+wonBiGrMmgPIeeS9tjf8/z/dh9rFahglDJkm1i5j/PdRZCmrDaDL95TVY4qynQp+nw eqP6KqoNp70Gkg7L4HAeoOFwOKMR+6LXTnJ+e32MhOQU11qnr9FooNPpYO1UV5kiRTyOD/3e5mDh SvopGArNCgGazKe2cZ/Q0GKcKiyZv0JzXK/XczZ94GiUy2PQfEXth1FHnJgMmC3pbysiWAFsBbEK cCUcPQ4AJ6CKxaJbztI79A/QrMa2sTyOL9TZfvS8KhA1T4Ykp3PfVCoV519TH9jy8vJMVCGh57SY Z3abFwGnx+VAhNoFK2MPBgNUq1Wsrq46IrDBBOzLyWQyM2Oo7xx2uf1oYiwrm3M/PjMA0Gq18Mor r3ivL0WKs0Kq6Rhw1EkBpnOwMFJLCUSFuObTqPCaN3qmYLKakTp69Zz2mFECNOp8tn1R21j4nNFs ly3BAhxpOyTEeW2MEu48j8/UFEcIcfvZ7ez5rHkvCUnFmeU4uAiCwJVOstvrNWg4uO3bk5r67L3X +0jz8M7ODvDAwodOkSIxUtIx0BL5JBKOsAk1NamgmBdqa808OrLVyCYWDOUonVqDCptFHfS+9kR9 xx3TjqqpiWjgA9dRG/EFOcS1L6ofo8KeSSwaNs11JEQf8fmEb9Txo9qq/9kO9eFpGaR+v49SqeRM anpuYLaMjeZBMcpt3vmT9K+9LvXtTCaTQ00nJZ0U9xEp6RhcvHiYHqezZVIwqElNoSRkX2wbtqp+ F81zUdLJ5/OoVCquWnO1Wp1JHPQdOwls2+OEqe8a9XzqV7HRdtyXWiPNOou0c95y9pWa/zSggdtw yod5ZrGo88aRT9x/JTENf9fwaJ8PTvfXCLY4f9yimq5ur1XRwzDE1atXgR9NdKgUKU6ElHQMLl++ PKPV2LBfwgpgwC+woxzZFCq2OjKPV61WnS+JwsqatXj8pBFiSYS5/lfC5XIblMAINk5Kp2StvrEk gjHq+vit/awmMNW2bD9Gkc6ifZGEdHS5Eg7PX6lUHOHQZKbBGSRQ3lNqIT7TZRTBxcHXfp6D7dje 3kbj8S+HK88/nUawpbgvSAMJDC5evOiEm1YLsKYbG21mc1zsR301mkuiYaxcFgSH0UWVSsWtZ72z KL+F/l70E3c8Xc626/UGQTDjmNZjaBWFJO2zbYjSzOz5GXRgpyYgIfp8Ivbbd04f4fi28f3n88Mg BkaqUbP15TApgZLA1cxq27/oPffdZyWeTOZwPidOVZEixf1ASjoGm5ubLjxZkz8V9iXW0bhvtBk1 cudykhuFJG375XIZtVrNCVTuZwWWL1JtUSGk7Zy33ka5aSSZbqcCNglsoIQeT0ldt+P5NV9It7Nz +ei1xF1zFOHYvvD1D/uGUY75fB7VanVme9VquK+aC+nb4/Ngry2qDUlh7xXP2+/3cevWrRMdM0WK JEhJx4BC3uaCUCgQUcSj69V0ob4b/QBw2hS1BgqZQqGApaUlN4+OnktDcZUITkIyPiQhJTW1+ba3 E6nNgyVnKxjttjbSy1frLel0Cr5tkvaZr5+pHYfhYcJvpVKZuV8a1KD+PCVYXhcDWpL0Wxx8UYH2 ezweY3d3d+6xUqQ4KVLSMdjc3HTViql92MoDlpDsxwpO6wehIKEwYrgqcEhAhUIBxWLRTQ9dLpex ubnpcoVU4NIsomY8FW7aligyUme8alI+MgOOpmeglsE5WrrdrvNZMHCgUqmg2+16zx/VX4CfgHRb zQUajUbHauQxGssmX/I41GZ5DXqdVnNU2PupPix+TyYTtNttDIdDrK+vY2VlxU3brWSoeUhslxIn t7ETuel90XsWlaOlbdfnWNuhEZLf/va3T/LqpEiRCCnpGCx/+8PB+vr6jHaj5pmkDmkfrBDX5bZA qAoPCrKtrS0nWCmcOP8Oj2cF+UlMML6RfNx2vC7bT9r+qFG2/k+iqdl+UyEMYMZ3pv1h/UoWSSIB o/bjvlpPj+ZRkqJG78X1p52wj6TOBNEk/eI7blT/6W/OFbW/vz+3L1KkOClS0vHg0qVLXjNJnNBM AiUdqy1FmYZ0vhia3Ghu47TR6lPRpEJ7PJ95zwZE+IS6vQb7m9qCrZbNUbTWYIvql6SmL5/2xWUa tKD9zergNuRdNQU9/jyNMEoD4rkHgwEAOD/OaDRy4c9xZGt9PNS0OedN1LnnkbL+1+vVPlJ/4u3b t3Hw7mfProZRihSClHQ8uHz5sjdazcI32pwntLRMiy731WVTARuGIRqNBoIgQK1Wc0UilaysSUzb lKR99rp8/6NG2ZwbyM4LxMi2qGrPeo55iGqvaoUaHs2+yOVyM6RjQ6+TwpIeoQOSfr+PwWAwEw4f d932+tWfEwSBux47xcVJ75/vvBq9FgSHs9qm2k6K+4WUdDy4cOHCsXlYokJc7f95Qt1+ay6JHku1 DwoE+nnG4zGq1SpqtRrC8LC8Cve3WoX1J8VhnrCyAQE68mZosp1MjVn1Wk7oJH03jwTZjwwt1xE8 tS1fxYKkhBw1wLD9x5lklWypBfquxR6L/cXPYDDAZDLB0tLSsWcn6j7N61e7jY2Y63a7h+VwUqS4 D0hJxwPm6igxWL9E3IscBRXaui8jryxZqObCQpvA4Wi61+shl8thZWUF5XLZjYiZjMhzWEG/qFC3 /32BBUFwlJOjxSsBOCd9XPSVrz/nkbbdV0nZDhhofvQV/owyWc1rY1S7SXo6txLNVnGEw+UabUfS yufzqNVqkdcf1y9R99hnyuV9HI/HuHHjxtz+SJHiJEhJx4MLFy6gVCohCI4cu1GO5qSEA2DG9KT7 0wkflUSpfh9WrR4Oh65adaVScY5q+n40DDcp6cwjn6hrD4KjXB0WPeW5GaFlEzcXOU8U7LUVi0Xv lBMazWbbb31scR9fEEkUKdpByzxNk8egRj2dTjEcDpHNZrGysuKeR73uuOAH3+AmCmyf+guvXbsW 294UKU6KlHQ8WFtbc/PpWJ8JcNxERiQRWlHO+6hQZz02tYZSqYSlpSUXadTr9dxImCYubd+imk4c ovahUOW5bd7JaeeF4XXEtUsTa32k5ptzZ9E2zRt8MGAAwEwuji+XyUdUGrRCM12tVktUMHUe5mlD hULBad2peS3F/UJKOh5cevXHgtXVVZffAcz6dDgSVQHL5XEfdRJTM8lkMqhUKk6r0igwTXhU8qNg zeVyjhw50+nKygry+Tw6nQ663S7y+TxKpZK7jihEhYJboaT5MiRCXgfNaLlcbiZfhnXkALicHmpB SghReU9WU+B/nT+I5FYoFJzpkfesXC4DgAs7pn+Ffb2INqjJvlFRdDR10tTIaTLsLKY6GJlOpy7q DYCrubexsYFareaOqVWr2W5Ooqfaj/2291LnKVLCHgwGWFpawtWrV9F84itpBFuKM0da8DMCtVpt xkzkMw35zCpxiBslZ7NZVzSTwkAjlpLMRzMajZDNZlEul53g73Q67r/d315TkigrXW/3V9+UCjRf vbGoUX+S80a1g4KcRKIhyEowNrpvUdjz+jQmX16QEqeP5Bll1263EQQBNjY2kM/n3f8kJrpF/tt1 +XzehWd3u13U63Usx54xRYrFkWo6Edja2pohnajpkE9invIto8ChD0JhQ2Z1VK2jfGpfTCgMggC9 Xg/dbtfbZqtJWBK1wtRqA2ybahkMZNBrsIU/rYbgMz3F9Z+vbTp6Z3Km9hnbpoRIAkriz/HdY187 dDoC3S/KbGr7dzAYYDweo1KpoFKpOI0JwIyW5fvYe5r0+eS6XC7nEkRbrRbu3LmT6J6kSLEIUtKJ wMWLFx3R2GoBhH2hkwgsffmtWUhNdkp0PtOPChUNDaYvYDweu5I07XY7MnpsEWFrNQq9Jh/pqMCn IPYlaC768fU9AFcgU+ev4bbaNs19WoRw5rWF9yCTyThzYhKyIiH3+32MRiMsLy9jZWUFg8HATZ+e BPOIex558h4GwWGo9s2bNxOdN0WKRZCSTgQuXrzobP/Wjg74fR6LCkt92UulEsbjMbrdrhOM9FsA s+Vd7L4qOBkpRmGVyWTQ6XSOkU6U0IyLtIrah7+1WKlqE/l8fmbqgUX6ZpG+pNBkeLT60BhuzrBp m4R5UrKz22g9OF+/8b8SH6cu6PV6KJfLWF1dnamioP6XOCSJaPMRDr/pZ2O4d0o6Ke4HUtKJwNbW ljNraTBAnF9iHqyQ5m/m4GQyGbTbbVfyhCNntsGe0ycUSVTcnn6WOE0n6ng+AWv3tQIXgHNqU5BR A2EOS9QxkvSfbx9L3sBspQYGbqjpTY93Wo1HwZD2qBBxuw+1W2qHKysryGazLhiCGvCi7eC5rLkt ql8tcWcyGVy/fn3uPUmRYlGkgQQR2NzcdMKK1Z3VzOYbUc4TnJZ0guAoaqtQKGBtbQ3NZhPD4RCl UmmmflmU098eezqdutF+GIauYjXrtEW1U5eRMPib63WZCin2i+YTKemQkDhy1/MsCl879Hgkb1t2 RydEY7/6rnfRtui35iXRP6dt1j7RCEh+VlZWZqoq0DyatH0+UtaAjqiQcX6zfzh4SDWdFPcDqaYT AeZG0DHsI5vTCk0VDtlsFufOnXPlZGgiY9HHuMgngv4MakgAUCqVUCwW0ev1ZrZNklg4b7lPy6Jw syG7Gj0W1Y5FR/O+dtKnYjVSaoCaC6VtSHruKK2P4L3y+QFV2/CZbFdXV909L5VKjoxIAknaqJoN zXJaODYOLMHD4Jn9/X3ce/Tzadh0ijNFSjoRuHzjx4Nz587NjOKB43OSqBkrypSheToa1cTjAEfC 8sKFC8jlcmi1Wq6kC0eoGvYcBEczZgZB4LarVCqOtDiapsCnc52kRIKws2v6hLXOPxMlcEulEvL5 /EyeDDPpWRCU0XXj8fhY5eU4M5EKVO1T3Ybri8Wim8OH94jrGJaezWadSYtlhNTsptqLT0O0ZMJ+ 6vf7WFtbw2Qycbk29A2qdgPAbZPL5XDlypWZ3CZ9TqgNRxGw5hnp86d/vjYGAAAgAElEQVSaFK9Z 84v02qgd0rSWzWbRbrfxyiuveO91ihQnRUo6MVhbW5sRFsQ8DScq2GAeKIhrtZqrONBoNNDtdp0Q B46itAA4cqFwV81JR7okJm2PFeKEb2Qf9dtel40SU1Km09xnLpp3zjgtR81X/K8T73HZ0tISwvBw sjkSMAWyjRCzAn5e/+g3hboGLVgf12g0cmZUJu9a7cwSjGpH1tSrmqX1QUYFwtgPtaFsNut8Sa+9 9hpSpDhLpKQTg4sXLx57ieMIZ15Y9bwPBVOxWES1WnW1xPr9vvPJqPmD2g6Fp45yNX+DWoo6+JWM bDu17fqt29n1bD+j8IbD4cw8P7batI3GijqmPb9vG13PPuC1sg2ZTAZLS0sA4KL52C9aDUFhl/n6 x3d+9jvDpn2mUebjVKtVlEolb+CBjUy057SDB7ut9pV9fnVf/qbmqbPBvvTSS0iR4iyRBhLE4PLl y8ec6j7yiRoNLwqawSgQq9Uqcrkc+v0+Go0GyuUyqtWqMw1xH5YvUeGmJj4KE0aw+QRnVHSTT0tT H4i9fvVFaDsZPcYRvU+YRsGakrhM7w01OZoO2Qa2h6P3crmMyWTiTFk0a6opzieYbT23KPAe5PP5 mYGCkv1oNEKv13NajmpElsi0PeqX8fWbL9hEl9koOJ7PnjeXyzlCTiPYUpw1Uk0nBpcuXZrJbPc5 h6NGoLreJ7ijQOE5HA4RBAHK5bKrr8bqAsyD4bYAXKgwhY2azShYtbS/9V8o6cRpY3HXqr4Tu40N m1azV5K+jNKAfB+ahljxmp98Pg/W1Gu322i1WjP3N8rf4RPMUT4WHqdYLB6LYCPxcM6dcrmMIAhc NWlfTTft23mwJjVrcot63ux/Tey9d+/e3POmSLEIUk0nBpxXRxMb7SfpaD3JejrZaZrp9/vI5/Mo FouuTA4Lea6traFarc44iXUkq2HDHLmqCccKITXZ+doctZy/+X88HqNYLM4UNCUYRWfbGTdq13Xz NEleA0sAsYCmnmtlZQWTyQSdTscFPETl6Njrm3d+Dkyy2SxKpRIajcaxKbwzmcPirAyJ5qR8rASg 1+/zz8Q9Q/a5tOtsEIYlI+6nQTH1eh3f3fy34aP3/ubiqnuKFB6kpBODra2tmeq7i4wY7csMzJ+9 U0f/mlPCPB6airrdLjqdjssjosZDwar5MgCOkY7VFKyA9/ml4n6rkB6NRigWiyiVSjMmKwrZTqdz bJoD2wYrNOMIzy7neahBWP9RsVhErVZDLpfDYDBwxFCtVp0JkGYsS9C+dtj+VL+cOvC1H6jZAHAa LU2DPF+UD9H3/MW1z3d/gSNTmw42+OHzEgQB6vU6bty4gUfL3i5PkWJhpKQTg+Xl5ZlaXvOgQtua aJJAEyiZ1Ekfz3g8RrlcxsbGBiqVCur1Ou7du4fl5WUsLS054aGjVIK+C5sg6stn0e+oa4vaBjgk nXw+78ia5+D1RZkn7bl854kjG+Ao7FerD+i9GI/HyOfzKJfLKJfLaDabaDQaLnRazWwkMFv/ztcO FdpsNzU9vV7tD81botlRAy9898QOWuyzpdUzVIuM0mrscg1CoU+n0+kczq3zkLfrU6RYGKlPJwYb L30sqNVqTlDY0FObk2PNE3zxGQ1E05kSgzWp0JxGoUcfBUfOo9EIpVIJFy5cQK1WQ71ex97e3swx dI4bCj8SGKPKVJiyXaol+XKOVKiqT4mj9IODAywvL+Py5ctuX56nUCg40mGiKn0uFPI+J779aE6M 9jNwFEo+nU5Rq9WcdsrRO9vDfVZWVvDII4+gWq3i5s2baDQarugmfU88j5q2fKYv9iOrQVQqFZRK JdTrdedjIhnm83l0u11nhuOUArwu5l+xZh3vj4XtEy5TsvGFSTOfqN/vu+NyH075XalUXPv+9E// 9BRvUYoUs0g1nTlYW1tDo9FwghyIdupSmFNAaWSUvvwK3wg2Chy581zUcHq9Hm7fvo2lpSUsLS25 UTQFiib92QACn78iCup013b0+310Oh1UKhVXhkb7icJaw7uVbIAjf4zFIpqiEiKJgn4yko8Gg1Co bmxsoFgs4vbt21heXsba2poTuuwfmjatSdFqEto3Oo8QoffbRwhJru+k8GmQGtShJlqSZL/fd1Nj pEhxFkg1nTm4cuWKM4f4TBSAP+rKjsZVW7ImrqiIL/tRoc0Q6Vqt5sKA6RxXTYyCz9YkU2Gv1xIH 3VaF03A4xGAwwPLyMkql0kzBUQWLYTJ/xVZYiMpLIZIuy2QyM5oh28P+U9NZEASusvPW1ha63S5u 376Nfr+PTCYzM70AtQ5feLmvKCe1TApzvY809ylRzvskmU8n7qP9S5LXagnabmo9AGY06RQpTouU dObgoYcecuYjmwmuCIKjPBgKVxUsOreLD/NGucCRuUyFVhAEqFar2NjYQCZzWKW62+16BSDLz6iA 8YXnRsEWzByPx2i32y7JkVFrlkgo1GgyYgHVuL7wCUvtpyhiYj8xuXE4HB7TNnk89iFL4GxsbODh hx9GrVbDjRs3cO3aNUdKrVZrpn1Rz4K2hW3QkjYMCgHgTHjzyCLp/UlCXOq3IekQatpT0+ze3h5u XP50WoMtxZkgNa/NwQMPPDDj/4iKKtL1FCS2uKS1y6uPIAloKiKpsSQ+BSMA7O7uIgwPq0vT3Eey YVCEzZMhoSYx72jUFfNNisUiVldXj12z9SvQ50Ki0irK2h+ENTuqaVD70EZfAXCanfp1qPVQ+1ST GD/04Q2HQ7RaLezs7GB9fd31oR08UIhrlBr7slQqodfruYg+JR22RzWdszCfJV3P67EmQ7aF2+Ry OXS7Xezs7ODBU7UuRYpDpJrOHFy4cGEmhFYJxwoJaiCMNgOOhIlNVLQCIonAsSY+CjtqH6xW0Gq1 0O/3ARz5YQC4opva/iRmPX60SGe320Wv10OxWMTy8rIzZ1kfhdVSisWiE3ZRZHNSTUcJgFrVcDh0 miq1Pd89IBm1221kMhn8wA/8AC5duoSDgwPcuHHDVX9WrdFGh9m2W02HBEf/mprXfNd91h9to5oZ dXCg9f2Y5DqZTHDr1q25z2eKFEmQks4c0Mms4cU+k4qakoDjpeuTkMo8ocERuk84cH9GbbXb7Rmh zCg6rVqtvpmkPgWarEajEQqFgvPj2GKiPuJQQawakUZQncanw/1VI2SlbpbB0Ug91TR5XSSrMAxR rVZx5coVVCoVvPbaay66Tcma+/uun5FsVpugCdI+G6cllXnQc+mUHZbI+aywrdPpFNeuXZt7/BQp kiA1r81BpVJx5iwgvqQIzSsaOaUOfQvfCD8OzOWgIKCAoDN/NBqhWq1iOp2i1+vNjHCVNIgoX0QU mNzZ6/WQyWRcscogCGYEqx5TiU0FLmGd27Zdi5iclPApOKmhsPq1JULVzpRUgUMTHc1io9EI29vb TmuiiUyd+LYPeM99JK+ah23/STGvr3y+PI2401B73XYymeDOnTunaluKFESq6czB2nc+Ejz44IMz I/PxeOxKrPAFtaNnmnM4uvaFRVsfEYmK2ogdASuZcTn31ZHrysoK+v2+E5D0u1QqFRdpRqHMkbhG RzEggkKTviEWymSiaqVScRFiPL9qRgq2jU7qZrPp6pMxGVZn0WSlakaP0UzG9lKDYT9reDLvwfLy 8kzGP++LNXXR3EVC15yi6XSK5eVlPPTQQ9ja2sLBwQF2dnbcPeH8PDynToSWy+VQKpWOTaWQyWSw vr6Oer3u+vu0hMNrmxdAQE2QJkhWMQ+CwPU3+7JcLiOXy6FcLqeaToozQ0o6CVCr1Wa0hqgggnmY Zx5RwR9lMtHlUVF0Gg5LgaO+HVtyRY8XBEcl7jWyajqd4uDgwFVupgbIPpkXjaa/7Zw7hE7FwIRY JtXSNEeCsX1GwmCBVGoXmUzGVUnQ+6TXTN+FNTNZM9/Kyoqb3fPu3bvuuKrBqObAvqR/TwckvBe2 D+437HPFewvgmM+L/TqZTNBsNnHnoc+kEWwpTo3UvJYA58+fBzCrWajQsk7ukyLOhKeCTNtht+PI nw5s5s3otMesUg0cmaJIHFYDUpNTr9dz0yswh0P9EiqgfWTGa6xUKjOTmOk6tpvmQraJ2pEejz4T mrpsPgyPXa/XsbKycozM1QSqfrGoAIdSqYT19XX0ej3s7u6iUqlgZWUFw+HQtYXPg5JZvV53y7WW Hs12lUrFe76zht4f4Pj04mriJGGync1mE9vb27h4X1uY4u2AVNNJgEuXLnk1HR8xnOYTd0zfObi9 CkkKNBKFmuW0gjVhQ4Z9juXBYIBut4tKpeL8OIzIs4I+TlsADgVdpVJxmo6aBTVnZDweo9/vO/Ob 7R8VmDQLqW8rkzmctK1cLqPT6czcM+tbmU6nzt/jazu3m0wmqFQqqNVqrvCqTfDU/stkMjPRenr8 QqHg7kVSsjnt82VJh9dG0rETyfFZomaaziKa4iyQajoJcOnSJSewNSLN5uHMw7ztfMUluR+Fo0+w 628KtCAIHLmoECwUCk6QqylFNTYdsbPSwXA4xMbGxkxVazXfJTER8brUJKXn5/WxPA19LVyv5Wy0 Hhnbwm2U0NbW1nBwcIBut+umANfrs6Vqou4RtRIAWFpawv7+PtrtNtbW1hzJW6EehqGb52g4HKJa rbrr1eg63z2P6r/TQp8ljfYj6atvjtszv+vVV18FNk7dhBRvc6SkkwCXLl1CpVJxznklHZtRfhok 0Zx0nc9ZD2AmD4QmMu5fKpXQ6XRcsqhG1amZjf85jQJDiQHMCPi467bRcaqVMVFU1+ksqJrISa1N w701QZZ5UdlsFqurqwCOQtZXVlbQ7XZx584dPPbYYy5CSysr2GvwmQp5TpIZi2bSIc9gAApx9iX7 TUOt1fSmWtBpn595iNJ0dAoIPlMaFMM+u3btGvC++9rEFG8DpOa1BDh//jxqtdoxn4u1hZ/W9GEr J/tMUzw/cJTkZ3NbtLQ/TVYU3pwemSYoJS5ehy7vdrvo9/vHhLlGRFn4tC+C/cbK22o60zykXq+H ZrOJdruNfr8/Uw2A1bIHg4GrlsyoKx6DgrJUKmFlZQUAcO/ePVdZWSMBNSLQtlvvLftQHeya5Kr3 SPOFCoUCer3eDOlQI9VoxbMwncXBZ2aj1sPr0gAUrXAdhuGhppMixSmRajoJsP7iR4NK5f0hBYbP iZ/kpZ9nHqH5yG4bdWwlIa1kTEKwxMiRNwWLNaNQ8NB8Foahy3NZXl6eme7anlcrRuvx7DVwH2o6 ekxqXzSDUVAzsZOJrwyKsHXe+Gm32zNz1Jw7dw6VSgXf+MY38OCDD7pk30WENvsEOJqmAYDTsqwW QfJU85Rm/+v91vD4NwK2z/TcduI/ndBtd3cXB+9+Nlz7zkfur0qW4vsaqaaTEOVy+djIXjUCO1K2 +RH25bahvmpqSrK/mvd4PAqIMDzM1Wm3287HwZE1Q4NpGtKpknl8EsF0OkW320WtVpup2aYmKa2I YAMaeH3AoXBeWlpCo9HAYDDApUuXXE4M20eiJFG84x3vwJUrV7C5uYn19XVkMhmn9ZTLZRe5Rs2O OUMU8iTNMAxRq9XwxBNP4N69e3jhhRfcVNXAUaFLXo+O/nl/mZdVKpUwGAxc1BrNgAoWQ2WlBtZg 04TebDaLcrk8k0/li05Un5bvmbCai4U+T5zXhyZXPjM089nQbhI+/VLdbhcvvfTSnDclRYp4pKST EGtrawCORvBqmvE5kRXWTHPSvAyfycdnflPzkgoYChGa3vR6VNAoNKrMp1VoGzSJlMsZEVUqlXBw cIBMJoPV1VVUKpVjwQNWG2KSqP1Q2PP3cDicqeemZMjrm0wmOH/+PB599FGEYYirV6+6EHCaG1UD YX4Qr7dcLs8If9uPtv/5m1oaABc0wG1IlhpNaO+3fs97NuZta6tYaFBMnDbN52kymWB3d3duW1Kk iENKOglx8eJhhgJfTr6wKuiihDJhM8Ptiz7PZm9HuhZqItOwaRXo1IY0nFpJwhcSrlFwSdqoxMzj TKdTNBoNFItFbGxsoFqtzvgP1DfF7Uky6jvRUG0AjjBU67Okw2O1221cuHABTzzxBLLZLF544QXc unXL+V14PBKJJUIlbp0byEa+aVQcM/oBHJsuvFgsIpvNupJFus73bPieFR98y9nX/NZ7M+8Z5jMz mUzSygQpTo2UdBJia2trRhirD0XNMHHkE2UeoTBNItSjwLZxNEshysnICApYjVhSJ7YKPgAzgtVq WPba6GvRsvkUvo1GwyWGVioVBMFsaRo72vaRnyYrUhjyt5q4bH+zX6bTKfb29lCpVPDkk0/i/Pnz uHr1Kl555RVkMhk3dTSAY7k1NC2yT6gNMT9Iwfawf0ulEjKZ2WkWAMxEtvlIJ8lzELUu6lkZjUbo drvOLBgEgdMUbZ/x3pBkwzDE9evX/Q9gihQJkZJOQqyvrwM4XpUgTgBELZ83io2C9enY3yq0aLrh FAdqdmIEmy25ryN1Hoc+l6ipmu31sA0UXgyB7na7WF1ddaN+hkBr4ILtE9UKKfy0XA21I9WU2Abr X6I5KwgCZyJ6//vfj3e/+92o1+t46aWX0Gq1EIahK7dDTVb35THZjxTYJE7ta7aDficSPbehn4Wa pG2zfYZs/0Q9R1HEQ4Lh1BesCcj7Y/te+5YEnyaIpjgtUtJJiHPnzrnincDshGI+s0hSDYVISjy6 vf3oKJpagZ2zhSNv+kv03BQ2OtUAt6U/Iup6SHT0tVBIc6K3crmM5eVl5HI5jEYjdzw1qdl+tJqh Rt/ZSDpqIno/eHwKTc5wWiqVsLu7i3q9jkceeQTvfe97MR6P8eKLL+L27dtuemoSjx5b+6parbp+ tNoat2WkHglKp4fOZDJuvhq9nrjnaNEBjYLXwHB05haRiKyPkuTKYJdcLoe9vT3ceuDfpTXYUpwY ach0Qpw7d845nRm2a0OnraAgdOQbh3nr55lOmBcCwFU4VmLhfpzThs5zGyFFYUnS8Ql5HjOqzaxe 3O/3kc/nsba2hiAInNak5Mb2RgVkqOlQzV+2IKmFJTQmxtKMtru7i16vh/X1dVQqFbzwwgtoNpsY j8fY3NzE0tKSq8Ss0WT8z8KiSjrqI9O8nkqlgna77UyQbLdOq02TqK8PbF9zne1/X78peL5Go4F2 u+1yhVh1glod+4+mNQ64ms0mbt26hSveu54ixXykmk5CcLIynYBLS6rEEYYKiKjtkmpDOuJW8wfN VKodWJMQ26CRbb7RuZ5DqxBY2Gthtj4DFTqdDqbTqSuMSZMe26Dz+7BNti/YZ5oPZMOLfdGAPg2A RExtjHMPtVot5HI5fOQjH8Hq6iq2t7edxsPr0eOq2Yxt03sBzFaSVjOl1ZqouWlkm+9abL+cBDQd ZrNZV2mCzzFD0TXIQLVErcKQRrClOA1S0kmIleefDtbX193IlqNTfVGticNHDNbv4COhOFKJMqdQ qGq143K5jF6vNxN9Rr9IuVxGs9mcGV0zS384HDpBy0RKXaaEQdOLtn0ymaDdbmM0GuHcuXNYX19H s9mc0QDYB2w/tQWfH0Jzg6bTqUsSZRuoTdhtSQjsY81Xoj+Dmkmr1UKj0cDjjz+Op556CvV6HV// +tdRr9cRBIGLkCPZVCoV55Ppdrsuj4fRglqbjsm1mUzGBVTQ37W0tORI2vYBr9f6jHzPih0s2AEI w56n0ynK5TImkwkajQby+TyKxSKazSZ2dnZcn1jzJzXRcrmMb3zjGwu8OSlSzCIlnQWguTrAUUQU l1ki8ZGKT0DYdXEfhS+YQNtDgrM+BwohNVHxGFZzoBCiE9zns7AaHwmHgQM2VPikH+0nvdZF+s+2 Xz/1eh13797F5uYmPvShD2FlZQUvvfQS7ty5g+XlZUcWJBQled/9tPeb90CfC5KBncjNRjMmub55 0ITX6fRwfqSDgwMAh0VMaQ7VCDb+LhQKzpy4t7c391wpUkQhJZ0FcOXKoSWbAoYOYB1V6ycKVhAl FSpRxKMfNY1QA+FMoRrBxtGslnCxUWwc4RaLRVeSxm6ntceCIECr1UKn00GxWHRz2KjvKCpsPInQ JKgpLVps1RK+bU+xWMRoNMLOzg6KxSLe97734fLly9jd3cWNGzdmtDQlHV+uDu8Bl9nABO3fQqHg wqYtuap2vCiZWvD5yOfzzszY6XQAHJb2OTg4QL1ed6ZUDRPnBHnT6RS3b99G84mvpMEEKU6ElHQW wOXLl2dm3dTkUDXl+D6Ej3AWEbh6DELPoYKYPh0KNO7L5FFGkXF7JQZuz8grls3R0boVkKPRCM1m E/l8HufOnXMakhXyp9F2KKjttWq/JP1Y82UYhm5K74ODA5TLZTz66KNYXV3FjRs3XD+SeOjvYN4L 22Dvk5K3Jp9q/zLfJ0ozTnp9vn31eQBmoxJ3d3dx+/ZtXLt2DfV6Hffu3XMle7Sauu6/u7uLVqu1 0DObIgWRks4CuHjxoquQHKVhxEGFhw9RhKVC3gohfvuW03dBfwOX27DpuFFyJpNxM32qmc62hz6C UqmEjY0NpzVoGR4ln3mj9DiBqoEQUf0Qt3+UtgPATYeQyWRcVeVHHnkEmUwGe3t7zmfD/Zl/4wt5 VjMlI9g0P4rb0sdCv5GvnUkxj4BIJCSQfr/vNNHBYIB6vY52u33MlMr7nslk0Ol00mCCFCdGSjoL 4Pz5884colqNmrTiBF6UVhO1PA7zRu4ULBSKqqUAcEmatnaYr82sk6Z+BxVKDLnt9Xo4f/48VldX XSFLW8g0rm+SXDMAl6h4knloojQREjHNgRrVlcvlcPHiRezu7qLb7R7rGwDHNB0lHWoKSt7aDtZ1 Yyg+97eh+Itcm70+AC4AhoEXbN/a2hoeeeQR5HI59Ho9Z2IjSWk5ID5PN2/eTNrlKVLMICWdBcAR POeBIZR07MjZhziz26KmE3tODSlmZJmWpGFbS6WSE9w8nrZZyYURbIPBwEsUHCFzFk062gHMCDfd x4ck1x8EQaRPJ8n+cQENrAgdBIfmsKWlJbTbbTSbTVy4cMFFAiohkDDo87JEpoMSWwmC4NTVg8HA O33EvJD8qD70QQcWnHJ7OBy6KLZ+v4+9vT30ej03bxH7mkEP4/EYV69eTdSeFCksUtJZAGvf+UjA OeNt5FgSzUZ/n4R47HHitB3gKPJMy7nwnNQWtA0+LYbbZjIZr9+CoeOtVguXLl1Cv99Hp9Nxs5dy VD0PSYUqr2vRfeLAvmPocjabxdLSkjs+gwV8BMY8m16v5z0mt+O2vBe6XPvXBiSc9TXSf1UsFmcG HjQbj0Yj1Ot1R7A6BQZD5cfjMXZ2ds6kXSnefkhJZ0E89NBDTmjQDs/RI0ep1n9hR/qqkei6JD4d X8Iez0UBz23pnxgMBjNzv3DEms/n3VTUSmS2kCZNT91u95gJLwgCF1LMOWrUYU0zFY/pA68ribbC vlhaWnLt0cRR6z9SRC3X9SwoOhgM3PxDo9EI1WoVuVwO9XodwNGEc7lcDtVqdSYsXM2YxWLR5ULR x9ZqtY5pOowQBOA0D+2bRT/sC5sf5iM2ThHBGnH1eh17e3vOd6aDCO73/PPPe/swRYp5SMvgLAhO 20xBAhxFsWl5E18UkoYc+2AFok/D8WlLFqqpUAipP4ZkwpE3AwQsVHtiXTUlNAp8TiUdZQLUtpwW NKlpBFvccRfRGGw/2HupVQV0ltd8Po9utzvjw1Kzmmo6LKuj+VEkdebM2OjAKJK012Rr6VnYwQ6v jQOnyWSC1dVVFItFF8F3/vx5p/HwGkiQdx/5XHj+lf/kdGUSUrztkJLOguC8OsVi0VXmVZOJHZVb oRdnUtORpO9bEUVgtmAjR+P0xxCZTMYlbo7HYxSLxZnjqPZBodhqtZywpFY1nU5ntD17jLj/UdcU BWb6U/jRNKSBHVHnm3duAM4EqfdBfRmVSsX5OnjOIAhQKpVQr9cxGo1crTreA71P1GgYMabTNFQq Fezs7BwLU2bEGM1wcZqwDoT0OdNv3k8GxOiU2Z1Ox2lGjUYDuVzOFWnldXW7XYRhiHq9jps3b+L8 3F69P7j7yOfCTqcDfgaDAXZ3d11txH6/f2xyP2rbqgnSXM4wf5ZsWl1dxYVr/2lKqPcBKeksiAce eMAJc4567SRYPp9O3OhTBTzhI54o4rKwpFMoFNDr9WZ8OiQSVhtm2K4KXJ6bUyvX63VHUNxWr19h yfcsYE1SNGkyaTFue/ZLHGwiJnCkndHP02g0HLkwb4eFYNXv42uH7XMSPYlLq00zakw1IlvpW2u7 6TXqR8lYTbHcj8ECDG/v9/sol8t4+OGHUalUXH02JUi29c6dO8BGbJcujOYTXwnb7TZarZb7NJtN 9Ho9tFotjEajQ9L+4v/tTLcMXKF/zfopVavTQSD/s1+uXr06YyKtVH46XFtbw+bmJlZWVvDOd74T a9/5SEpEp0RKOgvi8uXLLmyUD7t1DEeRhwp9Xa8vhd3Hfvu0J4USDgBHOpogqv4Gzb+xglsDEnQe HEZscR19IGyjJV9tWxzmaSPsK5q3bI2w04LXolUDVONggVCSC/ehQ559rL4V3Z91z0aj0cwcOtTc GCG4vLw8s05Jg8v1W31ati/Vv8TRP/06bCPP8fDDD7uAgYceeghBcFgaiIESnU4H4/HYab3Xr19f mHTuPPSZ8M6dO2i1WhgOh+h2u2g2m64A6fjZ/+tYIVoNhFFi5jOg5Yks9F4qSfN+UFPnfefx2F/7 +/u4du0astks/uiP/gibm/9t+PDDD+Ohhx7C1tYWVl94JiWhBZGSzoI4f/48arWa0xy0AKjm7qjJ TEdUUeY1YL5QjtpP11mBr2Vs+OLypWMIry1lY4ktk8m46sT9fh+rq6tOyDMKilFOWpiU+/P/vATa JOY3jv41fFe1gaj+SgreT56DgkzJ1k4JQWKn6YnXwueDx5lOD1tG4c8AACAASURBVCtuMwBFyYMm LE5dzbZQG+F/bm+ftyTXq/sDcEEfDDChyW97extf//rXEQSHxVGXl5dd0AZwqHH1er1DTScB9t/1 xfDg4ACf+cxnsPNH/xzb29tuzqJqtYqlpSWXC6aDONWUVQOhaZXvFveJsiqwn1gOKqq0UFQ/qfly d3cXd+7cwXPPPYf19XU8+ugvh+95z3vwjts/kZJPQqSksyCu3PxEsLLyTHhwcOBCp7XStPpUAL+2 YknGajhR+0XVGovSnJibw9yZ4XDoRuUAXPv1Rbeg0ORInIKV7SmVSlhaWsL+/r4jHb7Q1r80j1Tm gW2hpkFBqaYV7RNr2ktCahTm2pe8t/SBqHYIHJWyYTCBzxTKvqhWqwCOosh4DvUZsQ9VA81kMjNR bz6N0vdM6De1hOFwiMFg4DQuVuze3d3F6uoq2u02bt68iWw2iwsXLjgtjsEEHHA1m03U3/OlkKN9 +llYf6/X6+Hg4AA7X/8t7O/vO39LuVx21oJ2u31ME/GRJ8ler93WOtQ0ALsvCVT7S02PvmPawaOG jYdhiP39ffzFX/wFXnjhBRSL/yD8sR/7MayuruLcyz+aElAMUtI5AZaWllz0FwW2Pqg+M5lP4Fnh ZCOn9NvuFzWy95ni1OHPRE8AxyKtdEoACxKZVpvm6I8ak488reYXhySanpqLKJCtSTPO7BgHHls1 GB0Rq8mM/cV1DD8n0ftIRwWf5saoY7/ZbB7TEqmhqtPfDnR4f9VsZAUo92Egg5ra+CxzenMSFM1f FLYAHGlcvXoVv/3bv41W66fCIAgw+g//8hhpa98y7JqDoG636/w2g8EAm5ubbj8SgJoYNSnY3jfW +SPiyNn6vXi/mbTLd0a1LB1QqS9T+/Y3f/M38fDDD+OHfuj/CZ/s/62UeCKQks4JcOHCBXz3u9+d EVLAkaNW7cKqKfDBtvPKWMEZZTJRLUbXKbEwfJlJjmEYYnV1FS+//LLLLVGTz9raGu7cuYPLly8f 8x1otBQFcKfTcb6HfD6Pfr/vQon7/T6WlpYcualtfDQazZCcNTPqeQm7PgxDd+zRaIT19XVcu3bN CXQVGiq02D9R2pz2bxAczR2jc+gw2GJtbQ37+/u4cuWK07SYq9NqtTAej100lN5/Xu9kMsHKyoqb HpoVChjVls1mcefOHfR6PaeJ0uw1GAxmNFM+SzSPWj+R7WeNjFPtlpF41MI2NzddeDcrcNAUViqV UK1W3e87d+7M5AYB8f41HTSUy2WnPff7fezs7GB5edkl5moIOP/7yEO1ER90Ox+iEnLtu8e+5z3l 9iycm8/nsbOzg8985jP4ywv/MPzQhz6Ex3b/85R8DFLSOQFYbbpWq2Fvb8+9EPoy2/IvmpuhIyWb vBeHOE2ALxWFhQoX4FCrobOfLwwTTFknzbaB/3le5qPQ7KPl/bPZLHq9ntN4+K0JitZ3pG1hH/mu U30QatoD4MhWq1lr+1UoMbcnSviwf1RYq6bAdePx2CXCcptMJoN2u43d3V03oic5A3BlcgqFgpsY 7tatW+j1eo64Dg4OHJmoz5AT6Nn+scStkZDqu1AS1pG8BjxQC9Nl1OZpVqSplgMKq43P01QJtlGP Dxz6zer1Ovr9Pmq1mtOI2L82LN6S6mmDSZK032quSoK8T9PpFHfu3MGXv/xl3H74n4WPP/44Nr/7 H6fk8zpS0jkBHnvsMWef39vbcw+dLwtcR0ccBavPg8LTFsechygTGIWsChs6jJlXpJoZX+zBYIBS qXTs2PpSMWyaviE6ZovFIoIgcPZ5mozsSDXOZq+IMi1qzTKep1qtzuQY2dGvCkQ11+io37dMtRDe P4bvdjod3L17dyYIo9FoYDKZuErUdM6ToEnsxWIRBwcHKBaL2N3ddQEeNKOFYehqsFkS1RBre48B zJCqrvOFwfv6mUSi5KUmJt5XPtM05+m9tceOur/23vB9YZRcEASoVqsz5syoY/g0k/uBedYH+k35 DN24cQP7+/uo1+t473t/P3zk7t9IiQcp6ZwIW1tbbkTDfB0AGA2GyCDANJtDmJ2Cz2YukwUyR1NO +4hBzQ5A/Evr0wRo5lONSycO0+gqHfUy52I4HHpDdVUwqdmDWet0otMxDBz5WmwVhKgROjFvpKpC kP+r1aqbGwg4Cq+1BDKdTmfMU0oodr2Sjq4neYRhiL29PTSbTRcmTZKgqUgTZqnlkYQ4ws9kMi4i TkfxlUoF5XJ5RkPkfdRnI07T0L6OE9j6POrUFTYYhIJfE2hV+7DniRo42Gdc+4Jm6G6362afXVpa cv4mfUfYRktecUgymIuD7V+fOZxBLrQitNttPP/887h9+zb+yl9JfT1ASjonQrVaxerqKra3t1Eu l13SmvoPaGOnAzKXyyHIBMfmmKEwo39AH2T7kkStU5u9hnuqCUorCug6jp4Z8mxHc3quTOawnE63 28W5c+fcehaQ1PZQaPvqw1mziEIFmJKHbssILPquWq3WTGFKJZTxeOz6nJqEClA1n6nPx2ffp1DW UjYcSLBYKEfoqmHwPpNASNI0z3E7rcytZEBSUqHuIxjfs2KfE99gRzUqa5rTGn88nq635tEoQtTB gq+tekzeRxJ6pVKZiRrzmbii+kFxVpqQJWwdoNlBC5cdHBzgc5/7HA6e/Cfhk08++bZOMk1J5wRY f/GjwebmXwt3d3ddqGy/38d4OMQ0n0cGQC6TQTY4ijzKBgEmwIwPBMCMgNQXU4UOYbUFK1A0aY7R SSTBSqXiwlbVyV0qlWbMPwp7fDqU+TLl83knCGq1mnOkq8AKgsC1RX1ZVotg+ylclTRIFiR2ambW JMV2Rn00h0g/NEuRLKz5x/YvBwoUhhR+DKqwFbx5DvZNpVJxPjH2uR5HtSI+Iyrco8xk+lu3UUKx 63Vf6+PhdZPs2E/sA80f4nNmj63CWGEHN+wjlhhiLlyn08FwOESlUsHS0pIjKDtQsNfiw2lJx2r+ utyaGfks811jmP2XvvQl3LhxA88882/DR+/9zbcl8aSkc0LwRWq32wiCAI1GA/12BysrKxgOh1hb W0O5XJ6JAKPfJAgC53TnSBKInglTl0VBR376n8JfZ6fUXB2GUNMxrsfTESVJh2X+WZFBEynb7Tb2 9/eduYSaG53l3NZqI0o02narlamA0ggibsNrUcGpI3tLOroNj6nXb/uBPi/WsaNPjNdZq9WOhSrr uWwgiRWgbLcbqFBDlu3s85HkOfUts34bu8z2jZKo1ajttqqh+TRy+9yyTRr9xuummbbdbgOAq5Wm /kufVeB+QN+tKO2Sy+n/0kFXtVpFGIa4fv06Go0GnnzyU+FH8//gbUc8KemcEAcHB2i329jZ2UG1 WsXBwQFyCNyIXgV4r9dDv99HdzhApVJBv993jugLFy7g0qVLM/XDokjHNzrU/8CRs52Ci9FBmlME HPlP+HIzSRA4GsWqpkFB02g0XEAEHd6j0chN/LW7u+uW0wSm0yGzvVEvrY8UbFvVXGfDdC0RqUlJ BaWuV/Nk1EgWOAr28JWj0ZB1tp/ky/PYmUN18jaa32iCo3/O+jBsf/n60NeXvufJrvdp1jaaTc1q vqAZHwFYbcdqPmwDr5v9VSgUsLa2hl6vB9ZjY5i1BuTwvs8LiZ+n6cwjLiVeX/utX5bvENtLPx8j FZ999lnce/cvhs888wy2rn78bUM+KemcAHcf+Vw4GPwsGo0GgMP5RkajERqdBjbWl1HNZ9HdvYf6 7dcwBdDt97BfP0B2dBhxVSwf5jogn0P77g72wgkefvQRTIz5w37b/B41mwBHNnUNre31emg2m+5h J2lQyLGIZ6PRwCuvvOLMSFYTCcMQ/X7f5efcvHlzJlqN8/Ls7+8jDMOZ+mQUykoiUSG7CisErEOc x+a1n8R8okJ3XiADt2P/k8hpYiTR2Lbz+pRY9JjUoNgW+seYSKrRZ/bY+t8ORuy3T3vR67d+Gv7m qF2DC1SLs5qNtpmwZGSDAqymTlMbrQHLy8totVou2q9WqznTsCbaamqC5sGpv8nXV2xTHHRQaMkZ wDHSs/eF+2ux129961uo1+t43/vePkEGKemcAL1eD7du3cK5c+dmXpx+u4F2o4nXRlOMBgNMRmPk iwVMAfT7PUwGr0/OlQmwsrKCWq2G4XiMyWCE7VdvYf3BB2fMF/qh/VodldYRrn4QNVkxhLfVamFn ZwdBcOh/4JQH3W4X+Xwe29vbx0xbdlSn5jHgyA/ASDkmwdoAAs0z8QlPCmXFomaTeULDh/thloki hSQj6ah9ARwjn6jzRZ0zinQWabPVtqPuUdwAwKe1W82B7VUzW6VSwXQ6dXP9lMtll8/D55wDGj0m CShKw/ZdZxx8/tS4/a0mzfcrl8uh1+vhu9/9LprNJrbf/X+Ef231f/i+J56UdE4AahMf+MAHsLOz g0ajgevXr2PcqyGXySKcTJCdAkAATEMEwWHYdK56aF6pN5uHIbq9PnJBBuPRCK17e+i/7kxWwa5R V8yQV9JRTQSYjWADjhzgNIN1Oh0Ah34JOq+5rw2X1evld6lUcuY6aiZBcFTeX4sxWsGmbfIJG995 fcIoCouQzv0gG99xfSPieftGkYjNhYk7XxSxx2k6vm10uU/YxgnypPBpHcBssiufS5one72e8+sx n0cJh+9MXGmns0SUWdHCkg7fm4ODAzz33HO4dflnwk9+8pO4fOPHv2/JJyWdE4Alz7/5zW+i3W6j UqmgWq2ifS+H6RSYToB8roBc7nUNaDzCeDzFMBMCIYBpiG5/iFJhgHKugOk4RBBO8fLLLx9z1qoj 3Wde0gddzTxqJmGFgslk4l5QRlCRlJgvAcS/LPxNIcD2Wjs7t1HtRtfNM2n5BO88Urnfms6iRJVE I4la79t33vGiCCcJ8dh1vv+Eks087WERzSJqmZrxptOpq/3W7/fd3ES1Ws0lKXMgpu2lb8VHntYM lgRJtRs7qOKHg0ANbhmPx7h79y5+4zd+Az/6o78Wfgh/7/uSeFLSOQHu3buHixcvYnt7G+12G6VS 6XDkUiwAQYBxOEXGjdCAIJdFLsijO+qjmM8jkw+QzeYQZDLI5F43BUymGAz6M+fhw8igBH1AfVFa wOyoUZeRGHgsJQBGfWmGOfezx6WjV+3vakPX3zrSJGnFCThLqqcR2kmxyD6n1aQWbX/c9mepqfl8 Mouam3xtizJDxWk2PmFN8FmiOQ049KeySOl0elQJnP+jznUSLGpWs1DfEttI6wVz6Vhn77Of/Sz2 nvzfwo985CNYef7p7yvyCfqff/TNbsObjnuPfj5keZJ+v+/KnTSbTVcFt9/v4+DgALu7u+h0Oq6E CU1Ww+EQw/4A2SBAIcgin3k90S0MMQmnGE0nGAUhskEGmE6Ry2SxvrKKpUoVmddf8r3BoenLCmZi nlCKG6n5XmZLED6oEKI5gyNOzefg8TTcV4kKwDFnroVG/EVd41lhUUIDFtekTnKOedsn1Xb42/f8 RBGMrdWmgxsdPGhhW30GfOHX87QXX9ujiIfnnEwmbkI65myxWOrS0hJqtZrLiyI5cUBkj619Mk/T iTP1+q7TR8ZsA8PhdQDHsOogOLRO9Ho9bG1t4ZOf/CS+n0rofN+STv09Xwp7vR663a4L4d3e3kan 08H+/r4jjYODAzQaDaytrTk1nI544MhxzuX1et1F8/T7fWdbLhaLOGg1UczmUMhkkUGATAhMA2AS TjE2IbHIBM4coKOdOGhUWpRfBIgWLvQB0cmvpi+a2Oxx9MNQXzWr0dHLKC4NGdccnjAMnQ8oicnl LDSFJFhkn7MgjUW3X2TQYZfHfUeRjhIGgBlyiYo+tKQT58+z509yPYRGAbLaByMle72eC9Evl8uo VqsuwZbP6f0kHR/sNnznfIVvwzB0mg6tEktLS+j3+8jn83j66afx1FNPYfnbH/6eJ5/vOdLZf9cX Q86XXq/XUa/XXQ2sRqOB4XCITqfjJpHSh5OjNABOCNbrdezu7uLcuXO4ePGiK1OuDnvaX4PgMNER AJrNJvL5PNrt9pENuVxAIcgiGwLT4euTdGWzyOSyCLIZTAaH1YSnCDGeThAGAUaT1wVzPof82J+1 Tcwbac8T5izVQqHBTHcShM+8YYUeR2kkaBIYE185IRiPqb4fX5uSmCt828Zd5yLbnMaMtEg7zoIQ 9f4n6YsorWce6dhPEtLhcrYzjljiCMnXdkJ9M6rxcBmnvJ5Op6jVaqjVam5AxHadxP+k57f7+NZH Pa+c/oBt50CTbWRwgfYlE5DH4zHe+c534qMf/Sguvfpj39PE86aTzv67vhjSLtvr9dDr9dBoNJx5 q9lsotFouHU2nFcfYPtQ+P5rmQo+FJyo6vLlyygUCq6sPKsv53I5NyukjSrjbIgcZdGZznpfvhDO RaAPrvo8TiLE7H4+wZR0X9//eS/lov8tThIocD9x0nuw6HGTaju+35Zo7DIlCFvGxvoNfblVulz3 1WNEkZ2Fz/zq0+j1W2UBNWvKCiaXsqitLxBH+0OfX9+7GrW/PU6S9VHBOjbwQPs8DEOcO3cOH/7w h/H+4X/9PUs895V0Go9/Odzb28O9e/fQbDZx9+5ddDod1Ot1l+jFaXM5Kmanc7SsAltj7a0AjhoZ 2f+8eXzAM5mMy1Xp9Xq4cOECqtWqmzcGgKs+zFGV1gOjFsQHXsu/L1q2ZJ7N+LSkEzf6Tbp/3P95 +5yWdBY51/3AoqR6WpyUtKO+rabk02i4TsnFJosmJR3r17GEY9sfJdRthJySjn6izG3VahWVSmVu /84btJ4F6cSdw+YS2X5cWlrCwcEBVldX8dRTT+GHf/iHvyenxj7T6LVvL/92uLe3hxs3buDWrVvY +73/1WUQA3BqpJpd6OegfyPqRlszjVWVuV7/25FF1OiCvoZ6vY6DgwNXm4z+CPorfMfRBDY6NoEj p6zPfhuFeVpHVP5MUvjMM2ehMUUtO2tNZ95L/0Yhqt3zNLEk7U/SJ/PIJmpZ1PnmkUHc+ZP81v/z 3gUfEUQNKO35aLbiJHOtVstN55HJHE4jcT+xiCUjiVWGyxhoQJN+vV7HF77wBWxvb+OZZ/4gfOjO X/+eIp5TaTo3Ln86fPnll/HCCy/gtddecyaoKEeZlnHhQ64jFOuY1GNQgOuLEed/0OWEkoeSA//3 +33s7e1hdXUVKysrzr9DkhwMBsc0HW0/1wNHJUyo1ttIrzgsIoznEVXcPnbfJC9NEiG46LZJ230S 8+T9hG33SX1uccdM2rfztBzbPp9GEhW5dlJNR49pz+u7Bh/B+ExqUUE0QRDMVMoYDAbOx5PP57Gy suLtyziz2jyTW9S2SeDz2fquTQc1rOfH/2tra3j/+9+PZ7I//T1DPAuTzo3Lnw6/+c1v4oUXXsD2 9vbMSEIFMDDffGM7VRO4dL3aNPnfHkcf2KgHRx132k5uUygUcPfuXXS7XWxtbaFcLruHlhEz6tdR /xIAZ2qzZjb2z6JaxaICZx6iHJ2n0XqsNpm0XSfVsJK25X4ganCT9Lwn8UmdhNCjvuNIBzgKJOC2 PoKx4dN2Gx7bEpiPeOyzE6XR8Nt+fNuqjOB7zne1WCyemGCizhm1/zxEtT8Kel+CIHCVP4bDIdbX 1/Hoo4/iYx/7GDZe+thbnnwSmdfuPfr58NatW/iDP/gDtFr/9LCM/+szKGocP+ETRPTJKOxDaYsI 6jE0Ak2TDO057DJ7Pt+Dy+N3Oh1sbGxgNBqh2WyiVCrNZPnbNh/rzNenMdAaafpiLoKzJpyo4yyi Kc3zOd1vTWRe++436Zz2fKcl9Xnr5pGOb3v7XEf9ts99kt9x/3V7vl+L9o/uFwSBqwKuMoJmew4a fc9pnKyI+n8/EPV+8TfnFZpMJmg2myiXy24SyT/7sz/D3t4ePvzh3w6faP6Xb2niiSWd2+/4o/Db 3/42/vzXfg0vvPACyuWyMyHR0U9wmT4EFLyqEfiIRtedZjShmo6PlPT4dgQVBEfT9S4vL6PRaGB/ f98la9kaZ1HkQ/+O+q2SEs4iBHBaAXZSLSfJCDtpG99okjgrnBXxJzm2LpunacXd36hjRhFKkn3j fse1x0dEUccAZsnFp+lodJ3OPurz+6icsd+nxUkGbXHWAbtNqVTCcDhEGIbO79xut52/6urVqzg4 OMDNH/rl8BMrP/uWfbm85rWbV/4w/JM/+RN87Wtfw507d5xZiuajMAzd5GPsGKvtAMdVeH1gdDlw pG3Me+niXjA9lkJfVube2ONy/+FwiGKxiLt376LdbuPSpUvI5/M4ODiYab+v2CaPySxp9hNfgnnk E3ft9jqi+ifJ8aO+kxB+UoGbRBCfZGR7lsdbFPOu/yT397TbJxlIxGkh80KmNWEUwKnMa1HkFnVd dmCoMkQjQ5V02Ea2dzQauZQGW1vQWjvmmbzOKpAliaZl17F9mowNwGl2k8kElUrFya/HH38cTz/9 NC5e/6tvOfKZIZ2XNn4vfO655/Dcc89hd3fX3XjN0Pc5G238vtqGkwiqpELvrF5qn7bDb1Vht7e3 MZlMsLq6ikwm4yo0U4thUiSrK3OSJj4Equ1oiXarLfGB8pH2Itd3Wp/DaYX2SdvHZXHmuyQ4i+ix ONj7Zn/Pg6/ckM8kHNU/8+5rXG07u8znr7GkoeVuLLnaAAMu953D127f5ySDJv2tkwTGTc+hfa3/ rRyK+o46ju8akmg3Z2W205lmAWBrawtPP/003mrz9DjS+a1X/6fwy1/+MhqNBtrttrtROmL3JYdp 2LMdHQHfe6QTBEcRMGEYol6vYzAYYHV11Wk2amIkuWiGP3BUh0z9OlboWC3GN2o9yfW9Uduf9fnm PSun1XROu79PqOt+8/afJ3SSDBbilvkIR9upPtMobUT3t+86BZpdZ7WcqONT04i61iT9z/6yZKLa T5Qmo0hqxl90/zhiinuWz4p4MpmMm5GWA+innnoKP778379liCcHAP/sL/6b8M/+7A/RarXchF/W Zqo31S4H/Df6rHEW5pV5D1Mul3PXX6lUXOIopzDQUZkWzASORwdZ06EdGer5o9q+iCA/qYZzVkgi 9JO28c2+Fh+SkksUfFpN1Hr+nzcQiduf+/A4cSYvAMeCgXxakDVx64c+3ijSUXmh7Y3TJHzXpya2 KE3G9pfVQnwDgDhtK6ls8R1jES1u3vHjoIVD8/k8crkcWq0W/vzP/xx33/GPwo9//ONviRI6ua/m fz389Kf/ZxfLTr8NAOe3CcPDCcT4W6Edqg/ASV7M0wqW05Ad201TGSeKKpfLWFtbw+7u7rH54X2l +PUFUFMb1X0lqHlCRo+bBG9FQa1YVJN7K7dfcZLn3SeIbAULHpvL7KAmSfv03YwqKMv22/NbMqBQ s5qGT5j7tNjhcOg9Ln+fNOOfpObz1UY9c0m0S2tyi7vHSQjNnuesB+ckfpbv4ky+/X4fL7/8Mtrt Nt73vn8R/sj0776pL1bu2WefdezYbDZnSs/Ql6O5LRZ0kqsGoA+ijrTeKogbYbEoXxAcTulcLpdR qVRQLBbR6/WQy+XcKIL11eyLFvWwaz+pKcDufxri8W2bdN/7paFaRLUv7iW9H+dddH3cc5zkGY8S aIQ1H5+EyOxv7VOajX1ajgpBEpz6dYIgmKkSrh8dYfuO72uLr91JfHJx78oiz+88Tceun/fMJtVm kmpWJ0E+n0e323X3iq6RYrGIXC6H11577bDC/g//7+HTTz+N1ReeeVOEcm4wGGBvbw+VSsXZAikU da4HHdlzPb/jorPeaoQTBz4A1PQKhYIzta2treHevXsu1p+ZwczJ8b3w9mWiOUD7Kopovlf67Cxw Vs/IaY/xZmjaSbQEHbTwv28/PrdRSGJe43/rs/HtO8+UzvvqE9BJBloWNN9F+UN8SeNxbfOdN2rg GGU6s/sm1XiiyC0OSQZFzFWifKLM6XQ6qFarmEwmeO6557Czs4OPf/z/C99x+yfecEET/OEf/mH4 cz/3c1haWppxfFPjoZCk+c1GqzFiQgMK7ORO+pDx/0wjEr7sZyGY4rQc/uaIkFMBjEYjFItF1Ot1 dDodBEHg6jhp0AG/ox4gO9LUlzwKJxnJnVRTut+azknu+2k0PIuzsKsnPVbc8aOE5ry2zNMElZR8 moz6XHxEQg0/inh8ZKXvuQYQ+d79qAK4SQWv5gXqexZFIL5+i1unpBEnH6L29+2j606qlSXdhzKa VhhOY8L7Oh6PkcvlUKlUMJ1OUa1W8cwzz+CNNrcF/c8/ip/93U+EX/nKV1wJ8DA8Kp5JW3ChUHAj dBseTdIhUb1VSWfeA8Lrpm9HC35ynph79+5hNBphaWlpZuY/O0GUNZsFQTAToKEk7WvfSa73fpun Tot5ZJjEzr7o8e8nFhUc8wQYByUK+97E9Q2jwyxh2OfQko6GPOtxdT1JyR5n3jvu02SirmHe/VtU aM8jbvvfkl8cAc3771tn23Oa5ycKQRA4awzluboMgMPnROX5k08+ib++8XNv2MsT9D//KL4S/vPw 53/+592DY7N5oxLCVLPhyF2nJLAPNxDfcfNsuvNw2jwMLV8DHJEHNUB+t1otDAYDVCoVl59DcvZp PCpMSVDA8YTa017/aUfyvpdajznP5+CbbmIRQTFPUM27v76owCRChb99++tvey2++xt3/32BJ/pR c9S8PJp53/O2VzLR95zfdj3fb1+77f5R5z3t8z3v+Z13fAYaEEk0zqj1vm3nPZ9JSWbRdllEkTpJ RmVzPp9HqVRCsVjET/7kT+LKzU/cd/JxeTp/719+KLx+/ToGg4FrEPNPOKK3xGNJRzUd1XasGSmq E99s0rEJZbqMy8fjMfr9vqs9x/ps/z97bxYrWXZdia0bc8SLiDfny+Hl+CqzWEWKakkUKImUxKJI yU3LsmC7DY9qw+gW4A9/9If90YBhN9B2A+5PwzDghgUYnXgTdgAAIABJREFUsi1D/hH0IQimJFIg SIgWySKpYqkqa8ihcqh88xTzcP0RtU7su2Ofe29EvJdZJXsDgYi4w5nPXnvvs88+PFkUiK8fwYsM RjIWn6aT1vwwDaj46h/3jma+aaRZeU2nn2YyyWeSjvPWh+VpU6dVP3nf0jTkc0nvJ7WLNA/xugU6 1j2ZjpW2L984QEr6aIHRd7KoBSpW+ead30mUNL6nMZUlvW+lN+37s+aVRD7QkTyH13O5HAqFAgqF AgaDAb72ta/hp5v/4bkCTw4AvtX/n8KlpT9GoVBAu912BWNDEoD0QNObzfR/YMxoOYDlxIqzgVr0 PNYcrA7Tk7dUKrkAofoIWj5jfQPjiSePRtDPaErzzFnSNGAiv6UkyX7WoBFn4pQmXSuNJKFCHqlh fVvjJw4U9X0p6VtE7y4fU47TdNKQD0R8ZfaBlq98up+t/76yphkj89J5zn/L/JWmHNPysFkpTdmm 4aP8UJimA8If//Ef495P/fPwS1/60rl5t+X+dun/Cv/Vv/gXbjd9Pp+PeK0B0WNkJSOQBZcbSPVA 9pk49L0kepGgw/z5v1AouFNP6ROvY8fpSaclDQk8PvOc/J8k6c/bPr59ILL8PkCwyGKyuqzyW8ex k/eBSfOIJut+EpOU9+WOeesZqalY2oQ1ziXpvVlWG5PiADKtUBAHUhbo+N5LupZGOPm40LymK/me NR/OiqbljdOQ5t1cvyZv+uEPf4iDgwN89at/Gp6HuS33Z3/2Zzg6OsKzZ8+wuLjo/Lt7vZ5jgpTm daF1BXwf+R5gM/fzBpS0xM6W37wu3cSz2awLK95sNlGv1xM370lAlm7UZLZJ5ok0ZZ/nvs/llN+W 00OSyUKSdunVz2vzli5vknlGLpbGMUT53wJC333LO0w+M82aUxL5tIo4wJFmEwsU437revmAJa68 STTvHJ+3DLOYd9NQ2nSmbaPzBB5ZHvLpZrOJbDaLer2OZ8+e4Q//8A/xi7/4r8JfxD8+U+DJ7e/v o1QquXhrDG6pbeHaxCO1Gv62djSTwSZt7PokkTyrg+s7GpjjSE9kdjpNmPIZyUiSJP2zdETwmal8 94FkTSSJ4kA3CIJETc/nqcVPnOYFxGsXQJRpyfnAca7DwGjGLkHVMpkmaTLS4mDd1+2XBmT0t0+j SSKLWWrB7eNEVl8nMXjfXDhLcJA8wfo/L0lrjS+/o6Mj5PN5DAYDfP3rX8eTT/+z8N++/F+fWSfm Ll++jO9973sIggC7u7vI5/Mol8tuMyjXYmh+80l5ZIraVGQNYinVfxwHpI+4biPLXCqVEIYh2u22 1/wi35f3JTOUDgx60vL5pIE3r/dMktbCHee6Xj6mp3/HMT5gsn00JY0Vi5HzulUfK5ZgXNpJ/asZ rM5TrlnpMmrmHte+acBDpmm1v87DyjPu2TiKG8Pz0DTj96zT1s9YQsd50rTAP02akmc3m03k83kU i0Vndrt37x7+l8N/Ev7mb/4mNt7/tbkrmltaWnKBLI+Pj1Gv11GpVFzYfkqY7XYbhUIhor1Qw9EV kCTXh6QkKt9JS2mZzlmQJdUQdKi5DYejI3ABYH9/f6IttEsq09NmRi2JS3urLAcXqn0U530FpAOl OEk6bqE8CWR0+ta7PnMsv5M0OT0GdVp6R7u+bzkyyLQtoJH/Zfra/Mzy+9KOAyyr/kllieuXpN++ NH0g4hOQzpohn5V5zqe1z5r/WWsjTPN5LDlwfIbhaBllcXERnU4HBwcHqFarKBQKLhD07//+7+O1 1/7X8Oe6/3CuDs1dvXrVDYxarYZnz56hVqthcXERvV7PuU1b54vr+GFsKPmRoCO9i4DoxOAmTN0g kuKYgsU0dDq+juQ1aQKUe2k0uMoNtFzfWV1dxe7uLmq1GsrlckRrkXn7JrU2aVp19EU/SJpEOj+9 B0S6tse957uu28ynpcQFnJTv63RnFU70e3HmtThQSZsHx7rUiDqdjjtxl1sJuN8rk8k4oaXdbrtF 3SAI3IZruVl5mn0wlpbjKzu/rX04wCToybnO/3L+adJjOQ7UzpPm3VKRhr/MQ0lmuyShMIms/pH9 nMlk0Gw2AQDFYhG9Xs+NZ+LAn/7pn+KDT//z8Mtf/jLqP/mlmSqcq1arqFarqFQqzpZ3cHCAXC6H hYUFt14RN6g0WUwxLYNMky5JD3zfmoKW/tKo6fLDU0L18dxaE1lYWECz2XS/WR6G00lak7DKLOtN BiWv+QDYSitpc1/SmkdcGYH5A1b63kubzqzgNOs7+v1CoeDAgWbYtbU1XLp0CXt7e3j48CE2Nzfx +c9/Hpubmzg9PUWz2XTjqNPpoNPpYHd3F8+ePcPp6alLr1wuRzTZOIaTVsNJ8z9tW3wc6LxBa1rh Lul9Tdac19qkfjaub6clmYcUBMnHGInl7t27aDab+JVfmc27LVer1bCysoKLFy9iZ2cHYRji6OgI hUIBly9fdpshrd3aWn32gYxvPw/TmKZR9Du6o+I6IUmTko4RlnlCh7HRaSwtLeHg4AD9ft/5vbP+ aQA76Zk0oOWTKtOAbdIAtkwlSe/MwsTOE3TmYbJJ7w+HQzSbTVSrVdy4cQPXrl3D9evXUalU8PWv fx3f/OY38eUvfxmf+9zn3DhZX193ANXv9/G3f/u3KBQKuHXrFg4ODrC9vY1ms4mTkxOUy+WpGE9a TWeaZ+dtvxdJ84LCrM+mJS1Ey3zSzK2zqJ9lzeJ3LpfD8fExSqUS7t27h4ODA3zhC/9b+Pda/9FU gyCXz+dRr9dx9epVPH361MUWazQaOD09dWfqSPOPRl9Ls5GmFum9Jv9b5gBZcZ/arc1WpLSahC6z 1oQ0g5YAI8NI6HoymN7Ozg5arVbEdMINpWnJqt+0oOt73/dfH0us09D7kHT6af7HkU/9T0tpNTNf GacBZYvCcOT9eefOHWxtbSGfz6Pb7WJ/fx9//dd/7Y4P+aM/+iO8+eabuHXrFvr9Pl5//XWsra3h pZdewp/8yZ8gm83iZ37mZ1AoFLCysoJLly7hgw8+iHg3WvXRwJFG4/HVyQKhuPqfBfichaR+nqTb b1pNZ9o8rPkcR/PW3+IV5FmM4bawsIAwHJ2NtL29jW984xs4+Hv/Q/ha6T9PXdBcJpNxg3trawv7 +/vIZDJotVrY3d3FpUuXnH1PF8jSdLQbdRBED1eSmo5vrcXX8Jb0Lt/xrYuQZBgPCZC8Rk80kg7k qeug3cRzuRyq1Sq63S6ePXuGZrPpwuTo8lqUNGi0JhaXhjUhksxfSdLUvKCQREla0zTvz5J+2vfj +mk4HB1n/vTpU+zt7aHRaCAMQzx9+tQdBvjGG2/g/v37yOfz2N3dxd27d7G1teXGCw/e6na7qFar bv5pl3BfnTTgTKPtWNfOUrA4T0qyFMzLlK3NvecJdNOmP6/QZOUnlYhsNouDgwNkMhnUajXk83ns 7Ozgu9/9LrZv/lfhl7/8Zay/+1riYMgVi0UXX+3mzZu4f/8+er0e2u02Tk5OsLa2hlKpZLrLak2H 2otchJfXNOjwGaajO9XXEFYD6vUi6x3NrOU7QRDg9PTUlUmGAZLXpLZCB4tCoYBcLofDw0N0u12U y2VUq1WcnJwgCAIsLCw4phFH1qCQ5bPczC0G4DMz+kDbYqZpGcs0mlZaOi+mlqbd0rzve5aHaO3u 7qLb7WIwGDjzdKVSwcrKCo6OjjAcDvHyyy9jZWUF9+7di3h3/uzP/iyWlpawtLSEZrOJ4+NjPHr0 yAWYnQZ09O+45+PS8LXFxwVszorS1Mc3l+S150VJlotpiXWR2ze0cN1oNFAul9FqtXB0dIRyuYxe r4cf/ehHaDab+Nmf/d/DpNhtueW3fjkoFP5xSFv07du3XRTlfr+Pg4MDXLx40XkwyMpZDM5natMa jg9IZpEe4pip/E13Zwkeci9SpVIBEI3+zHcIMGQkdCQA4Lz8wnC0Xyefz2N5edkd/S33OMVRkiTt Mx9aAGzdp8YphYU4LdO6FnffYmLyf9p+fR6gM0s+SdolT5I9OTnB8fExarUaqtUq1tfXce3aNQwG A9RqNfzSL/0SLl68iHfeeQff/OY38corr+ArX/kKVldX8ezZMzx58gT7+/vY2dnB9va2M9ulie3n 01KsuqZ5Nm3ffhIoqaxJ49NnRYhbd5mVZinLvPlLgJGeyeR1p6enWF1dRavVwrNnz1CpVBzPq9Vq eOONN9DpdND+mfgjsXMA3NkKg8EAV69exd27d3F4eIjhcIiDgwOsrq66qAW64hbyS2bm+/CdpMbz mZKs9+S+GOkSLDUsuR4joz1zM6zUZPr9vjvylRunZBllOhKcqN0MBgPs7Ozg9PQUy8vLiTv2fZJ0 3ACcZqDpKMeakgJeJjGcJPPdtOr/tJNomufn0cA0WPN3NptFpVJBqVTC0dERWq0W2u22m6AAcHp6 ikwmg8PDQxweHuLWrVtYXV3FD3/4Q3S7XRwdHeH4+Nh5Sy4tLSEIgkgUc1mWpGuz/PfVe95nzpvm NS8lUdoo4/NSEqhZvC8Mk72L0+zTk1HwtbZTKBSwu7uLIAhccOh+v49CoYDt7W0HPA8ePMAHP/ff hF/84hdx8d5XJholaH/jJfwf9/5pePfuXXB95/79+/jWt76Fg4MDFItFlEol3Lp1y7l0kqkzPhs3 jQKTZ3GQETOYKBk8z+3OZEaHvw0Gg8hCtpTqpMZQq9Uc8+TCaiaTwcnJCYbDIWq1GhYWFhwoEEwY T053nly34ZqObGz5X4OY7KThcIher4dSqeS8/SqVCnZ3d93+HQYFpcbS7/fdaazUkCKd4xnEaZlG Wg0oKR15fx5gOG+mMAtzPG+gkiTHlJwjem2ReU0LImlByXdfu9Tr39Z78l5S7EHf9bTt6jMb83cS U/Vp3HFMfd41lbi6xaWdRuiMEwit95KUAHmemP6MhGv/aa0jXhu4k0uHwyFu3LiB3/qt38Irh/8g Ujin6QTBaCG83W7jypUruHr1qnPrpMtmpVLBYDBw9mqCCc1uMvSN1nYAuGjM2WzWgYA0XQ2HQ5TL ZZTL5ciaCrWJ09NTNBoNt1uW2sNwOHRrKGEYOu2EprMwDN2R0xI0ZEfIztMaGAdzq9WKaFK6Q/Xp qmEYolKpoFwu4+joCBcuXIjUiyCrNxT6BlHSIEt6P23as6SZhuZ9f97Yci+aOG4kwEzTp9Yzadt0 2vGirRiWwKEpiUHPu49rVgae9jltadAWh7Sgdhb301o6JEnzuS+duA/f94HOcBi/JaPfH2FDpVJB oVDAe++9h9/7vd/Da6/99+HXlv9LV7kcAKf6M4FqtYo7d+7g8ePH2N7eRqFQwM7ODjY3N91JmfII VIKHXrewzG+8NhgM3Il1BIRKpYJer4ejoyOnRdHRIQxDbG1t4enTp3j//fdx7949vPTSS9jc3EQQ BGg2m25C09xFxi7LYy2SacT3kdZ0tERIF1mCWxiONonSo+n09NSFGLKCN04DNBbzmUbSmkfinPbZ ed6Z5v1ppNJ5yzILWVqC1JotU/K0oOTLJ819LTBK8pm59TNML87sNI+2aeU3TTqWtuPTgHSalqPT NOY1H2+U6fi+k+4B/ogl+n2598Zn2dGAQ9Cx8h2Po9H1o6Mjd6rys2fP8Od//ufY+ex/Ef7DO/8y AATo0ExUKpVwcnKCS5cu4eWXX8be3h5yuRwODg7AjaQyGBwldXlqow9dqQnwk81m0e/38fDhQ2Qy Gayvr7tQIfl8PqKqdbtdvPfee3j8+DEODw9dqB6mLb3IKFFJySQIArTb7YnGovTJelgMgdcYCkjW UT4vY9VRIyyVSqhWq7hw4QIePHgAAKjX68jlcs5OL02VcWCQxER8jGGea/O+M+uz50Efh/L7mPo8 4HKWZDHDtKCVVLZ5wcYnWPnKGZe/lVZcGCfAf8ggf/vC5Mgy6vvytwQNCzj0NetemvtpQMf6H4Y2 OI/bYOQo0+v1cHx8jIWFBRQKBRwcHODb3/428vl/Gv4HN/+7IAfASePUDOieefPmTbzzzjvY29tD GIbY2dlBrVZzLtTSK0u6R/sagKYw6SLa6XRweHiIdruNw8NDrK6uYnV11S22djodZ4o7OjpCEAS4 dOkSLl26hGq1GllgpVeZPAxNAgtjolkNpgeH9eHxD3r/jk6DbdHv99FqtZDP51GtVlGv11006nq9 7tKS5fSVSWtC1gSehgmk1ZR8dFagJSkp/6T78wLIeYOiNV70OE1bjrRAMC1gJD0fR+e9j2te0hqN /p9mS4PWBjUzl6T5oPQI47d8RprHLNDwgY6lYVr39fVJULE9j8dljgdVWnS4ZNJsNtHtdt1a9je/ +U189rP/Z5gDgFqt5hgzN6R1u10sLi7i9u3b2N7edhrQ8fGx0yqazWYk3EsSE6XJiw4AvV4PuVwO V65cQRCM9slks1kXDYEglsvlUC6Xsba2hoWFhUgQznK5jEKhgNPTU3cWkJW3bFCCBt2fJfLHdZiO yqC1ovGC28AFc6TGk8/nce3aNTx48ADNZtPZPRnokW1I8k3WtBJyElOdReo8b0Y9b1qzvP88NR0y Ks2stEAxTRnSakhpBAJLy5fvWnlNI+D4mH3auscJHWnS0PNZp5mUhj4O3QcKMl3Nd3zvW+X0gUvc dauuaYDL9370nm3WI+XzeTQaDeRyOZRKpcgYarfb6HQ6eO+99+BAR67PVKtVnJ6eolgs4ubNm7h7 9y6Oj4+RzWaxv7+Pcrk8sTZBlNYhbmThZcTcMAxxcnKCQqGAer2OQqGAzc1NF24hDEfmOK6PMMop NYhareaYNk1zrVbLpU9QkYE55aS3Oke6NFuTSksqOi164QVBEIl+QJArlUpYWVnB/v4+Tk9PUa/X 3RpZGpCZRZOYhhGdNwP+OEq9zztP+fGNI0nTMEX93LTajg9cpm0rXWYfo9fgMy3pciWlo+dv3HsW I06riej//I4TaiV/5LP6GalJWaCl7+vf1n1fm9kgmvwOvXHJw7lEQoez/f39EeiUy2Xk83mngXQ6 HQAjb7Tl5WVcu3YNr7/+OorFIk5PT3F6eupcl8nICQr8byEqzXHUXqSaSo846ZAwGAzQbDady/Te 3h6uXbvmAs/xdDvZYdrsJQGA3mfS4UG+w/r4OkVOSp8Uwf0VYRg6VZMbaw8PD7G4uIhut4udnR3k 83nUajUHjEkgwLZKS9NqS7NO/ri8JCWlPwuoTpP+PGmfBemxJ60COtqFfMdXr/Mos0/bSfNemvbX Ap++Fkdx4z9N/kkBf+MW4n3z3WL+ce+nfdcyfSWBmiZ93Qe6JN2GPtCR9+Q7PL6D1wE4p7MgGB2d s7a2NgKdlbd/JchkfiekLW4wGKBYLLqglZ/5zGdw//59HB4eIpPJuLWdWq3mNrL1+30HJJqhk6j9 SHdrNt5wOAQyI7c7lqPfHzjNoVguOabODUkEJjL1XC7nwsu32238xm/8Bl555RXcv38f169fx4cf foi//Mu/xIMHD5ymxv1DXDeixifPPGGHybUoK+o2MHYbZx1Z3yAIXDlXVlbQbDbRaDScuVACsGV+ kPf1QLEGQtyA0umkZWrzgoIvNl5asDhPYKDgcp4k+5XjSObvez7JHMX/Vvklc/KtueixoJmPBZL8 tp7X6fo0Lquscf9lGeKYuX5fM3L/+/41kThhmh85vi1QiFvT0cASByoWEFFo9pUNkPuwfNodP3be +XzW8Wo9PjieCexUYuicls/n8eqrr+KLX/wi3OaQSqWCw8NDlygBZDAYoFKp4Pbt2/j+97/vEn72 7BlKpRIqlQr29vawsLDgzGYWc2S6kinLhiCTHvQH6A97Yw+27KgcGI5CgTx58gQbGxvOCYEecdyg Sg8y6exAR4mLFy/i4sWLODg4cPHlmA+BwRoEmkHozkgrsXFQdrtdrK2t4eDgAHt7e9jY2HDSwDzm sLTmtSRNJ8kcMytZjInf1pg5a3rR5j1ZR6utp+0//W5SmpJxTtMWeg5oLSitRh230C7/+6Rt/YwP QHzfaUBHpq2ZtixDGpCwQDDu+TgLSlK7AIgEZZZtb3nz8hn5oabnExi63W7EUkWeTmtTLjfW4hnN pVAo4NKlS9jc3MRv//ZvY/mtXw4c6CwuLuLg4MAlxML2+32USiW8+uqrePDgAXZ3dwGMfLGPjo6w vr4ecTnWBZWNRK1ErnuwMYbDIYbdHvLZLLKFkR2Q9kGu86ysrOD4+Bjtdtu5LzNSQaFQiKh2rVYL 3/nOd/CTn/zEmbna7TZOT09RKBRQqVTQ6XQioXBkJ2sktxiG1fFxJE0o9Lzb2dlBo9FwcYxk2vOY x2YBJB8TOSvQSZP3edKLBh1gso+m6TMLTKw6ybHj63cLOOIAkJK8lY9vHuh55Ftz0Pd9zDlO05Bp nhXoWHXQ78r7Pi3M1irSmcZ8z6WdP1rTsdqNfc+IKFKbkR9pkZF8M5fLIZvNotUaORE0Gg3UajW8 +uqrqFaruHnzJr761a+6kDgOdBjjSW6mJJCEYYjl5WW3bycMR67VNLMtLS3h6Ogosq6i102YHhf3 5R4caj2DXh/FfAGl4sjzYTgYYjD4KB7acBRYbnV1FTs7OwiC0amMDB+Ty+UcuBCsms2muyZNZ8Ph 0Hne6bUl3RFpOp6dkoapheHIQaLT6aBaraLf72N3dxdXrlyJ7HWyJn0cU5gGVJKupX03bVqkNJL4 PPSiQSVN+S3NI+3/acnSnDXIpNFYSL41J0lJjD/umsXs02gaafNICzoyD/mMTxPR6fiu++afBi2d Bn/7ggbzmi9igq8s1F6ZrjyZVqYr+Zxcb5eBj7kkc+vWLVy9ehVra2suYkwul8PJyQkufpSuA516 ve4eoJcYgIgnwp07d/D222/j6dOnyGQyODo6wsHBAa5fv+7C+MuKWtoBnQLK5bIDCnn++2AwcIHk aOYjMPT7fVSrVRweHjrvL71uQi2HB6qxDAS6QqHgyqElICtEiZZk2FHy/jREaYMHItXrdRfksV6v e7XEJEnUupYEXL500qY3C/nqkBaw56Gk9+et3zTvx0mm8n5aTcinBcnrVmy0NIKCJSxYZdbvpNVA LE3BJ5GnBaVZvq19KGk1kbhnkyhuzstnrIgIwLjdZCgtnzBhtRn5mtycbgmD0jKUzWZRr9exsrKC CxcuYHFxES+9dAvD4RALCwvY39/Ho0ePUKlU0G638d3vfhe/+7v/d3j5wa8HEU2HASipDchgnNy3 c+fOHRweHrqIywcHB7hw4QLq9TqazaY5CCRRNSOosNKZTAZhAHR6XQR9Ed8sEyAMgBCjqAPdbhcX LlzA7u4u9vf3ceHCBedtRwcE6RQg98zQLCeRGhjFnuOZNzp8vDUAtFakn4+r+0gNbaFQKDgwv3z5 Mh49euQOfCPIyrzSgExaUPE9My9TT6K4NkoaN8+D0mpq86afpv3jNBRfWj7g8aWp89T/dZ9Yjg++ 5y3Q0bHB9DNJLsFptImke0kaii+vNM+cZWy2tAKMb8xY7edbkyMRdKj9aM1qfX0dlUoF9Xod9Xod 1WoV5XIZpVIJuVwO29vbODk5QbfbRRAE7ih2Hm39V3/1V/i3LglNZ3FxMSLps8DSjtfv9/HSSy/h gw8+wPvvv49isYhGo4EnT57g2rVr6HQ6EXOZllKoSdG8VSwWXeUGgwHCTAZAiCxdqjMZ9MMQg+EI OIKP3O+q1apDUC5WAXC7/7kDlmtB3KwkF9QYgp6ASrMcMLkJjB3ExTM9QabRegiw1CCBkRPH4uKi c4yQxy9Y6c8CLGnfm4eS6u/zXntedNb1nTb9pICXSTv6Lek1TZ3iTGB6nFvXfdpXEsik0WR8/3VZ 9W9fPeNAxSq//E4Svizp33ffuq7fmVczjnvf0moZYozr5bQi8Vn+5jNyryGAyCGCPK6aLtEjS1Po Qt/k83l0Oh28/vrr+PGPf4xXX30V77//PiBBhwHaZCaSsVJC55ntT548wXA4RLvdxu7urvMo06Al SYbJabVabpMpGXAm99GaRgD0Bn30OyObIRf+w2HoYvuUy2UMBgPs7e3hwoULrtGoTRQKBQdm0lTI srGxGC1gZWUFrVbLaUCyHhL9CWbSJDcN6LDs7XYbYRi6yA6XLl3CvXv3JqJNx2k6ckD5/strSZK0 JRWeNaPW+UyrLc6b94tMP6mvpgElC3zSSu+SyVvz1LoX91+DSlwZ4vJP0hS0oCe/5W8fqFix06Jl 9Wt9aUhqEhb5hEaS5V0mSYOA1ljI8wgmFMC5NUR/JJ+mIM1vhvCSoKLryjwoKJc/2tZSKpWwt7eH b3/723jnnXfQ7/fRaDRc7EvH4S689+WgUPidkCYfVkYy7lwuh1arhU9/+tN48uQJ3n77bRcy58GD B3j55ZedesVjTDudDhYWFpxG0mw2Ua/XcXJygr29PRSLRRdANBwMP9KI+u6Ihc3NTQyHQywvL6O2 UMfG+iqazVP8xV/+BQ6HHQyCAMenJ1hZXkMQdCNITJAbDocuErZk+t1uF/V6HZlMBtvb286s1W63 sbi46Mxfm5ubzpy4tLTk1pHoDce4caVSaWKAafWWse1YTmo7p6enuH79Ou7du4d+v+/MhmEYOqkh TWwoa7CmNf0lpe8LiJhW6p5GOrTIkjQt84EvrzSSctoy6IkPjG3j8nqSWSyp7XySuk8zkPf17yCw I66PF9jtDYljUJgsU1KbpnuW9UrSFHNGXT9KIQgwGGjvWYLA6BlufuczYcj2oek7Gvk9k4kCWloQ 0l3JNAcDjo/Joy2CIECvN3DaiAQHah10kJLAIjUSXU7nFTwcYjjso9sdR2qRZ5SRv8v2kRYrmRfz GP3OIJOB++RyOezv7+P+/fv4yU9+4oT6xcVFBEGAO3fujNKTjVMqlSYinVrSbqFQwM2bN7G3t4fj 42NkMhmcnp7i8PDQaSDNZtMhLZlst9uNbD4NggDaC8NAAAAgAElEQVSNRiNyrgwdAjY2NvALv/AL WF9fd6fRrS6v4fr1q1ioL2B5ZQ3d3gDNdmu85yaDyLEG2psOGG1a4gJYGI6PHmi329jb20Mmk8Hy 8jI2NjZcPeiezXdarRZKpRKWl5cxHA7d/iauLbFjfMxZS5e83mq1sLS0hFarhcPDQ1SrVbdGRbOk fmcamlfSTzL/zEvzAtA0aVn3faAbpz1GmVS6hXpd9jgtxWLaFqBYIKSvadCIAg4QhnaYl3EZ7Pbx SfBpNC55TR/HrtPT419aGcg/LMmd6cvNk3Z5x+u5llAhY0zGaYrWu0EQuA3tBA4CDJ/j4ZP6MD0J QGE4PrqF2oiMaSlBRa6dS94q07b4FMvG8czf3A9JRYEOZ4wa88Ybb2Bvbw8nJydOSOaWm3q9jldf fRU4UaBTrVbRaDQiaCc7iJXOZrPY2trChx9+iJ/85CcIglHonO3tbVy/ft0dbU31i4ybpjKenzMc DnFycoJisejAKgxHpq9ms4mDgwPkcjnHdHd3t/Fnf/Hn6PS6o1NN80XkO3202ic4yhxhdXHk9q0P lQPg0mGDkqFz/YdaXLvdxmAwwOHhIVqtFprNJprNpmP+PHvo+PgYu7u7LnyPNOOxvXyDkQNfd/Zg MHDHXDebTdfBHAhx6T0PmkWDkjStuSINaU1DXreetf5bTMK6H5dWEmkGG6eJ+QAkKXZX0m79ft9v /qKmY+Vvgc40oK3vazOYjzQ4aE1W74yXz0uGbQl7nH9RU5PtKMHf0mGJ2oZ8nwAi106stRFdNl6n yZ0aCL9ZT1o+NKjq8SR/yzySDoqUPEm3HQDnmHV0dIR2u+2iqtAMJ5cdVldXMRgMUC6X8VM/9VP4 /Oc/j8+c/HsBYIDOkydPIuqa1Bj4fzAYoFqt4tq1a3j06JGLgyaPJpAgwrS44E/kJRI2Gg137AAX uI6Pj/Gtb30LpVIJvV5vdObPoIdmr4+gUEAOOeSDIjZWL6BYLOLuw/dQLZVdHDkZYYAfmgqPj48j jSTXaQiI7HQCYy6XcyY0ams0v7F95OYq3fnAZOwnOQDZqcDoqIkwDNFoNADAndg6LdOfFySmTTeJ iSTln958YYPBPGsi1m/9Py2TTKOB6HtAckDIuI98X5dn/H60nybbIN5bTJoPtdAUp9mTtGeoT6Pw 5S8prSlVto/OTz47EqbHx7RIaZ/Ml+Z3S1PJZDIuKorvIwMSS1DhGrLufwkqvvaK01gkuPn6RF6j 5kLexrJRazo+Pnbl0loUy00ngvX1daysrODGjRvY3NzEpz71KaA1ym8CdOQZOVRZ+c0C0v53+fJl XL16FT/60Y9QKpWcU8HS0hKWlpawt7eHXq/nwIb7cli5bDaLUqnkduTThMRTRDlIGSctHHZRrleR K1cRdIHT/WOg1UV2IYe1i2s4PDwEANf5XC/hb4bM4XECbDipztJ9OgxHC2KM5cZJxsFCjU9ucPVt riLJzZ964LB9+v2+02729/fR6XRcmHDfYIkjH1OdhSztbJo0k55NkpR1OklML005NPORJPspjSaR BAo+EIm7lwRe1nUf6TUTzcT0+z5w913XYKbHi954rtOwLAEWKMvrsl98jFgzaoIFQYXXy+WiNx1g bG2g4E3mrDURaf4iw7b6xuIPWkuR7UE+6usPyxGDICeBTJvgWD56H/O+FMpZL5kGPX7JJ1dWVlCr 1VCv17G2tobV1VVcuXIFpVIJ6+vrwMNRmSKgs7y8HOlw2diS8WazWfR6PdTrddy4cQPvvfeeO/mS 4XFWV1cdwy4UChFkJCiMPB5Gi/onJyfY2NhAq9XC6empU18Jcu12G/nMAIOwiGa7hfWFdVy8soJs r4WjwQnKC2UcHR64eGrsQLnplPt15KZTmtgAOADqdDpotVpuDYqDnL956ifBl+lJSc5Sn7X3jHyW ZaQHXiaTQbVaRbvddmElkrxbNE0LMvNqTvOCirbppymDL31LYtf7RDQleU+l3Wfik1STNJ20961n 05Cl6chxGoZJ3lNR84x+ztJkJPBY/Z/W4418x5pXJPILad6S2ohcCJfAOP4MIqChGS9BRS7QkxFb PJP/5VYMn6YiifNf3+t2u5EyyzaT4418ifsVadWRZZV18Ak42nFIanQ8EXl5edmBzdLSktv+QR4/ HA5RrVZx5eFvuIpERtHKyop57LTMlAyW1y5evIhbt27h3XffRRCM1nZkMNBms+kKz30oUkXLZrNY WFhwjJ5ozo6jtlIoFPDpT30Ky1tb6GSKWMrXcaO0hMV8Fj9474f4xo++7eKZ0WOOA0Huz+ER2dRW eDKpjAQtB7GeNOz4IAgcwnMzFDUU3WYkqXnxW96nVsmy0UTJwaNtsjr9ae5ZlFbT8KWdlF8SqExb Xs2kfKDA/z5NZZpva5Jb96yPltx1+pIRWnWcBmBssrcy+MoReVMxQKtcPs3TAiWL6ZI5c85qRwHt zSUXu2U+VttzwZuSP3mAXDfJ5eKD+lqAIctstZd8h89abQ7AlUNqIFoj0YAn11H0/kIfoFj1A+CA miYytjF/Ly0toVgsun2SpVLJffL5vFu3J8/n3sjr168Dz8b5RLiYPCPHakCCACUHxg+7ceMGHj58 6DSDg4MDLC8v48qVKw4EuA7CuGPSFkiX6qdPn2JzczMSFJTmpfX1dXzta/8aerVFPGt10dvt4MFb DxC0T3DQOUC+mENuoYidnR2EYegAgNoDO5SHpklAoisiMA7KSe+6TqcTObIhk8m4TaWyQ1lma7D7 GI2erDQ/MmQPy8ajGqrVaqRPNCVdm5dpJdmG59Vk0u7T8E0cq/11O/uAQVLSRI3Lw5e2FjB0uiyf RRI0NWOfJj1pHpJtMmaOUZCwBKc4QNSuu/p9monleoj0zNI74rUJjETeIYFDgorWVKRZSJZH5jHi EV0T5DQo+vpHCrdSsNbaBUGPwqSMX6aBRF7X+cWNPf6W9ZGWHTopEWAymYw7GJMgwrbne9JVm+0i rTftdhsLCwvOgsX9kree/VZkIEZA5/KDXw+Gw38/pPkIGK8z0MTGDaT5fN55W1y6dAm3b9/G66+/ 7s6mefjwIarVKur1ugvbXy6XnYrKhqDkUa1W3RqG7GhqJru7u/jO//M99Ho9HB8fY2/3AKenpx+t o3y0KbWYQ71eR6PRQLPZxPLysnOnLpfLDnQ4mOgpRmBrNpuo1WqRQVGtVrGysoLd3V1Uq1VsbW3h zTffxN7enjMN0mQn13SsyScZj/bkkQOb60RBEDiX7sPDQ+TzeVSrVYRh6ACe6UphIY4x+a7pslrf aZmk/5nJ02SjEyRJs/AzfV1GS8qTE0ROat7XNnX9W5uCxmUDqEV8VGt3jdWXzTB+TgNb1Ow6/m1v OgxDfW3SUUW+NxzK8UmNYrTHIggA8jWfVD8cDiL/gyCqiegd7Zb3lqXhkCgMDod99HrRvSRyLVY6 /vj6X5Z9NN/toxlG7TBq+1KpFElLuinrsWKZ2KTJXWtRUhPRayUkufYin2FZ9ZoYrxEQqFkUCgUH HsVi0QEIgUD2i1zPlkcb6HZk/VlGGa6LH/LYSqXi1nxefvll4CA6HifsNdzUKRtbdgIzHw/EIcrl Mq5fv4779+/j6OjIAdXu7q6LdCCZJEl2ZBCMzFXHx8cIgsAxfw7mbreLb3zjG+M1lmHw0RpNORIQ lBVuNBrOy65Wqzltiq7PBBvGaFtZWcHP/dzP4cc//jFu3ryJ9fV1fOMb30AQBPj5n/95PH78GNvb 2+70O5aT5sKTkxPU63VXrzSkpRRqhBx01HTo4n16egpgpJGWSiXXsewPn/eWJbFaZJkIJFlrUpK0 d97kc9ExpUFhMOhF3p3UNCYPybI0CZ+mos1hOh+aTn1kOYLIOsozRuT3ZD0myeo//Y4PDEhxa35B MDb/+srBMCcsi+5/3z4TPst9LBIUZIQPlk9K7xTwuGYi6yq1AwpWsv66jHp/i24DS9OWbSGBRJaV 5aWQLb26tKOArr8FKrqPZJtzbyOFTxlVgAI/NQ5qLLxPTVK2jTRRyvN2WDdZflp3ZNtwjPuEBqkN MkRZGI7WpK5cuYKNjY1k0KnX6+7oALoY68HHtZEgCJzJ7NKlS9ja2sIPfvADBzpPnjzBysqK82TT nSwBLJPJoFwu4+joCKenpygWi15TXy5bQLaQRT5fdKEfhsMRYDIIHUGIkQcYUUDuNQJGvvFcl9nc 3MS7776Lw8NDN8H29vbw/e9/H48ePcLJyQk+/PBDF9JB7qFZXFw0j7uV30nmI3aWnDBUUcvlMp49 e+YiOtBMSa2I7+q2kqSZpo+h+ZhknPcWED1EynqG1feBAkHH135yn4hPI0l73yIJJiQ9CWX59W/L vMc0LE1RE9cGfUxDv6//yzBW0uVXCoh6XcRaO9EmLV1faSaiqTwMQ3OhXYKG3PEu0+VHakR6HgDR KO/8SJrUBKNl6Xa7TqCTgCEB0jJzSQcovZYigYX1k+1L8JB9QsDgJkupicgQNtotW3vB6baSa8Za 4OF1/Y50ukoanz6wkaZRbnEplUq4efMmlt/65QlJdwJ0lpaW8PTp04lzZlhpKUVQa6CE/tJLL+H9 99/H0dER8vk89vb2sLu7i7W1NRegU09sTgROmoWFBefNtrS0BGA0GUfSfU1MvnFFRxLwqEPoC09P vGaziVarNWHPlRJCr9fD7u4u/uAP/sCp8R988IFbh7p7966TOKhtUJWlGY4mNtnB+rdcdNQfDlqW iWmxc4fDIVZXV3F4eOg8AqX0aEmmmiRo+Bm7n+nLhXqfxhCnSUjMtTWA+H0mNO/4KGnSWPctULHe 0Yxfzw0yTd0O8t0kocM2/wSRuaIBRQJENjsphWow0doR60hmHIZhZMOzNBFJjUWbuYBxaH0fOPo0 Zz4jnYgs4l4+Pq81Ss59uW5ieW5Z76b53Ww2IwyXi+7sA24453oJzVt8xlqzkusjXIaQ9WM9gMlD 2OT4stpXX5PjT68PxpF+zgIfmve4hLGxsYHrT/51MwMTdOhVZqGfngA0fQ2HQywtLWFraws//OEP Xfy13d1d7OzsYHV1NSIVaSbJAUi7KiUTPjcYDES0hJG2MpIIim5C5/PZyIZKaghUQ09PT92kajQa bpJQIxoOh6jX65HQPawz24KDjWf+cKJwXUh3kvVbTnz5W0t3EuwHgwGWlpZwcnKCZrMZOU4cQASo SJam4pPWfd96ksu0kwDLp6lY743qbIPG+Lnp1pXSTiqmaXkH2uUYpx8nuet3NYBpUJEgIQGF1+V+ LQ0oQPQMe73eEIbjzcYEGOkZpZ+VzFbXXQOZNG8n1U+m4WtDS5sARvvWJCOWZbfASPeDBhL9nFws 52I6NRUutFN7IZhI0JHjx5oHUmhhPSiIh2HoNFWrvenEFTf+kua/Bnk9R+PGv8WXNOjQEYoezXhk pzWRy/Ly8sQgIFMnEJHZ0QYppYatrS08fPgQjx8/Rq1Ww9HREe7du+eYuexsXQEONtqWO52O69xG o4FiMY9sNv/RwmeAMPyI6YaZj7zUxh1PzxBODGC0+ZUmQ9rv2RHSW45oTUkmk8k4UCHwLCwsuDaS ZxDpDpLfmjnrCU3NipOfg1lORB4Hm8vlnEu1ljh1XiTL/CV/W+WzJKq4531pj963yzaelElmsPg1 p1mvk3T/6d/WPgv5jBSmLLOV9oLU2gjNtRbDpiRMwJDBGjle+v1uhKFam/ssYvtLl39dR2Byc6eu f1qXYMsNWJfbMmFpQI3THC2mSCsCF9n5kcChnSB0+H/WSYNjGE7GXtRtoAUG6e0HIKLpyGctc6cu i3zH13864Kkcf3FtaLWlNP1Jh4RSqYTNzU1cffT3vZPNBB3dyAQZmqJ4nxVmoXq9njvo7fj42MVM Ozw8xNOnT3Hx4sWI+5/UIKTph+lpiSwIAuTz7KwsgCEyQQ5BAAcM+kgDqc0QONlgsrO4fsTFNKlJ SBdmeqXQvEbpkW7UVse5xhZrVJYkKes7YiLjE1WDIHBmy4ODA8fgLC8ekh6cPqbje15fSyIfE2Aa HDNp8rdIzw1dXjme4tOxF+Op3cpJJp9LWqiVmxMl6LB8PkmYJL2zrICNBB3fR+8z0aRdfnU7cHxY WpR8Xo9Z/m80GhFQkeYtjmetRWlQ8jHqIBhFf5cMj0En2d7lctmBiwxMKRfadb/LOuq5Sc9XObZ0 W2iy2k2/J3mcvC/Nn7qd2D8+gQSw90HJ+zpMly6ffl6nJQFGgzK1whs3buDmzZvAm2bzADBAhyFn pFcUG4EdwUUyMmDu3aGkvrW1hfv37+Pdd991mzSfPn2Ka9euuTMVdIXZyAwIyoW7MBzZahnpedQJ ARgRNp8be7VksnAu11KDYR7SFVwuqkttiOsz/E3GQjs3tQseic22YiSEOMbtq7v8zw7X0hw1KR4r fnx8HNG8rEVanYfFjH2Tw3o2CVR9Eldcmr60rGvDYXz54kBXp6kBBYCL8isZmwQPralYC/WSkUjw oHlYSvNaU/HtxSDphXP9X0ZJttrPIr0gTNLltBbidWh8XXdtvmIbaQcDWRbN4KSmwWNFCCbUUuSi O+vMdKUWxfVYrZXL37I9pLCkNR0t/VtMnvnzHV9EBBK9hi2tSvIo3afMQ2qiWpgHEMmfpMviAxwp TMlv9lE2m0WlUsHNmzex+OYXYgfdBOhcvPeVoFD4T0NuUqQ0zQqVy2VXUUquMtBdJpNBpVLBpz71 KRwdHeHg4MBFmn7nnXdw69boHG2uS1CaZ5BNqaLSQYEaBgetlG5C9DAYfiShhZnI5NcDgWlIaYPE utIbTIackMyAi5XApGQWZzOV1+R/+a0X2uU367C3d4BabRHb29totTof7QIOEQTZRJflfn/MlMZM Vz4RTPyO5j8ZOyuaHyfYxK2P+mVyH1P0v73+NSZZv3gAHdUxChrS5dRaiOd7WpvhZxyzb4heb5Jx yoVszVgtJjcu52RfjH/L+ut1lej7mczYZVkyK63J8BkJfGE43mfi07RGwl5Uu/Kt+/gEHGoi1j4e Wg/k/aj0H3VkAkZ8SEZntsdV9LcPiLUgIv8DiGga8rpsDwIg20+no0FYjjHJa3hfer5pwVLXyzLv 6/aSfSOBVQsdLKMGGD6Ty+XcRlACzuc+97lIuBsfmStHpVIpYmqQjZBE1A42NzfxwQcfuH07g8EA Ozs7uHDhAsrlsvMoKxaLblFeN7iWoslAtOeFVH99De5DcEnWNaavJ5ZPUkrzjnxGfutDtvRvObgy mQxarZYTBnymM1kfS9KR5YyzkQP25kr5vrRRW+0v65dEmrmx/BI0pCaiJURLEpXOMVIC1uYfa11B v6MZrtXmuv5sX83M9Hs+kvtspAQtQU8vtMt+Yv1k3SzzrK+OwyFcO/Ijj1fnNgMtAUvgYB0tE57F zKV5DrA9rli+pDUlS7u15qm1XkThWpIUbuU12cbMj+BIwXp8xPNYg6hUKqjVai7YseSH3B6hyTeG fHzPuuZ7hqAnBQAALhROEATOceCVV17BtcdfSwYIeECHDgCyEFpC81E2OwqYubKygjt37uDx48fu PJ2joyNsb2/j1q1bbjc/o0tzgiQ1hsXYfZNc//c9G0dWveMAKO7bSlsSeaYvPzJRmh5brZZzuqAG KEkPMrkPxKq7BBWrrNqc46uPZl6kwWCsaUqgkANcg4rURLSGYPWvluIl06R5yLfQLr2vfHno/kg7 joAoaGrgB6JhamS52Ib03rI8z7SmYjFOvc+DebIOZKISTCRoVCrV2P6Jc2SZHAuDifEi97lYbRQE k/ufSGSAcUyW3rAsvwYfDSK0fLC8FhBJkvlbDhL7+/sT4W+ktl0ul7G2toa1tbWI0xPLouvlq6fv mpzfFh+Uwj77QXrwSc899s/y8jK2trbwyuE/SDcJ4AGdxcVFPHz4MFba1sRJz3A2rVYLly9fxrVr 1/D2228DGCEk9+0wgnKn03Euyhb5JBF530J3X6PqazovX/5kulab+Mqtf+s89fs+yVkSy84jIQBE NojGpa+DE2pGboGO/B3HVABEzAkWU5L7SCzQiQNnMlUJKvI7DEO3ZuYDfSl5yrbkf64byjx9dbXe 1zZ3Pc7oGUmGq01wNM/5QIVl8ZnurP6TZWHsPsseHwSjKCBx7SOPi9ZaKIDI5mjrk0S6jnq+DIeT QCXLaC20y7pIl2TdTiy/HmvcimAF69VjhPlLwYHXqYGSX3FJQtLu7i4ajQYajQZu3ryJpaUll2+l Upkogw985O+4a7qNJOhIcKamMxI8Km7tfm1tDa+++ipePfp3UwMO4AEdHsOstQNdYWsgUWLl5s7b t29jZ2cHT58+daa0R48e4fbt26jVatjf33eTUKu/etLqDrfUW6sxdaPKazpdCxgssNPkayf9jM7b uq9JDxy2MYBI9GnpHGGlN7nwHGUKPkmfxPTlwrMEDXnehz3xJxmR3BsizT9SotemHt/HZ97jNWme sPpArvmxfvK/ZZ6T7SyZjN7xTkamTXey/tpkphkbx7tkCNLEaIX2lwvxOlaWbgMKfpqZjn/bAVP5 3zeu5XizxpdvTsr2GI278T0f75Hv62eCYOzIYJkVub6sAYJ9KueXVX+5pYTv6XU/XUY5xrPZ0Wb7 vb09XLhwASsrK26bidQMLSDx/Y67rz8+0JHjCRgJr+Tt0wIOEAM6snFlI7HAVqdns1nnaUYb5sbG Bra2trC7u4vhcOTCvL29jaWlJVy+fBm5XM6Z3yybvCTN/JPQXA9oH9O3Bqd+J42kluSSrNOfzM++ z2u6PNykyoHp824hEVQkM5VmDLnmI4FFA50PVIBoBOBJl9/OxIT1LUST4piLNsFY7SuZly6vBZqy XBoUtCaiGRfNd7puzF+HSbLaUU94WUYdG00u8iYxfGAMKlIIs5wOdDvyWwtd1vM+wJTtYKVttYt+ ToOQHhu67bWQQocDDQQ6H9k+wHic+LQdktz7R14mPfu0y7IGI+7D63Q6kS0nw+HQWYSs9pHj2de2 HDO676zrcvxxA2wul3Pa1uLiIj772c9ia/vfnBpwAA/oLC0tRezLJIn81iBnx9Anng118+ZNPHv2 DO+//76TBj788EPU63UsLy+79+KkJT0xrGetztAAYqXvG+x6UMrNgdOQ7x2fFKLLKX/TDhyGISqV igtiysEpn9deWdJ7y3L1tEK3yzaQUqLl8svYW3xWM54gsE2hce1kSWc+sjRlSxKVmogERd9CO+vH 9CyNS7eVRYwJ6NNUdP9ol2xtvuLvOGHHYqzymjTJJX2y2ehCva530tzQa46arLJI6vXGmphVZgl6 lglSmt+0pxaAyEb3UX49t07Ds2LiiO9ROJNjilqMbCddP4bBkvOW9dLrXJbQp+/Lb8De3Kt5gBx3 3O9Et3QGNL5+/frMgAN4QKdSqTg10zcALGLnMBgmG3ppaQkvvfQSHj9+jE6ng3K5jNPTU+zs7OAz n/kMSqUSnjx5MqFJ6c6RoGMxIJ8EkMTYxpMqetpoHEDpfIFJ81XcJLTKNnJ9njQFyrwJOpR8B4MB SqVSZFew1lKs+mhpPAxDFybIZwLS+0g005GgZeXZ73cj71vA7mu7OMBhGjKkiHQm0Db1tJqIHvvW 5jupaRA0tGlLaiRWXSTTlP+1pqXbS7eV3qeh66DT120rj+bQ9dRp+sgHCNZ7uj8tRwf5LKeXVR7Z n7wmx34YjsPMyPel4CTjnAXByEW+2Wy6BX3pvWaNVaYtXYslbxgOxwFXmb/UmMngM5lRAOFyuezy 5548H+hY81x/W6ClTchyHUcHJS2Xy1heXsbly5eB+2Y3pSITdFbe/pWgXv/Pwv39fdeZPHJad6ok djoPSiP1ej3cvHkTDx8+xLvvvotms4lyuYy9vT289dZbuH37Nn76p38a9+/fR6/Xc7Hc2EGS2TJv qwP0dd3wSRqHzzylJTkfuGlNQ+eRZBbMZhHpeO09RNu8HDwbG+vumvaW6fe7E95ZWluRTM3SbmUd s1lZr0lpzdpHEYZjRmCtKVn9oMGQ12QYGA0orJP1Pj/WPgfrv0/TyOUKbm1Er5cEQTAhCev6jc1L 4UcfqOd9AWMBIIDcHBttY/fLzFe+H013Enyi5dXpREFJl1XHBvORLoP1W5cnDEdCmbw+7pexZqGZ qZWe1Gz1uMlms26c8EMgSBJeabFh/szH7SkUwsTYuWa8TsjzxjY3N7G6uurWmKytDvxvWSysNiJ/ lKCo12YlnyHQFAoFLCwsoFqtuqMrLt3/6sxaDuABHWAUp2xvby/SgJos4JGVk8+FYYhbt27h6dOn aLVayGRGIWR2d3dx/fp1tzDFY6vb7TZOT0/duTj0mLAa2if5WI3Oa9aahQYTTT71n21jSbLytzxA ztrHYLWxLIf0ftIb+4DJM9R1OS1JVn5bsZ9ku1qxm3T7x70vw7hYi7kaNLVLswYSnybuYw7cfMiJ rL23uPHZR7ncWNLV9bDAWtZd/7Yo6dlp7qe5lqS5WKCp55MUXs6SrD60HEXkfY4/370kl+ezJp0n AUgKKFw3AeAOntzY2EClUom4/EvzuVUvXWfZFiRro6f8cD4wOrYUrLiutLKyAjTmaxcv6CwvL+P+ /fsOGSX6+8iHrmyc69ev48GDBzg5OXEdcHJygp2dHdy+fdsx3mw2i5WVFayvr6Pdbrud4I1GIxLT SXrzUCLRk18ieFzZpZbke07uI5BniGtJQdvspfQFYIK58r+1IzzOvOVbDLX6BJgMPW+ZJQBMSPgk qvi67PJ9bdaS5dfmLZ23NG9pMAJsl2+pPRFU9AFX1EYoVco2lN96LGhti1HOfWNEMgWLoVlChc5X 1s93fxrScyEOcKx2sNKT7SO1Ta3JxpFPuPNJ60C8S3qcFiKFobSAOytpIUzOdXoPymellaJQKGBj YwNra2sIgiCiicUJpZaWI3mO1NLoAk4+q0Bd/d0AACAASURBVAVlaRqUFgKWf319/fxAZ21tLYLG LKSeGPo/K8qOlpM2m81ia2sLz549w4cffugiEzx69Aj379/HlStXEIYjL6FOp4NKpYJSqeQiOl++ fBnAeIGu0+k4UOKin2wsMmqq/ZKRWovpWhLQ5ix5sp6laWlGybw5WOQhV5YHVBJT0guBSeYqTXJN QoNKGI4PtrNMcFKil2BjuTxrZk2ipqPLqxmjVO/1We3sJ6mlyL7U/S/LIffxWNqTb01k/D25UOur R5r/mizQsfKZNj3r/yxlzuUyE1q2LGfS+JXPym/+loKf9aw0T2vtxgIW/p62nWYlX/+xfFJb4biV a400q4Vh6ATzIAjQ7XbNU221tUG2gdZi+IzlYEGi0M6YepnM+OjrbDaLWq02t2kNiAGdlZUVAPAy ED045H8JPHrSX7x4ETdu3MDBwYEzmzUaDbz11lvuDIuFhQU0Gg3s7Owgk8m44w0owZbLZdRqNVy4 cMExpSAIIpqCDEYqGb+PyMz425rsckc7dxTLDpRM2QKVJG0rSVKUjMJKR7pkWqYnS8uQ5ZcupVoL AaInY/pMXjpP2Z4yMKM8jpcTUAbclFok+9dXdtnncWXR5dJ9EjdGRuWyAypazFL3mf49C/nS8qWr r0vLA++nfXf07Nghw7dvZBaSDDEtmMhn4kiOgXnLmURyPElBVtaD3+SP/X4f2ewodtna2po7uqTX 60XiuGmtTgrPEnR4XxL/69NILQEbgNkPuVwOFy5cAE7mbycv6KyurrrwND5XYQt4WEnZKJzMg8EA xWIRN27cwO7uLt5//30Mh6Oza7a3t/Hd734XV69exaVLl1wwOaJ8s9l0mhYbhcyLSMzQ5rJRgeim QIKDBgWN/tZiu1xwtBga667bQE4qa2DyednZ1lqTpRHJctDxw2LKwKRZTzMdfTKknuQ8OVECgyyn Di1P2zABRp/XoseSBLXBYOAcSmRZ4r41c9J9pAUh/bE218o2YMBSn1BiMfBZgMbHaK3faUHDujdt GtJRwGrLNOY1H+PXdbYAUrtcW4w4Lt+4es8rEMh8ZHrSfCYtDRzj2WwWS0tLDnB0ODCOf2ma81lr JA/SazWa31jCIyP008IgtUueBnquoLP+7mtBqfQ7YbPZjDDbuI6V9y3GmsmMjghYXV3Fq6++ina7 jadPn7oO4DkxjUYD9Xod5XI5ElBQT/QwDJ3jgQV48jnmL9+X38DY/GStZwDj42J1GmnaBhgHbIyb KJLpRyP8Tnpt6f+aEWgtRJrJrPUgChd6FzLb/9KlSxHvLXnkNzVS2eZaG2I/WfeB5DUP3W8+wPeB hi9KrzTLWd/8LTUdmX5asElibHJ8+trCKqOuf5q84kDbl4YUinzAm0Q+QPWVT74j66nHrv6flG4S 4M5CFn/SJLWJfD6PxcVFrK2tYXFx0T0vTcZhGEbMyDIv/eF9qQHJdWZpieF8J0/TaznaI7BYLGL9 3dfORFWMPZ+3WCyi0+m4DYgskG5czeDlwOQ3G7TX62FhYQHXr1/H8fExDg8PcXh46CTik5MTnJ6e olKpYGlpCYuLi6hWqygUCm4iysnOhmUDkaxF3SSmZoVJkYOHkp6UJCxwlSSvSY3J2gcjzXeWeU4C kpw0EqRkffU3QSGbzbr2lme48zheeTCT1GYsTVAC4v7+/kS7SXCRFAcaPrImsmZOmhlrpirHkH7f 6jdZJitMkHxfj69pGZrvfR+A6fbwMXMtdKVlvPq6tDTo9RWfh6sm3WZW+az89RixLAVWn8WB6nmS FKb4nzyDFoVKpYL19XUsLi46E5ZsV8De8GnlReCwtEVLywMQAR9gvHYv2zoIRmbxSqVyZm0TCzo3 btzAd77zHdRqtQl3WU0afKjWAXALUwQILqjfvHkTCwsLuHv3Lh48eOBcqfP5PLrdLnZ2drC7u+tM NdR85BGzsjwSGOOkUL6jgcI6ZEnWT6avF9uZl2Wy438dJkUzZL1mos1gejDIAck1EbmxS3pv0fyo NRmZhgYUbd6SYUBk2TVDiAMGfS2JsUpKYmphGJ//qHjsV07EcT9H0w/Vt7/spLN2G57MI947rt8f by0AxgvD/X4vFhQ41H37hPg/SUNPKr+UxK10ZfkswdWXvgVkWjDwMV75vF5G0FoE04kTOjivtKAl Qajf76NareL69etYXl6OzCvdRlZ5dNnitE8pIMi0Jf9gOem8BYzGMteAut0utra2gPfMLpiaYkFn aWkpIh0mUZwkIRuIlaSdsFKpYGtrCz/+8Y9xdHSEk5OR4ZBSeL/fx+npKY6PjyOSOJkqAUh6m1lu v3ItSLsS8j6/9ScMQ7dPxqeJ+BbV9X0NRnKASn95aiIsL9dMdN1Zb3kcr0U6SjNPQ5VqN+A3YcmN bNZnWkY0DeDEpTe+H/9skiaSnH78GsC0mk1SPvpbH4KnGZOUdOUaAp9JmsdpzF5nQXqspNFCfJJ7 nNXFAqO49OclzfQ1aAXByA26UChgZWUlEmXA0mh8gBvXVrJdZJ1k28W9Z2mU5XIZF9778pmpibGg s7Gx4Ra3yHB0o1qdr0lOBDauZNr0WvviF7+InZ0dPHr0CDs7Ozg5OcHx8XHEjZZmpExmdES01lQk qLB8/GjvDQ2CGjQsE5KlobAM8jhqS9OSHiOsszRh1ev1COj4wqgwff1bn0FvaUq+D9+3+o2/40LX W/S8QQeYXMi22mlWwLCY9jTMKs2zvrYZ9ekgliFp85kUIiwTpyYfkz5vENJ5aHCxwNCn3fiYblzf nxVJfmKZH4GRBrG0tOQOs+RarN4OYX3r+mtKIzTJslhCI78ppARBgMXFxVmbxKRY0FlfX0exWHRH S8uO86mYuoKy0WWUY2AyHMVwOMT6+jouXLiAdruN3d1dPH36FAcHB+h2uxGHAcuVVgZMtMxn3Mej VVh7gk9qOprpaBWXYCGD5MkorQsLCxOajDyrwlqzkmXS+2S0aU+2fdzH8lzztYNvoieBTtwESAM6 SWnYz0+nyST9jyvPeTDnOE0kCMZRin3U6/Xc2NfrIz4PVEnTtsc8lCR1W1pNGnqRwEmhWpq0mDfL lc1msbi4iMXFRccTrTA302g5adpJ8k3d9lp45m+CztLSEnCauhkSKRZ0Vu/+alCr/aOQ5i6rcPK/ b9CSKdMZgNoDEA0DTsYKjExrly9fxtraGrrdLvr9Pvb39x34cEOoXnNgGhZj1TvyZfnZyFITYswl TuRyuezctK0d7zLMjQQ2aipWbDDGmpNl1Wa4tFqFdunWbSDNY1b7+ACFHy14yGetfrfGgX7Xet53 LYkmY4WlB5HR+8nmp7i6Tpuf777FcEaaZnfiuiQdsUEvSieBznmTxex8zE8Dj7x/VmVJEnqmJTlf 9Vwnf6lUKqjX68hms5E4bRQetXnQKrcPkGV/W+0n622NY+n9ymu5XO75gg4wikzw+PHjuTOSjF2H c6HELqUEglQ+n0epVMJwOMSFCxdcCBxuzpSSfqPRwHA43hgqN7GRwTNPlkmCBI+I1aAi3Qm1/ZXp hWEYMU/JzuXgspi6LI/FwKS2Jt/zaWAyDc1srPrL9GX5tekRiJpr4r6tsljXpwGdNIxBYob1fJIU nAQ6lsu9/D8v80qSdC2XWfmMdCLgvAqCICIspCFfG50FaPkEEAuMLMaahnzvWuB1lsAjXZDJwzTj X1pawsLCggvnpV2T44A5Dnw1P/GlYbW3j+h8dPXR3z9TaSURdNbX12OlE8B2UdT3gyBwGggngmTg w+FocxIZfBiGLuYatQVuXioWi27RXKqyKysrEwxZlkHvN5KmvzhVXzOlOO3Dx3x8EoakuIV8fZ/1 lM9o7yldJ6laW2s+cUzXJx2lvS/LMwvo+K5Jsoof9860jGbeNZ0k0v2l21Sv6en7PJqCGjeZIPs4 idG8SNOUrEtaTccCFZ2GTH8WAJu2DpL0ZmNuS6BzFPmP3j/mA42ksvvq7iOfJsV7XBI4a0oEnVqt 5iqRVtqxpHQATuLihkZqARKIrJA1UnKwTE4EDp0/f8cxP615WXXhR6ufTEuuUVmTR5Zflk9LJxpU 9G+90K+Ztl4g1OWx2kU+5ytfEtiQkpiyJZz40krKy6aM+ZwP3HzjIi1Ny8CSduxzfAH2IXinp43I mJUBIXk9m82iWq2iXC5H+pdeU9PSeTHptLwk7n3A75UVB1bnSVIr0Y4ddCCSAgEwEhalNhon1Euy xnMcYFvpaB4tiRGnz5oSQefOnTsTgGNJF9oEpMMzyElB4AmCAKVSybnvAlEnA2BSWpB5W5vJrOfi 1Grff32dgGfl5UvP56LrAxUrbw2uFiBY5bAAR75vaWs+TYftl+RSrScZ39V5Wm3iq3/c9UkQtc97 sdKzpbzof5+mKOstx7nPzDmmsTnUAg3pQi9/y/xZLmr/dKsf7dOqYXNzE8fHxzg5OfkojyHy+SIy mUnGo802SeZFed/HwNJc85EFHPLb96zFWK37Vh6WiVICtU5TP6/T5jjg2TP83el0sLq6GhEGZHRu Li9Y9R3/tw+XHJfFrtO4bP4QXMybFqgwHC0XbG1tAfdwppS8pvPOl4JK5d8J55VMSD5GEteZaSWV F/Vc0ns+cDprCcwHYBYw+UArrlyaCcQBr5VmUl6+ssddm6Y900qQvvc4B7SmTAcWgpL2LiS46POO tGBQKBQcmHDvmQQ1aiq+SBjZbN7lw3VEi2H+XaM4gVg/p5+x0koCOR9pnqUFPnrXSkGW32fNC3zl SkMU9CuVSuIZU7NQIugAo7N1dnd3vSfYSfKpuT4QkR0gP7oTzmrSpGVs86btk8Z970xTBh9oWNf1 /bj3k8xjSY4E0jwU975V32nAL+19TbOCjpWflFapqezs7EQ0F71WWCqVnFQpo0LogIzaXMz8tKYj y8F5xqM+wjB00vY4Pb+p85MGSBpcNCNPCyxptKlphBPNv5gXN2/LOfK8QEeWL+maHHtLS0tYfPML Zz4wUoHO+vo6tre3TVWSvy3SqimvyfskGeCOFZ9FCpbXkwZW0sBM++y0NGvaSaDl2+cT1x7WfetZ wA8aPtDS5U2677uuJylJT9akNZM4M4t1zSqHjELBd2iSuHPnTuR8J2otMvhiXFl89bTa1+rjwaDt ylYoFFAsFp0Ze9Q28Y4inxTyaTbTvJ9WyJkGjPW6sjS35XI5F1HEAp2zojiLkXzGpwXL38vLy0C6 E8inolSgs7GxgTfeeGOqSasHhZb6yDCsnbvy+vOmecBGS1yWtsbB6JPUpilnHHik0XSs3770rftW mdLet65ZG9ckxU0g3/04mkbz0eAuI3Lze3Fx0QVSZcgkyYh0bMCkTbqyfmReVl+w3DK+IfeYcV1i 5MV2fqbds6CkMqUxuUtmH5ePNT986aa1sshxKB2HALitH7ynw96cBfAkWaCCwDbNSt5LXsQjF7Az d7EmKBXoXLx40dkjNcVd0wOA+3C0+sl3rKB6+hn5X99PktT1vVmuJZGuu05LAo+8Nw/wzAI6cfVL ei+uPGmu+cgaS7KtfOCSdsLGaUzyO67MEmj4n2BwfHwcOWZCLgxzrcXKW48FPu9buOczmmnQoYDE tSSLqc2jKXxcaJ55Y11LO859pM1lbPcwDF1UEuajg22eJfnmiwU4vmuVSmWk6bwo0NnY2EC5XJ7Y PGiRryEtlU5OLMuuDZy9vfmswMUiXWb9beU5S90sjSRNHZIkOuu6lbavzHESu34vbf219mild9YM VI9hrY1JZsL7YTg+eVVrRXKcWwIBn9fmNz1f5NEb1jOZTG4iH31y5Vm20/OmuHlESqsNTTNvdLpp yyg1VO6dYn5SIDkrTSeJfEAjN8hzvbFer2P17q+eS6FSgc7aO18KSqV/FDYajakzsDrB0nTk/STy vZ9UjrO4noZ8gGMxz1mltRdBaTXdadKKA0Lr/3lOzqR+4H09ZjmJGfDVNzZ11HM93rXQpesq12d8 zFX+5nqStVH6kzDeLEoaA7qe1vW4d86qXeRcp3ZsXT9rikvTGnv6eQLPeXitkVKBDjA6vvr4+BiF QgHdbhe5XM4dP80NnfJkTQvBeUgR3UyBMeLrxVkrDpD+tqQV6xrLocPvSJpGA/J1mK67BhQZ+8wi HRtNl0HWzcdIrGgMUurlb5Y9mk8GQcDf4w+v9XrdiTSteut2moXiTEKyDHGakJVmHOl1RJ8mpY9N TktJjg5JY9IXZXx8bYBoFiHCcABW2xp2sm6Wx9xZMsYkEEjSYngtSQvVgq58Vo57i0/0ej0XxcHa OyPfp1YQhqFbT5OaDNMoFAqoVCoTke1ZnvHhgHpc+ce/NTd0GSUP9m1sl5pOGI5irXU6Hdy+fRt4 NNH8Z0KpQWdlZQXvvfdexFYNwGszTkOzSBhaSksj9aSZPHEg4vvvS9PSdOIYI5/xuSTr/JLS9OUh oxDL/SN8p9vte0EeiJ7nYpUvialOQ2n7LK48Sc///zSmj1vbTCME6md8loa06cxifUmiadNI0ljm LYf1LffnnEckAlJq0Ll8+fLEwiaZl7Uo5mN8SRoKf1sUh+4+SsPA01Jal1zfwJ9msFtt5WsjS+Ox 2iqTyThts9vtot1uq2i48fUPgnSg638//nld7rQaTFqaF5Q+box5HrLGv7427Rw5z/aZxzIx7TOk ac2QvvbivPMJh2nysDQ3fS/tu75vrhkuLS1h/d3Xzq0zU4POpUuXnCooB6VPTZYMUqqUJM1ArUGV VuJPIot5xV3z/U8yb8gyWZKWVWfrv/5YgUat2FyW+izLSpWfgMNjwwHGfypMvBtV6eG9f5bAkCat WQSQjztoPE/QiwP0ecHnLMpl/Z8VaEhxGo9v3E3Da2it0M8RdNKUK85qkcaioTUzOT/TfMIwxOrq amw956XUoHPx3leCSuU/DpvN5sTajQYYH/k6nUw0DgCs9yym7ss/jaaTxMi0SUunaW2e1HVM818D C9OlVqKDnsbVUxKPhWg2m+7UVXkGiw6dr9skDAfumh7MSXmnoTRSXJqJd5b5P096nvmfh6YzL00z lmcBoLS8wZpX05DFa+Q885ns5h3b0whruhz8zmQyI9A5nirrqSg16AAj1+m7d+9GguJZoU8syd4n EWvQ0mRJOkmDc1btx3pPpp0UBibNfQ3W8h0LdOQ7UuNJAh0N4Px0u123cVGeRBk3IS3mkxbsZyVr As4LQC8aVOalF63pPE9KCyrTgIO0Pli8JK7eaTUdi5I0nWnS8t1Lq+lbYCM/xWIRa2trHx/QuXr1 Ku7evesq2O/3USwWp4oeYDGPtIMpKR85MJIAxGKks8Qe871vDepZQEc+o9Oz8rImh9wrQm2JNmYZ SVe+Zml0FkDLiXzWTP+sn0+6P6uknJael8aQhs5D05m3fad5d1YASnpmHgHK1170cvMJSWnKHcfX 0o77pO9cLodKpYKN93/tXKWMqUBnbW3NmWHIxGTBNaOK00CSQMGitIPK10FJ0oA+r0bnaYFNnLYR 9532I4HKYvTyuu9cIKbVbrfd0dgEHQanHEli8WNNO1KchwScdlLNkvd5MsWzoPPWKNJIw9Zzad87 K0oDMHHvaEHoPDTxaSnOCclqb30/7t00aernrffO6/yciXymefjKlSvOtJbL5RyTZkA77Qsuz8Zh EEI+w41uPLfCMtP5SDNmeY2/9TWWI+l5mYfO0ypH3DWdrjUQdBnjpE2djr4nT4mU6TNIZavVAgD3 HKDPLxpG8tTfsujWZLbeOwsJLe3/pPeTxtdZuXzPwjSBye0HerzMypjk+3HPxZUzSSpPa8FIQ7Le 0wiicc9KK4Aes1qYk2nJk4x1WnI+yhBe3JtDK0KtVvvICYl7fgAgQBjKfoua8qy2SCsM6LoGQeDm PI/MAKKblQuFAtrt9mh/zoG3Gc+EptN03vlSUK//J2Gz2YxsKEoK1OgjS0tISzIv5i096yxgsgZz XBniNLU0EziOMes0tPaiyyvfsSYAgIg5joOJ/+NOR7XqGAcWVl3mNYUlSXvTvv9JJB8wx43D503T lCeuT866vySj5f+4PKQlQVsT5tWO9Lw4y/1rs9Ck8BjdNCqP2iiXyx8v0AFGzgTvvvtuJMSGFWoD 8A9Qn/ktLfmYswYSvdiupRhLE0nKN65u8rr+1pQ0qC2mnyRB6zpTk6Smk0RJ5ZFltsqXBEJJ1+a9 77v2ok0rpGnKEcfI50l3Hkoq0/MC/mksFPo9zX/kJ42gNS359uicByXN30wmahnRoFOr1VCv14En 51vOqUHn0qVLePvtt92mUGo6VggRSyK3Ol3eT0MW4ARBEIniKhm+T+PRjNQ6D0OSLySGD2wt4PG9 63snCbw06TpJaS7NwPeZHuS9pO+433HXpnn2kwQ201CctvOi62eNRd8YsMZ5Gk1+HkpKW8/DOCuI T2BNQ7LO2WxWHAE9e92mobiyao1O0srKCpbf+uVzH1RTg87Fixfdmd6W5G8xG+mhJSubVkKxnrGe t86wt0DHl4YVe8qiuInlI2odSWnxmg9Y456TmqeuR1rAkr+TQCQOdOLe892f9pq+7mMQZ8Wcn4cU D6Q3s70Iipvn1nO+96aZO5LitBzrOV0m654W0DhXGU9yWpLCbi6XE8dUT53UTHnH/ec1HUUmCAJc uHABaJ9/GacGnfX1dZRKJecFJddz4hgiO1RH2uW9JHMTn0v67wMYIHmhWGsySflaDI+/02oo02h4 Vp5ywujyW5M8bfpptRf5PYs06LuWlNbfRU3HV34fk0y6puksQMtKwzd348b+LFpP0jzytZcPoHx1 IcnjxGedo9R0XgT55ihNavJ/oVDAxsYG8OD8yzX9ms77vxZUq78bHh4eAhh7QkktwzcB2HE6NDuA VFLFtIxTX5vGpKPvp1HduW6iAcc3oXzXNID5QM5iUnri8f00e6ni2sEHQpa2O00e02hCSSameTWd 89Yk5gVl3/XnBa6WpUELPc9DG0vSduLmmzW3rPe5Zk3QmcYRR5YrukfnxY0vqd3I3wScSqWCyw9+ /bkMpJncKnjWN+BnwPKbZAUMBWbzYtNaDRmSdSARP7qMPiBKM+Hj3o8rs/U77f84Bh1Xjlm1qbRa j343LcOcVptJazqYJo9PAqURBp4nxY3jadr/PMtupa1jF1rxC/kuj/zm4Wuz5k2e9DwpaW7q8hUK hXM9P0fTTHrf7du38ejRIxexOJPJoNfrOTVSSyCSaelBKjcnyjD7knyD3MdM48xhcVJSnCkqzmyn tQrrtyarLayySOlRr6PpNSxKVjLqAM8pSgpZ5NMofOYzn2Axy7MWWcxLjw/dXtNMbl+fxN1Pm44v Xat/p8k/qX5xa4Zp8rQ8UFkWa63Qyj+pXePImufy2mAwQD6fn1jkz2Qy6Pf7yOfzLqagPLuLY4fH eeTzeeTzefR6vcg5OPyUy2VUKhUEQYBut4tWqxVJj3ViuvJdzj1qEoVCAcVi8aN80q0P+YB72vmj tRuWr1AofBTgN4disYhms4mXXnrp3F2lSTOBzsbGBnq9HorFIrrdLvL5vKtI2gE2i5QTBxjTgE9S +rP+j0vzeZhufKbNeUxe1v+4NM5C0j0rTSmOfCaYTzLFgYJkiGlJCxy6zeKYIfO05qxlmqPAxP+W gCiBQ6aRy+WQzWbR6/XQ7XYd0PT7fVdnyWzJjOMAdjAYpIoqr9tCX3vRe3RYDsusRq+6crk8cpX+ OIPO5cuXUSwW3cCQUpCWki07u+wMPRg187QGq++/priB4ruXBlh8z/gAxtK0NMn66rrLNtHAoq9r LcPSbNJK50nM3/c9DyVJc38XzWdnRbpvdT/rLQGatNAox1TSrnxgrGlZx2mHYei0FCu6utYY9IfP DgYDdLtdlw/XXgDg9PQUrVbL1UOWPwxDdDqdSPl0G1Drkaa1bDaLTqeDfr/vXXP2WS1koM/nMU59 QidJ8l0CNQDU6/Xntp4DzAg6i29+Idjc/CfhBx984Are6XRc1GJdec0sLXc9kpZyeE1+W9emBZ2k Z+bVnNIy9jhQ0EDkM9NooLf2Tfnyt/6nNY1Nm36avNM+M42pQZLVdp8USiprUp/r8ZRm/EoNJMmS oZmynpudTsdtVNZAIjcw++Z2uVxGGIbuSGnJT6iZSGCT5WA9+I6MsyhNZQDQ7XbR7Xa9QCvbUpIW tqW79PMmKYBqTUfeB4Dl5eXnWraZffleeeUVvP3226hUKpG1nCTpmM/MounIb9+1uP9xGkCa96ch 36S2tBj+99XdB9AW6fh3Whr1pWFpLWlAKKm/fe/FlSWJ5kkjrv1fNM1iwrHe94GzHhf6W7oGyzGn tQ5fmjKSOdcSZZ14pIYuh1x7SRJ4CA46JhrTlS7OdCYiyfiQBD7JjDOZDDqdDo6Pj9FsNlEul10U fZ/btG8u8Z1CoTBx/0WQZS1he62srDyX/TmkmUHn9u3bqNVq6HQ6yGazKBaLkY4kWcxXxm3jM3oD aZyZQF6bhlkkaS9xDNQHBtZ/3zUrzbjrPk0njqRUo+vm06zigGSafPW7Vlq+e0nX4yTzJLOCL480 ff9JImv9wGpzPcfkf0uat851YqBefgg28hgNpkGtRGoXScIQgUBrDwQMvfeFWlihUEAQBO4Z5s1r dHrSWhWACGDxwEN9YKUsfxyRocszq14EWfNXtm25XB5tCn34/Mo0M+isv/ta8NnP/rfhD37wA+cR ohmzHjDyv7UGlEbT8SF2HFnPxL1jSb8W8/SBTdL/pDwthjiNJiQBxprYaYA6Dmx8IHUWjDtOCyOl aff/r5Kl4Vpj37rf6/Xcda6XAHDAIt8l6NADTK/rAmPhkoxfmproECD3tpHk2JPjXoKdDC/D++Vy Gfl8Hv1+3637AJgAQOlhJvNkfQlo+XweuVwO3W53Yp1Ik8UfnmfcNYvkvBx9xutgBORarYYrD3/j uRZwrq2yn/3sZ/Hmm2/i9PQUnU4n82oZUgAAIABJREFU8cyI50U+iT6O2VqDycf85X++q59JAzRJ dbDej9OEeG2etk6rjcyS1izpxj03L9CkBeBPCiXtQ9HAoYFHrqtwPQIYgRG1AzJnuQeO79OrTH+Y 7/LysmtzMnKWVY9bS5CRoCO3a5A6nQ6CIIiY61g2Xmea8sPrrK88L4zamwWEccRnPg7ea5LYf/xU KpXnXoa5QOfmh/9GcOfOPwu/973vucGnO4d21Eaj4c7TAcZSkJRi+I78tsjSnIDkhVSdhszHGkRp tCPfM3FaEuur99n4yp8k0TNNOVkY/BSYPPHUVwef9mgxAItJ6Elt5aHzkemyHXwalKW56TR1OX1l sK5zvwfbUmqLZLJ6ncKSyHU545iVni9xRAmfrsEAHFCwvBI4OCf5fKlUcloJ85UmcZqEeJ3l6/V6 aDabbp8Mn83n86hWqygUChgOh2i1Wmi1Wm4RXnpIMU3mm81mUSqVEASB8w5LOkCs2+2i3W5H1mby +fzE3hiCHOcDAUqOJxkZn//lHJLrQXxfjhOpBbI+zIPp0PttPDblPjPyCTk+ELkmr4/SmDxEUY4Z aQqUjhasYy4XHb9hGI7Oz3kW2+xnTnMHBbp69SreeustF4uNqhs7sdfruU7RTOU8aR4p1gcucdpL HEOU7ycxTp22BgKfJmVJiZIBJpkEzorSgHfadzWAS6naetfSbtOWUaevhSFgvJHZKoNk2DIPH3Ba Hw1aetG93W47phgEQWSjJABnVuKhiOPoxqOytdttJ7lHmSEiTNYCeZqaCDpcM5Fl5jYKHhSW1F9y zYNmLAKANs3xefaDzIPP+iKpS61G1ssSpnT/Jo3duLlshft6nqTzltppEASo1Wqo1WqfPNC5ffs2 3nzzTdy9e9et68iJykkhjx2QWg4prZvveVKSZiP/J0nN1qBNAiZJlgQtJ4kFTGcJ6Ja2Ms27pDgA 11pVmvdku+r3kqKE+9YPSHpNwwIDvRYppWVLW9eakTU+JGjwHWne4TPc3AjA7XSnZpPL5dBoNNDr 9ZyZSQbjpTCoGbMEuV6v59pRmtDK5TIWFxfRaDQc0BDY9DqOBQTWXJA75SmQVqtV1ycWaEtNQmry EqTlR/eJBTpx4bz0fI0TZK0+lnuIngf5wF1+5FrY6uoq1t997bmj4tygs/zWLwd37vzP4f379yOh bOj5kc1mI8daA9EBd5bkY8Zpycfo0j6f9lkLfOLaghMkbX0sSdX3jP7vu56GfJqK/u3T2iSIxGkp sj1kvmn7zwIswD5PSeYlvZkk0NC8Ze0NsTQWWS55TQKMXJOR+0fITLnYLfOX7SHNZHyeWhA1H+1B Ko9Y5pzN5XIolUool8uRDZLSTC7LL9tU19saW9JjTG690OtR1roK24vvE0RYdx+gyPLoZ6w5PQuf oqbpi3xwXkTBSIONFPT5WVtbA6YLUnEmdCYxt+/cuYO/+Zu/wePHjwHA2XgpnQGTZgWpfp5lp1gM TP6fhtIwsVnLriV8Pbh90r/1bFzZ4vLQ6cdNrrQTL2254jQdH6hoN1cJxBYo63wlYPjKTAYnNzHy ww2I9LqiJ5R24dVlkXlaUrlMP67dqIlx7Uma+4ARQHAnPQNVkimXSiXs7OwAwISnmQV0kgnTkSBJ WJSeWnxXMnVZPz0WgyCIeJxpkuVhGWX/ANGjCLSmZ7WpHmNSk9JllN+ap8g25H+5pjUrcM1LEnA0 CBWLRayurgLbz71YZwM6a+98KfjUp/7H8IMPPnCx2KQKLlV66cN/HqBDmlfrsSjp/bg8kkBG5pFG 67HSkhNDgzyv6zL5yprmubj34gAgSdPx1VU/o5/Xmob+5n1p8pHt1mq13H2OWbmZkIvW7XYbvV7P ralwy4DMWzNIq57Wt2ZusnyMBEytREYAoITPxXi53kIGKPfRyH5g/gQt6QCQyWScA1BSP+k0pXDJ clhATLIEDTmmrIMj5doPwZGRDyTQDYdDVw/5sfLxAas1v311D4LguWs6Vj4aeIARONfr9ZGm80kF HQD4zGc+gzfeeAMPHz5Eu9123hz8SO8aCTra7vsiKUlLSgNcPgYdBxb8LyUt3wRPWwbN0KalOIk2 zbskK/80mo5mSmEYTixca0ClpOxjbHR2ke9wXNLDUjLqYrEY2WzINLlgrwUpbRLS+cu8LAmUwOVj viwX54/clCkZMEmWp9vtYmlpyT1LxwCWgRqcZJS6Pj6my/LJNtLrunResMYCSY4bS4CQ7SXNe3JM 9Pt9dDqdiPs0tQ2tBcUBjfVflzGpLjRh0sPteZIWWlhnRklYW1vD4ptfeCFeDmcGOqt3fzW4detf hh9++CFarZabrHIAa/NGnPR0FjSrdmNpSYAteVtAEpemTou/9TO+/KcBvThN77wmgU9743dSvpph S4Gk2Wy6a5rJA4iYuCymb2k4ZETD4dAtpAOY2E1OwYnP0S0YGLvNsn6S4ciFdW2C0+0Vp8XxGvP8 f9v79mA5srO+X8+dV8/zzn1IV6/VarWWtJLtrGwLu2z8AGOwSWKCKxgMMcaFKRMCFJVUhSQFpCjI H4Q/AqlUJThx4hROBVcoIAHK60qq7OzaxMbLvrXSane1klZ3tbrS1X3O+9H5Y+7vzNdfn+6e+76S 5quampl+nD59+vT3+96HTFlehz4XMlu5P5FIYHx83Jjl2I4sV9Nut81v+nRkhr6sraj7aNPMOA4S hPQcjxOQZHu263EsqInazIbaoiJBy0Z6jvJawwp7Nv62F4j3nUql+lWlm7vTjy1dR/Ud73gHnn76 aWOmaLVayGQyAAYvvEzuouRDQOJEtz10YHhgCpPG1nueJg0cPCeqf/pe1qM1yQk8zO9Eol/iI51O m3VFer1egFnofsiXl5Ku1FA189YMlu3JfAYtKXKbdDZzLvA69FloJ7oEoG636/NtcO7k83kfMNAh Tu1Imng1ILEtGeZPJisFJ34KhYIpPikjveQ9ay1GzoVwbWGgCdh4VSLhtxDIc2Upfo61/N/tdlGt VoONrhFBwRYMAMCXya/7zd/a3CfPD4tODZuTNpLvDME/m82a+Q70eQ7XidEaoNYkCb6JxGANKml5 YYQc+ZXUlrQ2xzFmBG8mkzHm0MFc5bF2oSPIK+ScARIJu8lP9iFMwyG/5fv9juZP7xoabino7L/8 Yef06d/2nnjiCTSbTbNAEB+Ejg4CwtXYsP9y+3ZoR+ulsH6sd/tW9QWAz3YvM6rjztX9kmaIqD5z n61UigQLydD5klK6tjFSIFi+ni88mSxfJpb0YD8ajYYBNF5fRnzp/kubfzabNcdLaVlqFbINzuGw cR5Gw9sK2uy80tFs6213o8KerZ047YaMlB9G3nE7n4cWWnTfJPO3gaLWXnhulJZne2/63+ubA+ud MzJow9YXoM8bpqen19XuVtOWgg4AnD17Fs8++yxu376NXC6HWq3mGwAtZcrtu62KDmP6CWPOewUA geAKjrbxJ2nThgYJ6WeSi2fJ58gPpUxKjhwvtgcMwoKlo1peR7ZNIrDkcjkkEgk0Gg3U63VfFFOj 0fD5dGRlAW7T0VHaoVwsFn1BMPLepB9GF4HUY237vRXze7Pnr3eODiNoDLt/mGtrk1fcOZyXOppN VrmWeTpa05HP3vYMbe+1nvNyuzxPRg/uFGk/l/4wkvjIkSPAyo51K0BbDjpH3/jbzsmTv+YtLS2h 2WyaqBmZwyMfWJQkbdN69OTYDWYfJoXZtkVpO/p7syTHV5qLtMSlw2K5XYKSrMTLtuNAhwBD56l0 HlMzoSSayWSQSCTQarVQq9WMycwmnGjNR4KCNNHa+qY1ErlfOngdx8H09LTPRCSjpcI0GQ1Mm6F4 Jru589dz/WFBIwpwo96FYd53faw0AUrBBoApj8PipNSgaWakMCQZsxZKou5Ra196jkmNgqBDTXlw 78MLDcNafMKOkfNWCkv5fB4HDx4EXhq6K1tOWw46APDOd74Tr7zyCmZnZ1Eul40EHMb4bBJBGOBo 5m5j9rtJUf2LApetAB4JOmSS9Xrdx8T1uOtxpoQoCzKybRvDlcT2tGmP5+tcD5lXQVCS/hEyBb7A LMNCh7lOirQtAmaTRqWUK6VdzlFd5FGCl+0ZyXbDxmYYimcsm5sf69GUbKARJvlrCns3487Vx+n9 fCYyP4cmtU6ng0wmYwQRabKV/mO2q98HKWDYeJEGFTlGbINuBAAmpF3yrGFoI2BjI/kM2Pd2u42Z mRlMvPSBXTUpbQvovOX2jzoPP/xr3o0bNwJmCm3isYUuSgob9N3QesLU8ChtRv/fLi1HX8fzPLMg lXSO8loMnbQl9EnQiBr/MMDidlnskRqvZF6UCAuFgo9JaN8OXxrmXzSbTaOJSWCUTEeGA7NNGVEp AY4RXwRabZoj2YIquH2zgLMVtFnzm01TixIGNUPVyaq6jThNRwcq6OPkteSYcx6FVVuQ7Ug/I7fL 6DebNsNrSAbOPkgznmxXBuTYQsVttFWAw3M57znXM5kMjh49CixsuNktoW0BHaC/7MHly5dx48YN ZDIZo+0AsD5M/t5Nirt+GEjslpnPRhJgmLMgHasS7KO0RckotCYRNU6MlnNd16fdyj4A/iq4kvHL 62vmwDBmaj8SoBzHMZUwqEXJ68kIJbYtQ4QBmGRPyWDkGOnxIm2Vth03/zZrXhtmfke1ZXPEy/+2 AI31tB8lfHIb5y2BRZq25NIL8pnYIiolgMhwbp7D8+Rc4DEysEUuta2raMs+7QR/kO+TBBxaCU6c OIFTC39/12O4tw10Ti990nnqgX/mXb16FYVCAaurq4HJANglZlL8S7h7Pp1hrrvVxw1DNgDXCX/c JldW5Iss+6IT/KLACYAxa0iAkIxdChsaVLSULV9eeS1KbbwnYOB7kQEL0vzC9iVzkdIqSTIttiH7 p31Asl9xTHQY2qx5bbNCm1zZEwgCQ9z+9Wp7+hgKpVFCKM1rGlQYfSglfO7nx1bRgHNWpmzIvtnA SkbISZMbNS25faO0kXO1Nia1nGQyiTNnzgCXN9ylLaNtAx0AePTRR/Hyyy/j9u3bxnEsVU5KAu12 2xeeGub81Q9Cq+3acW5TkfX5UdJV2Eulz4vqm+3/sKY1G0DLa2nnOYnj0Gw2kU6nfcxXvhBk0tKH 4jgOstmsiTxcWVlBt9s1eQ/yWvq70WgESiBxwutxkmY+fb9R4xFVn0uSbXXIuIz4sJDtqPNl34bp v/wO9mVzVdb12GrhQL8X2uRqc6qHAaq9/+GmZ8m89TzWQS/cL+c3wYZmIinBU3iSyx3Qn8LSOAwu YGKv1kAYKt9sNn0CFvvT6/WQyWSMX1FGMPJ8Xp8h3CQZfi9Ga21c/OM3GLfgPOl2B3xzALaDoKFO p4VCobD2rveQy2VRr9dRKhXwPd/zLuy//OFd13KAbQadQ4cO4dixY5ibmzPOaZsj2XEcXzb4sGST rKLMX3rfMEw/TIJdTzvDXivumrboP/6X2/myJhIJA/YAfOq/lsbk+NhyUORvKUVJR7wsMaLb3gpN YCvJdu24Z2jL49Bt6nbDASZ4rSBj8h9rm+/yeBldaLuGLrgZ1o+o60ZRmLYqTaA2bZnHsAyR9J3Z BBUyeApHuVzOl4zJYxnJxkhK5m6R12htv1arYXV1FcvLyz7wYQFVKXRpAOd2Br3YgnFsYyrfR6mJ 28Zc8k75jvE/I0wHINRBpVLBW9/6Vryz9Zk9ATjANoNO5eL7nbe97b96Fy5cQK1WC5gtaC5JJpMm simKhp38UcfZtAe5b1ipztbuRs/dKpImJIIOpS9qH5LCGC9fqnQ6jUKhYF4mm/oumUpY2LKUXneT NAPTzz4OVIYNiQ7Tnm0AL/smk2vldpIWOuKAI0zb1gyPv8mMw/bLjw7CkM9YRi3Kc2WyblT/ZcSj HC/yilQqZdYTcl0X+XweruvCcRwTjs9EX/ZHajZSOONqpK1WCysrK3AcB67rwnVdX4g/wYnWAYKX 9HMy0KXT6aBarQZq92mhQWu+0odke27st7wXOfYER/om8/k8zp49iw+m/9GeARxgm0EH6C/yduLE CTz99NM+tVe+ZHJ7HNmkPbndti2qHZtWJLdHHRd1rk27Gna/jeLGxvMG65EAA6lWAr32j+jfUtPh 8VwNUmfhc/LH9U2/WHp72P+NUFwbktHJ8ee+zQo9YXPTdn0bw5Xavk2bDWt/vRqJPFZ+k3Hzvz5G pz3Y+ikjH/U+Wx02CQRSIwL8K13S55LNZpHP542Gk8/nUSgUkMlkMDEx4TPVMZCGICgXuSNgSBCa mZkxc5/vEkEE6FchZ/QktQqZX+Z5ngGxbre/uunk5KTROuS7KO9ff2zPUr/fHB9pYaCfM5vNolwu 45FHHtlzgAPsAOiUzr/Xecc7/tC7cOGCqfIr8yGk5GwLmZRke6kk09CAo5m7pLgXVYNKGKhtpfQe 1d6wDI8vr9QytH8jDCylrZjLjGttRZ8jt+mXQjMjmxS3EUa52f1hmkgcDQP8+jvsd1ibUft0lBV/ y+cnt2uyFRyVFDcuBEUpmOhPFOmVWaWmbJuT1DLoSykWi8hkMsacRt8KNfxXXnnFp4lo4GNFC9d1 USwWzXhRAyOYdLtds+Adl7EgiEmwYZCM7K806WWzWaONyQrpYbwobpstV076tlzXRTabxcGDB/ec SU3StoMOAJxtfNr51oM/750/f94XPTXsZI2isPPjwCFMg9HHbEQTCgM8m5St98dpZ2HH8KWQ1R8k iDtO0Hw0zOSXDEFLovq3HhMJWrbrbYV2sx6Ky5eIE3q0edJGUSBjC5CRFDceevy1dLwe0NH9BYKa lt6vQ+alwMhjbcCu570WYvgtq3pzu8ynoiAkNRn5jmazWV9/pabkOP0glHa7jUajgWazaVZiJTWb TR9YUfgis5egKatzS42Nfe50OlhYWIDneSiXy5iamrI+NzlOMq/N9tE5dY7TN4G7rotMJoOZmRkc PnwYDz30EI7P/cieBBxgh0AHAM6dO4fXX3/dqJ7aCTYMA9KTN2x/GEUxSAkCG6Gt1nrCrgHY71Ne n9qNlPRYIiSK5Ask1XZeV4cjy/N4XZuZYKfBJYx0VQH9HQc6cT6fOFC3gYIG6LB9gJ8p25i7LY9K /rZF/sn9UdXIAYSuAsxttug3STKHSof0kgdQs9GfZDKJfD7v6zOZP4GCIMKIWK6rQ4e+9lkRWCTI SM1FajfSesBzZH1BAgAjcx2n7+NZWFhAr9dDsVhEPp8P3L9NaCBPlKbFRCJhch35yWQyKBaLqFQq KBaLePjhh/HI4o85u7Ew23pox0Dn3b2fdR6f+ow3Pz9vijXKaCcdJx9FwwLOerQY28tv+x+1PQ54 NrrfxpBspItoSmks7lxNWpL0PM8XBmpjerKfYRpi2P+toLg2pXnIxjTjaL2BBFEAHAbQYcfJ/kf1 1wY4/OYyI7Z9QHzyb9w8kmH5UnAh08xms0ilUshkMj7TE5cnoNPdcRyjZdD30uv1MD8/b0xbBBpt SpOAIDUReX82bZRzV1oICEJSm9P3p7U9OQae1w/ZrtVqaDQaxqQnAxNsIfkcNwZN0IzIsSoUCigW iyiXy9i/fz9OzH+if4OL1sey52jHQAcA3v/+9+PLX/6yKUNOdZGTREdfkbT6aqMwEJC0HmDajMZj +78VWpDN9q2lUq1FSoeo7pfWQmw2Y163f47fPNV/aWWbQfOR1i5tzJYUJ3TYNFWb+UeDSti80FJm 1NjK9mU7sg0KThSier2eYRyy4Kn0nUnTpWZ6cu54nucLwiGj06atKFCjEKGZqGw/avy0AKPD5icm poy5hwySEVx9TcUNaAutVgvNZhPVahXz8/MGRAgkMuSZPmEtTLE/8vnLsjQaZOR48H2R+WUkmtOY 6ybbltdkO4VcHsnEGLrt/hxIJZNoNBpooI7FOwvI5/M4cuQIkskkWq2WGRdqLBy7QqGAXC5nQsIZ nTcxMYHKxff7X5p53HW0o6Bz7NgxnD59GhcvXoTrur71LzgB4ygKeLaS4rSSYY8JO1aCaBRYbgSs KKHpF1OPXZg5x9YPtmvbHtfvMLCI0yo1sOhcLr0/DuB1//W3zUwo93PhNvmRx0igIQBpTYKmGn09 DSQaHOTY8BiZfzVMjS/6PMI0YKYtsJqEXKsokUigUqmYfdRMZJ5Ltzt4HhQkmYzpeR5ef/2qz4wl Q485LnruarOXbb98BjbA1HOKwlWYEMr2Od+kBUGTnCu2+cMAqUajgVKphCNHjuDMmTMGZMrlMrLZ LBzHsSdv9tBfhmAF2Otms2FpR0Fn/+UPO2fP/kfvpZdeMuYbnY1sozC1fiu0h/XQekEGCDczhTHb OHCyMUj5X7+o+qW0kZaSbf21/Q8eb3ei8zibJiWP1T6BMFCxjQ3gNw/ZtBlZhsk2JtpnotuR0rNu QzI8bdoh4+axttBgPf42TV+OZ5g/QI6fjjCjVE/goL+E4FEul33mH2naSSQSvugugsnq6qrxmbRa HbNfzr/BWPj7oqPLtGaiNT15jBao9PH6PO4PS9b0vEHUpwRMjjUrEshnLYGF/ZLlmfhcut3+qq29 Xg/Hjx/H97u/7KADoAOghvuOdhR0gH7ezqFDh3D9+vXQaKg45h4moWyW4iRv2VfbixGlRdj6qcFG txMGRGHbAP8ywTpM2cZoo7RGvS/OpxGV8W6TSuV2fb48l781Y9Uko3skaEjQkdceBozldWSCn2T6 mvHrbTahyvY8NbjwwzbS6bRhhjQ5yfao7RBQmEBJbaRcLlvLx0jQpvbRarVQrVZN6LCM5JLmL8n8 e72gCc5/L8GaaRJEeY4eGw06Ye961Pxh2zpYQI91mGbkeZ4vOk7OHWma1f0kYDWbTczOzuLq1atA xdr9+4Z2HHSmXv6Qc/bsv/FmZ2d9a9DLMhOSpJQPbL+2E6dJyOM0gES1E3YcyQYwGoiiwFir9HI7 J34caITds9RU9LF+ptwOXD9M47KBoWbMYSHAYWNoy0OxHas1R9vcso2zLihp00D0vcn753orYfNG 561xDKid1Ot1s43OeDrhCSo8V5vGEokEVldXjSTPLHyGETORUmtrWqvQmoZ/DJyABkKQ6r/bPXMv eow5npLxyzGUmogcO5vWEka67TAgk5F08hitjQbeNQQrHkhQmp2dxde//nWcO/cl713tn9l+H8Ee pR0HHQA4c+YMvvOd72Bpacn4ccKYNhCUeLcbeHj9KFCJOyYOJMPOHVbTCdtuezH0tcNIv2C27WHn 6GvbJEG9TfcvDpQ0aMbNg7BnZvsG4s1rbN8mlXveoEq3XDWVmsXY2JjxEUgTF81XjuP4osvk/bAf NO9oUOGxOmRYR3/R1MP9UlOxSfhhpIFyYCYLmjQlCMmsfK216uoAcvy5LawKNL/j5kNYu3oOyxQO WcFc37/W0hIImvfk/G82m3jppZfwR3/0Rxj7qT/0zjY+fV8Cz66AzsGrP+icPfs73hNPPGHKVIQx adJOgU0URWkatmOB4TWkYTSdsOP535YlLvfFmack2Z9H0Azq10yC7dhysPR5crv+Lb91/SpN2pGu 24szr2kmbztOj6vUTOr1um9Zdim9A8DJkyd9ZhfbEg0y5Ff7RhqNhk/TkKYw29joZ6wZO++J/WS0 FgDrXNKanN7f6/m1E60lSR+PjryTmoz+z2N0HpQGnqi5YZsHOiBBHsPnw3u1+SP9cz/Rj1wT2iqv IYFpZWUFf/Inf4K5uTn8wi/8J+893ufuO+DZFdABgLNnz+Kpp57yhUrbXm7bRNotbce2TYPEMP3g cesBsWHIxijkCy8pTHOKorExvx9DmpnWehC4rjwm6nmGjYNkLHHmMw0UNtAIOz7smsBg7PQihBo4 isWiKdGSTqeRSqXQaDRQrVbR7XaRz+eNGavdbptaXvoTlndCc48tilBrAjaynScZr838qsFJgp4c w/65A2CSzJbf3W7bXFPPhwFw9QLjzn02oWKYeSOP14AQRVrr0WOnt1GTlMCmC4JSm/3mN7+J119/ HZ/97D/1fvot//q+Ah6n8fWHd+3if3nnd7zHHnsMhULBVCpgBjEQzNCV0pyWTjlho6TlzTL4KPOD fGlt+9gP2V+beh8GGvKFjLKxUzqem5vD/Py8LxdKO7r1SyjzQLQUr/su+yq3SeAj4Mile/V4yG/J yCVTsjnjNcPltyx7ohmmlEK1FO44DpLJtLk+25DmMfpOGC7MsGK2KcsP0V9C30mn00FttRrQVOR4 h1VEsN2zjXTGvf4dx2SRiA5Zl2Sbu71e0PwlSQY/0LwIDEx0+v44dxhdxznseZ4ZUzl2UT5Lzi2t iQF+8yX9WxqYHMfx+eRsgpLW/uR2AEgm+kDUaDSMHzufz+OjH/0ofu7nfg5H3/w79wX47JqmAwDH jh3DgQMHcPPmTfPCSokKCEqbUTSMer1VZDPJyH1h2tB62pbtr+dcMmn6DGT+Q9S1aF6xmRzCzpF9 ZMUCCWSUwDkGUvLVQGYzucg+6IX+2I4spsh9ksERPBjSmslkkM/nfWVWUqkUKpVJAyoyEo7jwUoa zC1hhBevtbKyEtBOpM8jAX8Vbw3Cej0dm8Qf9+w12QSeMOp1g3ld8rdN0LMJTLbr6/M4jjJgwjav KIhyzKlByPI00nxlIzmOYUKpNO3pvvKYuPGTx9qEtNXVVSOs8F2Zn5/Hn//5n+OVV17BL/7yf/C+ d+zn73ng2VVNBwD+9M3f8r7xjW8gm82a7GSZJKqjZKI0HZt0If9vVtPRFNXeMGp/2AQP03bC7ORy jPgyv/nmm1hcXPSZhGx9iLsPbfLU2o+WpLXZLW6/ZDbyt+wTj5eSre4jJVVqJgQTZsenUilMTEwE GJScV/V601ybvpJ6vY5arWaivGSWPBmffpbyt0+A6PaGGvMwxh9HYcLAsG21u+GaSuBerHMo2oSr wZbCAJ+vDPGXc5/bCDqc54Bwj9hLAAAgAElEQVTffBsW/Sqvr+eknI+JRCJU06FwE8ZvZHv81gLc mDNIZ6DmJIv07pvZj8985jP42dP/5p4Gnl3VdIB+JNvFixdx584dAEEpYT1gEaXpbAXghGk3YZMv ars8V7/MtuvY2gqTRKVfAPCHnNrOI9mqEPMYz/MCVYD1dfVCb/JcAMjn8z7g5EczDXnfss+FQgHJ ZNKUB5HhwolEwqxdosGM1Gg00Ov1jOmLn0Fp+7ZPS5HOen5LRsI+8np65c6wsQ4DpWG0+SjS4crD AJykuIKnut31tA34FxmUPiupqUaRdOxLc6v8rPeebSTnr9TESGHvtY3/2AQBanCe5xnNp9Pp4Pr1 6/j93/99vPTRH/Y+97nPDWqq3WO066BzYv4TzokTv+k98cQT1pBYMsthJuVmzFLrIZv5zHbduD7b JqQGXLnd9nJJ0oEElPopWdnCPrXUpz/yGFuehPbBhI0DACwtLRmJUa7+SBMg1zuhpkItRSY4ynHV ZVRu3LhhxkH6TXTOSdjH8xzf8VKb1M9Ga6E8zga4PD815l/OQ4+Rzl/R4xkHSjYz3Fa/BzYtU/wL 7LPNA96Lrg6gGbu+li1vi8fYfIZhGnHYNfQqqHxnJMjZxkG/H/r58vxWo+nT7mg6dJx+mH2xXEKv 18Mf//Ef49VXX8Wv/Mq/996f/If3HPDsOugAwKlTp/Dss8+iVqttmIFritJC4s7ZCElgkNe19cMG LHL7sJqOvLZmfro/0twV9ZGkgYeFD/ULxU+z2fRFdGmH+759+wygUEsh4PA+5AJZ1DBWV1fR6/XM t9Q+JNBq86PUePhih5nDCDo2TUW2rcdFHmcbO1uobdjzk32yBY2sd36uG3AS8ZJ6dB/sQpQ8l4xZ BofQJCyrmNvuQY6FzvOygYkeN9v7KZ+v7Kdul+9gGOhGaTlsL5fLBXyN/M5kMiaYqlAo4Pz58/jV X/1V/ORP/rz3qU99CpOXPnjPgM+eAJ0zyz/unDnz695TTz0VmZkcRxsBmvVSlPkkiqKkvrDjwjSd qOvL/dLJTiDgMdJMwW1RoMJrSUChlkLg2L9/v2lT1+9KJBKoVqs+DYXJwcwzkWYsWygxo+vCClby hZbSqVyrRYKOHsP+ef77lSAGBEOmw6Ra3baZx15wmyS99IL+HfceRDnTh3mHejHXCZvrtuPDNHEe L0OK+UxbrZbPxyPb1pqmvk6UBSDuXPmfc0G2FwY4+v5jgQuDCEdeg4m6Y2NjaHXaGB8fN+WHstks vvCFL+Cpp57Cb/zGX3gP3rg3otv2BOgAwOnTp/Hss89aQQdYv8ayHcCzHsAZtg+b0a40SQmSjJ71 ouiP0dKXfDnkWuvpdNqUppfLBcsse+03YaJvu93G6uqqCQoJq92lX1KtiXAMpaksisHJ+SK1Jx1o YQP1fl8SgfM4Ltp8EwYKfs3Jz6g6rXbkfNYpAlooiKvCbtMsbL9Dz+/5qy+Had66zcH2eKYuz6Wm Q+BpNBpm7sl7J9EkxXkepXmEgbUGIPk+6CAd3U7YfZGksGPTqricAe+D1zWVu7MZNJtN5PN5TExM wPM8LC4u4vHHH8cv/uIv4nd/9394jyz+2F0PPLsevSbpP1/4x96zzz5rGFWz2UQ2m43NRLfRejSQ 9Z6zUdKT2XZNLT3bItWk6UX6LcbG+hnRN2/e9DlaDxw4YMwXsuCjzEkZGxtDPp/3aQf6mqwyLEOG GdFFsJHmLw0gQHBlSdtv20vf6/WAnmfK5MuXl0DZ9aJ9VjKPxEa9TrQjXT8z/ew6vRhHfC96ftkE A/kdv/RHdG09x4m+vrdJdjbs+6PnswwqIGnBhlq2FCDksel02pQBCgOOuKUfEojer6PzAD2/4NPS tBbW7rZ8OWtMUaBFoFgs9vsh2qjX61heXsbq6ir27duHz3/+8/jkJz+J8Qvfe9eCz57RdADgbW97 G15//XXMzs6aycby4lupEexF0i8St0nS0pMEHqlJ1Go1AyLpdBqVSgUHDx70SepS4+B15ubmAvt0 RWPul9FdxlGeSgWc87LvnU40KNB8FuZ3ScC/vIDUXDzP8zFNm5TfiwEFL8ZRvxGtez1k0+y1dnA3 kw1MpcZjM6vSH2gLcw97Dn5BZ0Dal6J/a+E2ON7B5GT5TsrcLj2PCS7SfEgeRyGQ51ELGhsbQy6X QyqVQqlUwvz8PL7yla9geXkZn/3s//XuVj/PngKdc53POi888E+8N99804RSskigbRLdrRTGWGya UNR/G/BIX0Yul0Oj0cDs7Cwcx8Hy8rIPVKSzXrYrGbskHdKsv3WGvXxm/ZczKInra+h78u8bXIMl X3wAlwhnGH2AilkOPUYTCTPlDEtxx8ctDREW0n63kDQpaSLzBeB7/nzONBlrwYtt6lVRbc+K7wfn ZQBAEuGA0m/XHuE5ME+nAn2T2k4y7Y+OYz8kAOlgFb7LzGPsdruYn5/H/Pw8Jjf3OHaN9twsPnXq FF555RW88cYbZpINEwF0r1CYeQmwr5ooP8wVkS+g4zi4c+cOVlZWrNn+YaYsLWHbXuYwYJQvmjy/ 14sGV9tzlm1pcNXj4/WiQcHzojWZGOtT4L70tWJnaIyGZBtz+X+7NKydorB3mNvJeGlG40cuU839 FERlG7ZwdzlPpH/MChqWQBv//2DEpryG4/h9OQRR4+OJs94BAX+QFLxmZmYMAE1PT294qerlM3/l yaTUwBLY20x7DnROnz6NCxcu4Pr168YP0Wg0ApPsbqVhtRsbINg0CWDwEtAP1u12TSSa67pIJBJY WFhAJpMJnCe/bUAm+2CLjgrbb3tWsvS9JP6XmeDyGNMPMWZSAuaHPp3tMoPZTCtbTTtxjd0iWx6S vD/tiOcxBBHWLJOBBtSQ5JIJNBnLY2xaRAB0nCDoyOfAgqVh5jvHCWpHUqOJqqZPUNT3L7+Z03Pr 1i3cunUrsBbc1YN/6dXrdSwtLWFhYQF37tzBwsIClpaWUK/XMT8/D8/zUKv9EtrtNnK5HI4dO4YP fegPvPclPr9jE23PgU75xfc5b3/7l7yLFy9ibm4uYGK5mymKCWr/hdyu9+ljSDJ50nVdeJ5nJlet VgvktXCC6z5oyZNks3mHSWU2xj82lrLeR9i960iyZGKwyqU0rRjGEqJrRGkokoZ967YLCGyaKP8D waUb7jaS5lmtpdiIWo30lQDBYqH0OVLQ0qYr+oS0UBNg7BGRFFJTCiNp/tQm5l6vhx5slbn99yvH SpreEokEXNdFOp3GtWvX8Hu/93sYH/+4l8lksLy8jFu3bmFp6Zd9Jjm51LjjOCiVShgbG8P4+DgK hQJmZmYwNTUF13WBZuStbSntOdABgHe1f8a59Oi/8B5//HETu38vmdjCtJ0wcxV/y7BdvljavMZ8 h2KxiGw2i9u3b6NUKmHfvn0mYz8M/KQZz3ZcnBQex9yZhxJ2j+l02viaSDrLmy8UTSm+6ymbfNR4 Wilmd5wmF4daw8zfuDlxr1DQdBXUcCRwyLB1bqPmwChKasCMYmNUm+f5q4/rPpj/CO6TGo3OHdK/ pSYnTXyyDQkk+nzen4zQ4zjIxeR6vX4V+bm5OeRyOYyNjSGTyeChhx4yQM1ryN/UFllKamZmBpVK ZccF+z0JOkC/JtvTTz9tyvMTfO4XsjEb+YLatJ9Go4F2u41kMokHHngAxWIRKysrhonLl4If+XJI EyYnvb6m7bokCQI2But5jk965YcvBgu+UiPTEqFkQjLclvuS6ZS41vYxaxsgeJ4HZyxaEh62XcDO 4O52ANIro0oGTIYqGaQ2H0sTGRkqMNB6qf1wbshEZrm4XhiFaTID82/bCpbSPMz+aNDxPA9drxPI TQozT0sAZlv1eh3T09M4dOgQJiYm0Gg0kMlkjDlRWiIYzdpsNk1/WeMtk8kY4bRarfaXQc9FDs2W 0p4Fnb9V+ynntff9tvfYY4+ZwWVIsJxwMls8bhGrqJdWMnK9nd88xuZo1+3L87hdryrIc+QLpbUF eT7NA2TSUoLyPA+ZTAa1Wg1Af9JWKhVkMhmsrKxg3759mJycRK1Ww8rKipmUjtMvwUHpcDMUZ36Q 4MFSN/5xI0PhsR48r2u29ccDSCSc/toknbXwba+DXrcLr90T0p0TkBpjNQ1LGRhJPapCPExKvBii NqBFFYqac3q/7Vj/tmBIuvwvD7Xtd2LyfGyL9EnGO5ZMB7QWn08lRpXkejPo9cfK9NDrf7rwwMHv dvttJZNpJJP98jkJOHD9uKbuMS6PKfr58zqhxybWxsVZmxoeDNh0uwB6HjynBxm479N00gnj3Hec froIaxR2Oh1MT09jenoarutieXkZzWYT9XrdaP5y6Q8bDQrbNlEoFIzPfKeFmT0LOgBw7tw53Lx5 E88884xhUqzXxagWrslBMIqiMBtqmJlI/rbZ2G3Hh51HFV/7QORLy4WotC+DH0ooMgmT7RKE3vKW t+D27dtoNBq4du0alpeXjT27VCphYmIC165dw61bt8yiVFS57wb/mU0ylKAOBE0YtoTC7SDdH006 ui7q2DgKm7sbPcdxHHQsybF+U5K/4oM25QB+B3gAPLfZOh43FrFCwTrG0jafoqwAw7TP95lgQ0Ha 8zxks1mTvK0jVG2CsO5jmJUiCqS2i/Y06By69kPOu9/9Ze/OnTu4dOkS8vk82u02Go0GHKdfK8x1 XeMHiBs8Hb0S9ZA0SckuDNx01VzAv94HgdFmI6b6y2vRZyEdoazRJKN3WNtsbGwMp06dwqlTp/Bn f/ZnuHLligkemJqagud5KBaLKBaLWF5exsLCQuDeNks74XOzgY4tC12b5nYCUGMDKSyS9kZAY6Mk 84Csmo7onw2gdMiw9Bv0t21vhOlm73+n56ftf1xfpAlxbGzMWG9KpRIKhYLhAzptQF8rThCWARiO 42D5zF95pfPv3RGn+Z4GHQB4tP4PnOoH/sDr9Xq4evUqABinINCv90VpP46xSOec3g7Yo0/kbx1d pDOc+RISJKQE4nmer6yHzbFIrU2WqJE10MrlMjKZDAqFAorFIgqFAgqFgqk8cOT6xxwAWPzQb3lf +cpXsLKygnK5bMyTVMO5bABNcel0ekeYshx/2wsTxxP8xw7GXD5PeR9yvG0Jg1tNcm7Z5lkUo5EU xag0g9GmrrB2w4QleUwqlfZt0/NUajphfY80De4A099O0kKp7b/8BoJzQpPPvCa0cwZKJBIJFItF jI+PGwuPFB5kYIW+tu4jf7MNufoqfT87QXsedADgfYnPO7kf/kPvq1/96lpo4JJh4mTsDDaIorhA hFar5TN3SZs04Pe/kBzHMczNllFOTSSZTKLZbJrS/qzSzPL/yWQSlUoFuVwO4+PjKJVKKBaLyOfz yOVyKL/4PvsbW137CPrRmV93Lp/7rPftb38bAHDx4kVMTU1henraLBVAfw7vb6dV7I1SmN8sTOuR IaPbfY+2F98HiF17GRYNVJp5SXOsJDlPebz8rzVpXdFAM8FEIukbU3nu2h2EmpjDtvnuM3Tv3UP6 mcQBig+YInxqcjsd/vS9TExMmAUQpfDL69PMaVuET4MiXREadBqNxvoGYhN0V4AOAJxtfNop/8T/ 8v7mb/4GTz75JG7duuUzV+mHYSPNDLQJhtE1eiJJc5w0lwGD5QMYKUMtLJVKGTssw5crlQrS6TTy +Tzy+Xw/Vv61H7DPvsba59bGxusTn/gEut0uvvvd72JmZga3bt0yJsl2u416vQ7XdeE4O1vfzqZt rgcMbH3Uz12WUJE+r2H6tt5rS4oLZOHZYWZcbX/XmqGcs1JD5n/tIwxqKuFaSf9/0LwmSZp0NHAC A+e+rY0+6Gwv7GxWqFjP+VYtZ+2vFgJIttmj25BWlLGxMRSLRZRKJSPUaiFDnxvWtuwP26c7wHGc kaYTRg/d/Lgz+YPf8g4dOoTz58/jtddew507d4xZKo4pyPwTvrQECa3RAAN1lzZraie5XM4sl+y6 rlmQbHJyEq7rGvtraEG+2tpng4AyDB178+86H/vYf/e63S4OHz6Mp556Cq7rolwu49ChQ6jVamb5 Zpn/sBmKf2k3374UACRj1hUrdO22YYSSzZLNpyT/06cTBgTSJCv7bmtLaqk2ANBEUJL/g0zKfi/a lKfBbJhrbwXFzq9tVqXWex+B4y1auo0oBFYqFUxNTfmSXuXclwKzTHwdpk86sjNOYNpKuqtAB+hX LHivA7z1x//Ku3TpEl5++WVcuXIFt2/f7sebRxDXlgEGZjGWFaf/hOavQqGAUqlkzFyZTMZoLPl8 HlMvfyj4hLsAVtc+e4Detvopp/b9X/S+9rWv4dFHH4XjOCiXyzh+/DgajQYuXryIbreLfD6P1dXV bWfKW006qIA2cO6TfredAB0GeAB+05fZ5oX7S3gPEnTkXLUBK++LpM172lRnMy/7GVVwStvMmZIk kCUSycA59zIFNBnL+Aw7Fo7jILEm/LbbbWQyGUxOTqJcLhtQkCZkLmVCXzb/y/Zspr+AdrZGNtPc dtGeWk9no/Tmsf/jzc3N4cqVK5ifn8fi4iI6nQ4ajYZZAtt1XaRSKeRyOZ+/hB8W0Uun0+H+k7uU vpP4ovfYY4/5wqI9z8MzzzyDF154Aclk0iSVaiZGLYj7NWntIsonEBU9pduKozCpToKNLo5KrVVW M2ZbiUQC6PmzwOV5iUQCY8LRLrUM89k0r40pSBojycbtHzawIZyGN1/baL39W3/7mz1/TP3X/Y1e T8eW56WvSbMZ/TasK5nP5+F5njF7HzlyBNPT0ybASGuq9v4HzXo2c2uv10Mul8ORI0dw6NAhVCoV 5PN5nG18ehS9NizNvPYDzgyAt08DmAYWH/mm53mDJXAdp58AmUgk7IsfNdc+Szvc8R2ihx56CO99 73vx3HPPmYg1oF9c1fM8PP300yiXy2g2m76kU4ZsMts7yonM7TZ/2DBERh4lydvCRG1+Cu2v0xI/ pX7Zlud5ZuVMaruscs4x8CJCij3PC639tlO0Xg0jzLe0VyketDYH2jY/TdT/sG1yn60PTPFIJpPI 5XJwHMcsW1AoFDA9PY1SqQRgkFA+THRuHMm+ao16J3P07gnQ0XQ3r6q3HTT9yvc5HykAtYf/lXfx 4kW0Wi2T6Xzy5EnUajVcuXIFQH8y0gGfTqfNtmEmZZz2spEXOq59235btQbZJgUSGYTief2K3Fxj iO3JYpNaEwyA8KY1kcjdsTQM6GwGZHbbbLbd49dvIzo6bTNAzShbpihIYYg5d9PT09i/f7+pQkBN e6vGXs5ZlpvSYdjbTfck6IzITufOnUOr1cJLL71kbMflchnvec970Gw2cePGDXie51vHiJM+LNBA O8JJtpdEA5A+Jm7ih1WUsP23aUzS/k1pk1Ik97FgJJONs9ms8fv1EGRGYfdno72gVcQx1Z249t1I W9F3LqnN+mfUcCjgPfDAAyiVSqbyCAGOguBWPiPP83yrAnc6nc3G+QxNI9C5j+jg1R903vOer3qr q6t44403jOO7VCrhgx/8IL7xjW9gfn4eiUTCLIdAmzPNAlGO0/U4TW3/baY5m8Pd1saw15Wl8pnX xSq9vU4/cTabzQYqSXie5zOvkfYSI12Pz8SmaQ5xhY12rX/2JpnmZsc6/ny7SXjwPy7kPFqT9zx/ gjhrD05MTJi6agB8lQLk/NsK0JGaDs3GBnRSMSdvEY1A5z6jI9c/5nzgA//T+9rXvob5+Xnkcjk0 m01MTk7iXe96F/76r/8as7OzvpyAqJdVvghxJri46CmdzKh/x0VSxe2XET/UXsgIUqkUvLGeb0Ew 1rgyNd3G9jbTXC9T2mqfzm5rcpsNVIgCkfX8DzMdsygnAFM1v1Kp4ODBg5icnBz4Dj0vEIm4VYtY yj7K9bW63S6WH92ZUjgj0LkP6fjcjzjf8z1f8r797W+byb+ysoKjR49ieXkZjUYDd+7cMcyZJimt aWgNRIKGPI4UBzrDLl0RpymFkXyRE4lEoNQ+X3hZot5xnEFAwSYLdsYzvaGb2lD7mwWZzYLKVoOC 5Yh19ii+ff9cjj4+rn+pVArNZhOdTgfFYhEHDhzA9PQ0kskkVldXjQZOgNEV0jfrd9HvqwSdnfTr jEDnPqV3tX/G6Z77ovetb33LhHDW63WcPn0aqVQKTz75JJaXl82El9EzNlDRTnebpqJJb9c5Njrq LC7PJu6lT6fTxp8DDErkUNLjy67NUKaad2oQWMHvOE1wJ2mYfgwTwLFRGjbQI6pvmzs/cvcQFUvC r9X/Hx4xafuvzcW9Xg+FQgFTU1OYmZlBPp83hX1ZzJjzkSY2mra3IrqMc1X2T87lnYpgG4HOfUzv 7v2sU3/Hv/OefPJJUxeu2+3ioYceQrPZxDPPPIPFxUVTjqPTapsIHGkuGBsb66/rYcl/cZxBuRYZ LUMgk0xflmvXpj0eo/f7zW+ODxi1aa7X6+diJJMDjarf/FqejheubTgOgDVNZ2Dhd8ROgGv/hNPm 8lzizgcsywlgEI7OwAl5nDZvyvHWwJ/OOj7mpKP/ZJkbW4CCh6AQIiVtnfvEdozEb/Gp+DRuyOca HEs9f+R9AkBiTGyDfw47Dtbmj+O7D5v2z7nK63E5liNHjpilonu9nqkIIjUbOba6aLBNgNMCkNzO bRxXpj6wj+xDo9FAoVDYsfprI9C5z+nMmTNoNpt4/vnnzURNp9OYmZnBoUOH0Ol0UKvVsLq6ikp5 3OQTADALQul6dNpuzEgwLt3Al0yX3rBJjHKbDuFmfwdRdoNwVAKbXI9kJ8NCd4N0WRwtyWaz2UDC rGRm8nlIgYG/W61mQCCwtSM1VpmkyyrJWpuU52mJW15PJvVqUNEap41By6VDosjWP46v/K/bonk4 kUiY6vClUgnj4+NGqxkbG0Oj0fD5bujIj9LkwsZc9lVaJeTaXfL5GoAVy6JQiFxd3ZlSKiPQuc9p +pXvc975zm94tVoNr776qgGRffv24fDhw5ibm8PKygqq1SqmJ6d80phcdTCdTqPVaQdeVk5oTnob Y+I2XStNS29M9JXt+9tyfEzNcfqVKAiOtooKknbbTBZv5oreryViLY3r9Z50wVBSGCjQByYlZS2B e57nW9tK1i/kf5pzGcChI7q47Lqu2i7DiGW/9PyxaXHyvmyM2gZaer+8F9l3auz5fN7k4aTT6UAC MpeW5r3p5bbl8WHPl8dzLOX85z7pn5H7tbDXbDZNekAmk4ktI7ZVNAKdEWHq5Q8573nP//bq9Tqu X7+OWq1mQjiLxSIWFxeNGp7NZuE4jlnHiGBSr9cxlkoGXl4SNSia2IAB89LMhKRffBlooM1AQH85 4U6nYyTqarWKQqEA13V3xHQQ75PY3utTy+N46rJEWhvRkrNkgjzHZ57x+sxKai/AYH0raTZNpVIm /DybzSKVSqFQKJh9rHMoNeRarYZarYalpSWsrKz4wKfX6xkhRz579lP+l9vkb216lb8JWrJCPNex IoDk8/kAAOkq3/KafAa8BwkSUhDgGPIebO+BTbuTmr4m/exk23I8aAJMpVJwXRfYAdwZgc6IAAAH rnzEOXfuTz3P8/Dqq6+i3W6jVCph//79WFlZQafTweLiIo4cOYJCoYA7d+6g2WwaFZ2MwSY1y+KV crkB+cLIhe94HklqSlxKgoxLSsql0rg5dmVlBW+++SZWV1fRarX6eTjb7CiN11S2l8jAdMV1m3+F /+U2LUnr4zyn55PkWXU9k8kgmUyiWCyawrl8NrIvMjy33W6jWq2i0Wj4lp1vNBqoVquo1WpotVq+ ZybNQ7Y+2khup1YiF0Zk38fGxkzpGZuWaDNtyeUz5DOQQELtRa6nJdffkkBNANDanAYim3amNUsJ NFJAYHFj7mu320Yz3b9/P3DHOoxbSiPQGZGht9z+UWfp5Je8+fl5NBoNpFIpzMzMYH5+HisrK1ha WITj9JNJu90u5ufn0el0jHmh6/V8Jhy+TLZF7oCBpEYgoTOZL6tcoyiRSKBSqZhtkvGRuTWbbZP1 PTk5iZmZGbz88suYnZ31RdbtFsVff3PmvWazGShoKiVk7bCWGqQ0wRBMyJjJqErjRd8ihHw2bKfR aBhQofbbarWMH5C+DOY/MUKL/SMTlpnysn+2grGSAXN1XAok7Cf7L5N++dHjZ56EAhfOU9u1+VvO XxkIwPwbCj42/40EjzBNR2/XQgKfu162gEJas9n0CXm5XA779u3DiRMn8NaVn3BwIXaKbQmNQGdE Pjpx4gQWFhZw/vx5AP1s6fHxcSwsLKBerZm8npmZGSSTSczPzxuJtNluIZlMwnVdszQEq3lnMhnc uXMHKysrfVPcGnMgkwLgM79QCpVmGCkp81Ov17G6uromtXUNeHHRvJMnTyKRSGBubs44ksMoDhQ2 63OJo822z6K2AAZZ5oCRrhl5SKaszUesasxnoB3S1fqqGf9arYZ2u41Wq2VyT1gglttpVpIMlf3S ZlZt/mN/uY0+EwooNlBhhY2wT71etwagSPOiNEuxbwTrqOdDUGJbUuPhPjmHtSYVR3pMbMEW1KTk +8Oq+vweHx/H9PQ0JicnUSgU+hX1V4bqwpbRCHRG5KPS+fc6p09/zZudncXy8rJZn31qagqLdxZQ q9XgeR6OHj2KgwcP4saNG1hYWOg7I93+WkOTk5OYmJhAqVQyjMDzPLRaLdy8edO0u2/fPmSzWTSb TTSbTdy+fRvAQFIjc5MMSpI2OdBnxAihTqeD6elpHD9+HLdubeOKeZb+2Ggn4hQkQ6U0Wy6XUSgU cPjwYcOcZegsx1dqKs1m04AHNZWu1/HVptNMm2WFtL/N5oMhE5XmIGpRrusaDUuaUaWJS2pIUlOS 19V90UtaEGSkfyvMnAbYlyOX/2WhWK0FATBmLAIZMNBWqMlFzSGp+SWTSbOIJJdt2b9/PwqFAiqV Csrlslm2ZeKlD/gbta7YiGQAAA6JSURBVCxxv5N0T6ynM6Ktp+8m/4v3rW99C71eD0tLS7h8+TJe fPFF1Go1vP3tb8f+/fsxPj5uosO63a5Z/lovJyC3LSwsoNFomEAFJqXevHkTc3NzqNVqRmqW52rQ CXPa0ykKwAQV0PTz3e9+1/ifgL5mQFNOJpMx6+mwHXmNOEkX8C+9IPszaMNe3oftdzqtgHQuGZ8t ZNd3fXg+M8/ExARmZmZQKpXgOI4JmaaJi+BBjYRAQtOWBH/N0PWH9y/vW5qaKBSQWfIjNVmGxMtr S1ORrBRhe/5h2oN09utztf/LRnL8w+adBiz9nCRwSbAHBr4fWgCkNprL5UwwTLlcNotJlstls0Jx Npu9q9YAG2k6I7LS4cOHceDAAczOzhpn68TEhDGnlctlk/vCSsyD5MNg0qHebgsUsJ27XpLhqJSI +aIePXoUN2/eBADj2OXCftVqFcnEmI+B6j7GUdwxkmlpezx9EtymtQL+tvka+Ell0obRO04/8GJ5 eRn1et0AB8/jf8nUdfkV+Vs6o6UJSpqiSqWSz1HPpdwZ7KFBXPdFrvUkx4Yk87Rsx0kzlpxnGmg0 GPC+GMwgfVzyHPlMdB+k+UyPlUyglsEX0neWTqdx+PBhszJxoVBALpdDPp/H/ssfDk6sxtpnLrBn z9MIdEZkpQNXPuI8+OAXvbm5OfR6Pbiui8nJSZw/fx5XrlzB4cOHzWqHBBtt7tIfrQmEMdaNEh21 ktGwb+l0Go888ggSiQRef/11eJ6HfD6ParWKZrOJUqmEVqPpa88WYjss2Y63mQilFG6T5MOkZ5pZ 5HW6nj96sN1um4Q/WUwyLEFTLvXAfkm/zvj4uDXPhscTFCQ4MoDAdk8kGyDY5gQd/VEajdSI5HHS fBUW3Sd9Qnxe0qdEUOP9af8MNXTXdQ3wEjgymYwxJxNU+AmYvzwAK2ufe5BGoDOiUDp8+DBeeukl vPnmmygUCshkMpiamsLVq1dRKpVQqVQwNTWFer2OZrNp1ggJ+wBBBq6lZrktzJQRRrTbkxFo/0Sv 18PJkyfhui4uXryIWq3Wz00AzLomkqmwzTATnyYb0MhtyeQgI9720UxSHsvfsk09lr3e4DhGhxFI mCfC86REL0GFQKI/LJEktR6pKdFcJ/ultVr5X96nLNNiI5mMrNuR42NbHE0eS7OrBBXbM5X3KDP3 O51OIACD/9PpNPbv349sNotisWg0lVwuh8rF9/snRhf9VYrv0ZWK42gEOiMKpUPXfsg5fPjferOz syYihmHIL7zwAvbt24dz587BdV3UajWfSUIzT7ld7rcBkI2G8anU63UTGk2tihFyvV7PFDA9fPgw er0eXn75ZfR6PeTzeSwvL2Nsbb2cuHInw5Ctr5TAbeVq+jQwuemSNIA/gVBK2qaNxOC+pabCiC+G nMtwc52kKaV4Gd5MTWgY0pqLjAqzme1sc0UDrQRmtqvPaTabvnvXGonUdHT/KFQQRGgepE8lm80a n0qhUEA+nzf7AssB0PQ1IiuNQGdEkfTggw/i+eefNwmi4+PjqFQqWF5exgsvvIBKpYLTp08bLUdS 2H+t3URpQushqeF0Oh1fCR7H6dvWl5aW4Loujh49imKxiMuXL2NxcbHfF/gdvJKYrR5FcZpOt9vz AaI2HyUSYz4NQmoCTJyUWorMYUokEsgV8oFwc+auJBIJo4nIe5JRaxoIbX6LqPvVASQ8xiZcSBOe TdOJEj4kcEmSFQt0ngorJthAxWb+IqhMv/J9wY7U1j4j2hCNQGdEkfTQzY87Bw/+S+/27dtoNpsY Hx/H4cOHja/g6tWrGB8fx6FDh3ySrCZt8rBJ+5oxrVe7kGXgtWOXOSSlUgnNZhNLS0uoVCo4ceIE rl27hmq1il6na6R7yYTDfBFRZDs2l8sFIrLk8TKaibkzMoP9gQce8AGO9Kk4joNEcsynGRDAmBQo a8/psZUmJ/7XtcP0ufoebG1qTUUSx9i2VpNtzLU5EvBn4OvEUAJIsVhELpfDwYMHTURYLpfr+ykv fdD/oDq4r01fO0Ej0BlRLM3MzODChQtYWloyiXlTU/3in3Nzc7hw4QJyuRwmJyeHAhyb9LsVpBMi U6mU8eWQcVerVaMBLS0tIZvN4uTJk6hWq7j62hWjDUhTTBiQroccZ1CvDhhU+ZUJsK6bMXW/mKvC fgODPA8JKAyW8DwPaAeXNh5oUYlQoUDXD9P+pTDTlmyf46+fqwSJuORcm3lN/ibAZjIZAyYMG85k MqaaM5cPmHr5Q0FfSn3tMx/ZlRFtI41AZ0SxdPLkSTz77LNYWVnB7du3kUqlcOvWLaTTabiui9u3 b+O5557D9773fchkMmi1WkivMUxmSScSCXR6XWO+IlOX4alRPpQorYjHytwezxskK+oSOzyG9a5o djl1+hFUq1UsLi5icXER1WoV7TV/hgwksDFWSZ7nIbFm1pF+E4YPy2KSLOHDdqlp9Xo9tDptNFrN wDpEmumPjY0hIXwuNrOl7qccQ4KC1j71NaSPxDYWjN6S5VjYriwISnDjHKDWRkCReTyFQsGASaVS QS6XM5pLQEsBBqAyoj1LI9AZUSzte/X7nQMHftO7du2aCb2VEnCn08HS0hIuXbqEU6dOmVUQWR7F 89ZyQASLCNNybAzP5hPQpqkwE5hN6ubx2nyWSCRQKBTMUsKNRgPLy8um4rH2Jcjw4UQiYQpeyrpl 0lFPUGA73W7XZPtLk1UYuNBvpk1WPJ4+DVsEl2089VjL/rEv8li5dpL27wDwOeT1OBFcbCHDdNQT VKi9jF/4Xv/DbGNk+roHaAQ6IxqKjh07hueff94nvUpmWa1W8eKLLyKTyeD48ePIZDImr0JqOpKG dToPY4Yb5hjJrCXwkBqNhon0YtXkQqHgk+6llC/rgOkKCgCM1tJsNs0qqzZQkPdgCx0nyeRbnZip 27WBDpd8kD4l7uO9sC2pXUk/kvT9cB5QS+FYMKqLJjCCivSpuK4bDCUegcp9QSPQGdFQdODAAUxM TPjqVbFqMJlprVbD+fPn4TgOTpw4gXQ6baLIdIkUTXFAE6XdhNGwQMTjZHi1jPSSjJ6MWfaR5kKZ vKiPcdbMXxpspCNcjpENlPQidNo8xnuRpjBJrELNQAWtuRF0eb4Mt5amQjri8/m8KceSy+VQqVRM kcmZ134gOPgjMBkRRqAzoiHpwJWPOJOT/9yjKYnJgu1220jbrutifn4eFy9eRDabxYMPPgjXdY2k j0TQ+ayBRJNm3MMCT5SZLQyM5GqLkmSZGK2NSQ2DoKXNXjxW+zrYd1uItg2E40yIcTXGZJkdWXyS mgo1kGKxaKqDU2PJZrO+kOKAkx4AFq3DOqIR+WgEOiMamsh0CDpSegcAL9VnptevX4fneXBdFw88 8ACAPtNjQUogWEcsDAhsJjhuj/qvj7ft08TaY2FmP22ykvt0wiHJZsqS59m26fu2HWvzLem8FV2y htWIWZ6FhSPHx8eNpsLgkIDpC9iRBb5GdO/TCHRGNDQdO3YM4+OD1TkZ/UVJvVnvm2c6nQ4uX75s EuzGx8f7x3WiM9o3E5Y8jCktjpjRrgs+2oDRFkLcarUC4BDmdNf9dhx/vooGHYZuy6RK/pcrqDLi iwER/DCj3nVdu+mrAeDG5sZvRCMahkagM6Kh6eFbf88plT7paSc8zUi9NXNbLpfD0tISzp8/jyNH jmBiYsJXQiUOIMIc/ZI249MJO48FQ3u9ni/8mBoDy8FoTYZtykABHVKstSWtxfA8WWGAAEjzFx3y BPN8Pm8W5qLT3nXdoOnLwyiUeER7hkagM6J10SOPPILHH3/cMEJgUH6k3q0jXyyg2WwiXyygXq/j /33n26hMTuDYsWNYXl42IbUsQCmTL6XUT5JMXJq/ZKQX9+vy+bINAL5wXl5Hni+P16YsaiG6j7Kv zEnSC3QRPBgJJgE1lUqZRFAAPuc8I79kSHE6nQ5WJR5l0Y/oLqIR6IxoXXTgwAFks1m0Wi24rotG o2FW6sxms2g0+pUOmXG/uLiIF198EVNTUz7tRK75wuRMbU7iN8OzbaHG8r8sksl2JFAwZ0gXmWRE ly59r7USRuHZwqbZhuyTBhX6S8rlMsrlss9hn81mMT09HQQUYFBAcuSoH9E9QCPQGdG66OjRo5ie nsbS0hJyuRwA+KT4RqNhyrckk0msrKzgwoULOHLkCE6cOBEI55XmIyAYBkywsS3lG6WN2Exrtnpv GkBsUWkEPkbqyT6zlE0qlTK+E/pTSqWS0Vpc10WpVLKDCgtIjhz1I7oPaAQ6I1oXHbn+MefEiZ/y 3njjDeN/aDQaJprNdV3DoMmAW60Wrly5ggMHDhizGv0m1Hbq9Xog0kxn3mcyGR8YAH6fitSMuE2C CgGEbTMAQvpsJDARVLheCn0p5XLZrENPMxgd9YFlg3voayiLGDnqRzQijEBnRBug48eP4/HHH0e1 WjV+lnw+j1qthkKhgG63a5h0Pp83Uj7NcnJhLAJA2Fo88jdBQoczS9+ODG6QGgx9R9Jxz6KgLFlD Mxe1FDrpGVJsrffVwqB45Oz2jfmIRnSv0Ah0RrRuOnXqFE6fPo2FhQWzmqPruqhUKqbC7/T0NMbH x1EulzEzM4NUKoVLly7hueeew6VLl4wvKJVKmUx5CRjS90LA0T4TqQlp0AFg2ufywVw/hT4VAgs1 lYdufjxo+uqhb/Yamb5GNKItoRHojGjd9PbqTzq/9Et/4dF57rouPM+z+yuqAF7t/3w3gO6ZL3ir q6tmeWNqSiwhI0mHDDNkWZbikWvLMHmVEV/Sp8J6YIE+9jCK/BrRiHaQnMbXH97tPozoPqNnc//N e+2114wvqNFo4I033sDc3Fx/MbVez5fsyOrKpVLJLBdMbYW+FWozVuAb0YhGtGdoBDoj2jW6evAv vVu3bmFhYQH1eh2NRsPU/mKYMUu2ZDIZ7L/84RGgjGhEdzn9f889dbGSaEq0AAAAAElFTkSuQmCC  "
     height="88.842514"
     width="107.88189" />
  <rect
     style="fill:#ffffff;fill-opacity:1;stroke:none"
     id="rect3756"
     width="34.251968"
     height="15.748032"
     x="1.5748031"
     y="41.362206" />
  <rect
     style="fill:#ffffff;fill-opacity:1;stroke:none"
     id="rect3756-1"
     width="45.669292"
     height="15.748032"
     x="103.34646"
     y="42.968506" />
  <text
     xml:space="preserve"
     style="font-size:40px;font-style:normal;font-weight:normal;line-height:125%;letter-spacing:0px;word-spacing:0px;fill:#000000;fill-opacity:1;stroke:none;font-family:Sans"
     x="106.26772"
     y="53.992123"
     id="text2993"
     sodipodi:linespacing="125%"><tspan
       sodipodi:role="line"
       id="tspan2995"
       x="106.26772"
       y="53.992123"
       style="font-size:12px">position</tspan></text>
  <text
     xml:space="preserve"
     style="font-size:40px;font-style:normal;font-weight:normal;line-height:125%;letter-spacing:0px;word-spacing:0px;fill:#000000;fill-opacity:1;stroke:none;font-family:Sans;stroke-opacity:1"
     x="2.3622341"
     y="52.704922"
     id="text2993-1-9"
     sodipodi:linespacing="125%"><tspan
       sodipodi:role="line"
       id="tspan2995-7-4"
       x="2.3622341"
       y="52.704922"
       style="font-size:12px;stroke:none;stroke-opacity:1;fill:#000000;fill-opacity:1">points</tspan></text>
</svg>
