<?xml version="1.0" encoding="utf-8"?>
<!DOCTYPE svg PUBLIC "-//W3C//DTD SVG 1.1//EN" "http://www.w3.org/Graphics/SVG/1.1/DTD/svg11.dtd">
<svg version="1.1"
	 id="svg2" xmlns:dc="http://purl.org/dc/elements/1.1/" xmlns:cc="http://creativecommons.org/ns#" xmlns:rdf="http://www.w3.org/1999/02/22-rdf-syntax-ns#" xmlns:svg="http://www.w3.org/2000/svg" xmlns:sodipodi="http://sodipodi.sourceforge.net/DTD/sodipodi-0.dtd" xmlns:inkscape="http://www.inkscape.org/namespaces/inkscape" sodipodi:docname="SEUIL.svg" inkscape:version="0.48.2 r9819"
	 xmlns="http://www.w3.org/2000/svg" xmlns:xlink="http://www.w3.org/1999/xlink" x="0px" y="0px" width="40px" height="40px"
	 viewBox="0 0 40 40" enable-background="new 0 0 40 40" xml:space="preserve">
<line fill="none" stroke="#000000" stroke-width="0.5"  stroke-linecap="round" stroke-miterlimit="10" x1="2"  y1="30" x2="38" y2="30"/>
<line fill="none" stroke="#000000" stroke-width="0.5"  stroke-linecap="round" stroke-miterlimit="10" x1="10" y1="2"  x2="10" y2="38"/>

<line fill="none" stroke="#000000" stroke-width="2"    stroke-linecap="round" stroke-miterlimit="10" x1="5"  y1="30" x2="15" y2="30"/>
<line fill="none" stroke="#000000" stroke-width="2"    stroke-linecap="round" stroke-miterlimit="10" x1="15" y1="30" x2="18" y2="10"/>
<line fill="none" stroke="#000000" stroke-width="2"    stroke-linecap="round" stroke-miterlimit="10" x1="18" y1="10" x2="27" y2="10"/>
<line fill="none" stroke="#000000" stroke-width="2"    stroke-linecap="round" stroke-miterlimit="10" x1="27" y1="10" x2="30" y2="30"/>
<line fill="none" stroke="#000000" stroke-width="2"    stroke-linecap="round" stroke-miterlimit="10" x1="30" y1="30" x2="35" y2="30"/>

</svg>
