// ============================================================================
// Scilab ( http://www.scilab.org/ ) - This file is part of Scilab
// Copyright (C) 2013 - Scilab Enterprises - Charlotte HECQUET
//
//  This file is distributed under the same license as the Scilab package.
// ============================================================================
//
// <-- ENGLISH IMPOSED -->
//
// <-- Short Description -->
// Test MEAB_Inductor
[a, coselicaMacrosPath] = libraryinfo(whereis(getCoselicaVersion));
try
    ilib_verbose(0);
    assert_checktrue(importXcosDiagram(fullfile(coselicaMacrosPath, "../../tests/unit_tests/Electrical/Basic/MEAB_Inductor.zcos")));
    xcos_simulate(scs_m, 4);
    current = res.values(:,1);
    dcurrent = res.values(:,2);
    voltage = res.values(:,3);
    assert_checktrue(abs(voltage - (2*dcurrent+1*current)) < 1e-5);
catch
   disp(lasterror())
   assert_checktrue(%f);
end
--------------------------------------------\
 Main Modelica : TMPDIR\MEAB_Inductor_im.mo
 Flat Modelica : TMPDIR\MEAB_Inductor_imf.mo
 Simulation C code :TMPDIR\MEAB_Inductor_im.c
  "Modelica blocks are reduced to a block with:"                       
  "Number of differential states: 1"                                   
  "Number of algebraic states: 0"                                      
  "Number of discrete time states  : 0"                                
  "Number of zero-crossing surfaces: 0"                                
  "Number of modes  : 0"                                               
  "Number of inputs : 0"                                               
  "Number of outputs: 3"                                               
  "Input/output dependency:[T]"                                        
  "Analytical Jacobian: enabled  (%Jacobian=%t)"                       
  "Parameter embedding mode: enabled (%Modelica_ParEmb=%t)"            
  ""                                                                   
  "Generated files path: TMPDIR\"
  ""                                                                   
WARNING: Diagram contains implicit blocks, compiling for implicit Solver.
WARNING: Diagram has been compiled for implicit solver
WARNING: switching to implicit Solver
