// ============================================================================
// Scilab ( http://www.scilab.org/ ) - This file is part of Scilab
// Copyright (C) 2013 - Scilab Enterprises - Charlotte HECQUET
//
//  This file is distributed under the same license as the Scilab package.
// ============================================================================
//
// <-- ENGLISH IMPOSED -->
//
// <-- Short Description -->
// Test MEAI_IdealOpeningSwitch
[a, coselicaMacrosPath] = libraryinfo(whereis(getCoselicaVersion));
try
    ilib_verbose(0);
    assert_checktrue(importXcosDiagram(fullfile(coselicaMacrosPath, "../../tests/unit_tests/Electrical/Ideal/MEAI_IdealOpeningSwitch.zcos")));
    xcos_simulate(scs_m, 4);
    
    V = res.values(:,1);
    I = res.values(:,2);
    cmd = res.values(:,3);
    R = 0.5;
    Ron = 0.00001;
    Goff = 0.00001;
    ind = find(cmd>0);
    assert_checkalmostequal(I(ind), V(ind)*Goff, 1e-5);
    ind = find(cmd==0);
    ind = ind(2:$);
    assert_checkalmostequal(I(ind), V(ind)/(R+Ron), 1e-5);
catch
   disp(lasterror())
   assert_checktrue(%f);
end
--------------------------------------------\
 Main Modelica : TMPDIR\MEAI_IdealOpeningSwitch_im.mo
 Flat Modelica : TMPDIR\MEAI_IdealOpeningSwitch_imf.mo
 Simulation C code :TMPDIR\MEAI_IdealOpeningSwitch_im.c
  "Modelica blocks are reduced to a block with:"                       
  "Number of differential states: 0"                                   
  "Number of algebraic states: 1"                                      
  "Number of discrete time states  : 0"                                
  "Number of zero-crossing surfaces: 3"                                
  "Number of modes  : 3"                                               
  "Number of inputs : 0"                                               
  "Number of outputs: 3"                                               
  "Input/output dependency:[T]"                                        
  "Analytical Jacobian: enabled  (%Jacobian=%t)"                       
  "Parameter embedding mode: enabled (%Modelica_ParEmb=%t)"            
  ""                                                                   
  "Generated files path: TMPDIR\"
  ""                                                                   
WARNING: Diagram contains implicit blocks, compiling for implicit Solver.
WARNING: Diagram has been compiled for implicit solver
WARNING: switching to implicit Solver
