// ============================================================================
// Scilab ( http://www.scilab.org/ ) - This file is part of Scilab
// Copyright (C) 2013 - Scilab Enterprises - Charlotte HECQUET
//
//  This file is distributed under the same license as the Scilab package.
// ============================================================================
//
// <-- ENGLISH IMPOSED -->
//
// <-- Short Description -->
// Test MEAS_PNP
[a, coselicaMacrosPath] = libraryinfo(whereis(getCoselicaVersion));
try
    ilib_verbose(0);
    assert_checktrue(importXcosDiagram(fullfile(coselicaMacrosPath, "../../tests/unit_tests/Electrical/Semi-conductors/MEAS_PNP.zcos")));
    xcos_simulate(scs_m, 4);
    
    Vec = res.values(:,1);
    Ib = res.values(:,2);
    Valim = 12*ones(Vec);
    
    ind = find(Ib < 0);
    assert_checktrue(abs(Vec(ind)) < 1d-3);
    ind = find(Ib >= 0);
    assert_checkalmostequal(Vec(ind), Valim(ind));
catch
   disp(lasterror())
   assert_checktrue(%f);
end
--------------------------------------------\
 Main Modelica : TMPDIR\MEAS_PNP_im.mo
 Flat Modelica : TMPDIR\MEAS_PNP_imf.mo
 Simulation C code :TMPDIR\MEAS_PNP_im.c
  "Modelica blocks are reduced to a block with:"                       
  "Number of differential states: 3"                                   
  "Number of algebraic states: 1"                                      
  "Number of discrete time states  : 0"                                
  "Number of zero-crossing surfaces: 9"                                
  "Number of modes  : 8"                                               
  "Number of inputs : 0"                                               
  "Number of outputs: 2"                                               
  "Input/output dependency:[T]"                                        
  "Analytical Jacobian: enabled  (%Jacobian=%t)"                       
  "Parameter embedding mode: enabled (%Modelica_ParEmb=%t)"            
  ""                                                                   
  "Generated files path: TMPDIR\"
  ""                                                                   
WARNING: Diagram contains implicit blocks, compiling for implicit Solver.
WARNING: Diagram has been compiled for implicit solver
WARNING: switching to implicit Solver
