// ============================================================================
// Scilab ( http://www.scilab.org/ ) - This file is part of Scilab
// Copyright (C) 2013 - Scilab Enterprises - Charlotte HECQUET
//
//  This file is distributed under the same license as the Scilab package.
// ============================================================================
//
// <-- ENGLISH IMPOSED -->
//
// <-- Short Description -->
// Test CMRC_IdealDifferential
[a, coselicaMacrosPath] = libraryinfo(whereis(getCoselicaVersion));
try
    ilib_verbose(0);
    assert_checktrue(importXcosDiagram(fullfile(coselicaMacrosPath, "/../../tests/unit_tests/Mechanics/Rotational/CMRC_IdealDifferential.zcos")));
    xcos_simulate(scs_m, 4);
    drive_shaft = res.values(:,1);
    left_wheel = res.values(:,2);
    right_wheel = res.values(:,3);
    assert_checkalmostequal(drive_shaft, 3*(left_wheel+right_wheel)/2);
catch
   disp(lasterror())
   assert_checktrue(%f);
end
--------------------------------------------\
 Main Modelica : TMPDIR\CMRC_IdealDifferential_im.mo
 Flat Modelica : TMPDIR\CMRC_IdealDifferential_imf.mo
 Simulation C code :TMPDIR\CMRC_IdealDifferential_im.c
  "Modelica blocks are reduced to a block with:"                       
  "Number of differential states: 3"                                   
  "Number of algebraic states: 1"                                      
  "Number of discrete time states  : 1"                                
  "Number of zero-crossing surfaces: 4"                                
  "Number of modes  : 3"                                               
  "Number of inputs : 0"                                               
  "Number of outputs: 3"                                               
  "Input/output dependency:[T]"                                        
  "Analytical Jacobian: enabled  (%Jacobian=%t)"                       
  "Parameter embedding mode: enabled (%Modelica_ParEmb=%t)"            
  ""                                                                   
  "Generated files path: TMPDIR\"
  ""                                                                   
WARNING: Diagram contains implicit blocks, compiling for implicit Solver.
WARNING: Diagram has been compiled for implicit solver
WARNING: switching to implicit Solver
