// ============================================================================
// Scilab ( http://www.scilab.org/ ) - This file is part of Scilab
// Copyright (C) 2013 - Scilab Enterprises - Charlotte HECQUET
//
//  This file is distributed under the same license as the Scilab package.
// ============================================================================
//
// <-- ENGLISH IMPOSED -->
//
// <-- Short Description -->
// Test MEAI_IdealOpAmp3Pin
[a, coselicaMacrosPath] = libraryinfo(whereis(getCoselicaVersion));
try
    ilib_verbose(0);
    assert_checktrue(importXcosDiagram(fullfile(coselicaMacrosPath, "../../tests/unit_tests/Electrical/Ideal/MEAI_IdealOpAmp3Pin.zcos")));
    xcos_simulate(scs_m, 4);
    
    q1 = res.values(:,1);
    V2 = res.values(:,2);
    q2 = res.values(:,3);
    V1 = res.values(:,4);
    R1 = 2;
    R2 = 3;
    assert_checkequal(q1, q2);
    assert_checkequal(V2, V1*(1+R2/R1));
catch
   disp(lasterror())
   assert_checktrue(%f);
end
--------------------------------------------\
 Main Modelica : TMPDIR\Sans_titre_10_26_28_im.mo
 Flat Modelica : TMPDIR\Sans_titre_10_26_28_imf.mo
 Simulation C code :TMPDIR\Sans_titre_10_26_28_im.c
  "Modelica blocks are reduced to a block with:"                       
  "Number of differential states: 0"                                   
  "Number of algebraic states: 1"                                      
  "Number of discrete time states  : 0"                                
  "Number of zero-crossing surfaces: 0"                                
  "Number of modes  : 0"                                               
  "Number of inputs : 0"                                               
  "Number of outputs: 4"                                               
  "Input/output dependency:[T]"                                        
  "Analytical Jacobian: enabled  (%Jacobian=%t)"                       
  "Parameter embedding mode: enabled (%Modelica_ParEmb=%t)"            
  ""                                                                   
  "Generated files path: TMPDIR\"
  ""                                                                   
WARNING: Diagram contains implicit blocks, compiling for implicit Solver.
WARNING: Diagram has been compiled for implicit solver
WARNING: switching to implicit Solver
