// ============================================================================
// Scilab ( http://www.scilab.org/ ) - This file is part of Scilab
// Copyright (C) 2013 - Scilab Enterprises - Charlotte HECQUET
//
//  This file is distributed under the same license as the Scilab package.
// ============================================================================
//
// <-- ENGLISH IMPOSED -->
//
// <-- Short Description -->
// Test MEAS_Diode
[a, coselicaMacrosPath] = libraryinfo(whereis(getCoselicaVersion));
try
    ilib_verbose(0);
    assert_checktrue(importXcosDiagram(fullfile(coselicaMacrosPath, "../../tests/unit_tests/Electrical/Semi-conductors/MEAS_Diode.zcos")));
    xcos_simulate(scs_m, 4);
    
    Iout = res.values(:,1);
    Vin = res.values(:,2);
    Ids = 0.000001;
    Vt = 0.04;
    Maxexp = 15;
    R = 1.000d+08;
    ind = find(Vin/Vt > Maxexp);
    assert_checktrue(Iout(ind) - (Ids * (exp(Maxexp) * (1 + Vin(ind)/Vt - Maxexp) - 1) + Vin(ind)/R) < 1d-11);
    ind = find(Vin/Vt <= Maxexp);
    assert_checkalmostequal(Iout(ind), Ids * (exp(Vin(ind)/Vt) - 1) + Vin(ind)/R);
catch
   disp(lasterror())
   assert_checktrue(%f);
end
--------------------------------------------\
 Main Modelica : TMPDIR\MEAS_Diode_im.mo
 Flat Modelica : TMPDIR\MEAS_Diode_imf.mo
 Simulation C code :TMPDIR\MEAS_Diode_im.c
  "Modelica blocks are reduced to a block with:"                       
  "Number of differential states: 0"                                   
  "Number of algebraic states: 1"                                      
  "Number of discrete time states  : 0"                                
  "Number of zero-crossing surfaces: 2"                                
  "Number of modes  : 2"                                               
  "Number of inputs : 0"                                               
  "Number of outputs: 2"                                               
  "Input/output dependency:[T]"                                        
  "Analytical Jacobian: enabled  (%Jacobian=%t)"                       
  "Parameter embedding mode: enabled (%Modelica_ParEmb=%t)"            
  ""                                                                   
  "Generated files path: TMPDIR\"
  ""                                                                   
WARNING: Diagram contains implicit blocks, compiling for implicit Solver.
WARNING: Diagram has been compiled for implicit solver
WARNING: switching to implicit Solver
