// ============================================================================
// Scilab ( http://www.scilab.org/ ) - This file is part of Scilab
// Copyright (C) 2013 - Scilab Enterprises - Charlotte HECQUET
//
//  This file is distributed under the same license as the Scilab package.
// ============================================================================
//
// <-- ENGLISH IMPOSED -->
//
// <-- Short Description -->
// Test MEAB_Conductor
[a, coselicaMacrosPath] = libraryinfo(whereis(getCoselicaVersion));
try
    ilib_verbose(0);
    assert_checktrue(importXcosDiagram(fullfile(coselicaMacrosPath, "../../tests/unit_tests/Electrical/Basic/MEAB_Conductor.zcos")));
    xcos_simulate(scs_m, 4);
    out = res.values(:,2);
    in = res.values(:,1);
    assert_checkalmostequal(out, in*2);
catch
   disp(lasterror())
   assert_checktrue(%f);
end
--------------------------------------------\
 Main Modelica : TMPDIR\Sans_titre_15_14_49_im.mo
 Flat Modelica : TMPDIR\Sans_titre_15_14_49_imf.mo
 Simulation C code :TMPDIR\Sans_titre_15_14_49_im.c
  "Modelica blocks are reduced to a block with:"                       
  "Number of differential states: 0"                                   
  "Number of algebraic states: 0"                                      
  "Number of discrete time states  : 0"                                
  "Number of zero-crossing surfaces: 0"                                
  "Number of modes  : 0"                                               
  "Number of inputs : 0"                                               
  "Number of outputs: 2"                                               
  "Input/output dependency:[T]"                                        
  "Analytical Jacobian: enabled  (%Jacobian=%t)"                       
  "Parameter embedding mode: enabled (%Modelica_ParEmb=%t)"            
  ""                                                                   
  "Generated files path: TMPDIR\"
  ""                                                                   
WARNING: Diagram contains implicit blocks, compiling for implicit Solver.
