// ============================================================================
// Scilab ( http://www.scilab.org/ ) - This file is part of Scilab
// Copyright (C) 2013 - Scilab Enterprises - Charlotte HECQUET
//
//  This file is distributed under the same license as the Scilab package.
// ============================================================================
//
// <-- ENGLISH IMPOSED -->
//
// <-- Short Description -->
// Test MMR_IdealGear0
[a, coselicaMacrosPath] = libraryinfo(whereis(getCoselicaVersion));
try
    ilib_verbose(0);
    assert_checktrue(importXcosDiagram(fullfile(coselicaMacrosPath, "/../../tests/unit_tests/Mechanics/Rotational/MMR_IdealGear0.zcos")));
    xcos_simulate(scs_m, 4);
    values = res.values;
    assert_checktrue(res.values - 0.5*ones(300,1) < 10*%eps);
catch
   disp(lasterror())
   assert_checktrue(%f);
end
--------------------------------------------\
 Main Modelica : TMPDIR\MMR_IdealGear0_im.mo
 Flat Modelica : TMPDIR\MMR_IdealGear0_imf.mo
 Simulation C code :TMPDIR\MMR_IdealGear0_im.c
  "Modelica blocks are reduced to a block with:"                       
  "Number of differential states: 2"                                   
  "Number of algebraic states: 1"                                      
  "Number of discrete time states  : 0"                                
  "Number of zero-crossing surfaces: 0"                                
  "Number of modes  : 0"                                               
  "Number of inputs : 0"                                               
  "Number of outputs: 1"                                               
  "Input/output dependency:[T]"                                        
  "Analytical Jacobian: enabled  (%Jacobian=%t)"                       
  "Parameter embedding mode: enabled (%Modelica_ParEmb=%t)"            
  ""                                                                   
  "Generated files path: TMPDIR\"
  ""                                                                   
WARNING: Diagram contains implicit blocks, compiling for implicit Solver.
WARNING: Diagram has been compiled for implicit solver
WARNING: switching to implicit Solver
