# Copyright (C) 2010 - Michael Baudin
#
# This file must be used under the terms of the CeCILL.
# This source file is licensed as described in the file COPYING, which
# you should have received as part of this distribution.  The terms
# are also available at
# http://www.cecill.info/licences/Licence_CeCILL_V2-en.txt

#
# Caution.
# This data file makes use of decimal digits.
# Therefore, computations performed on binary computers may be exact, 
# even if they are not the same as the decimal numbers displayed in this file.
#
# The computation is (a+%i*b)/(c+%i*d)=e+%i*f,
# and the columns are [a,b,c,d,e,f].
#
-1,-1,-1,-1,1.00000000000000000000,0.000000000000000000000
-1,-1,-1,0,1.00000000000000000000,1.00000000000000000000
-1,-1,-1,1,0.000000000000000000000,1.00000000000000000000
-1,-1,0,-1,1.00000000000000000000,-1.00000000000000000000
-1,-1,0,1,-1.00000000000000000000,1.00000000000000000000
-1,-1,1,-1,0.000000000000000000000,-1.00000000000000000000
-1,-1,1,0,-1.00000000000000000000,-1.00000000000000000000
-1,-1,1,1,-1.00000000000000000000,0.000000000000000000000
-1,0,-1,-1,0.500000000000000000000,-0.500000000000000000000
-1,0,-1,0,1.00000000000000000000,0.000000000000000000000
-1,0,-1,1,0.500000000000000000000,0.500000000000000000000
-1,0,0,-1,0.000000000000000000000,-1.00000000000000000000
-1,0,0,1,0.000000000000000000000,1.00000000000000000000
-1,0,1,-1,-0.500000000000000000000,-0.500000000000000000000
-1,0,1,0,-1.00000000000000000000,0.000000000000000000000
-1,0,1,1,-0.500000000000000000000,0.500000000000000000000
-1,1,-1,-1,0.000000000000000000000,-1.00000000000000000000
-1,1,-1,0,1.00000000000000000000,-1.00000000000000000000
-1,1,-1,1,1.00000000000000000000,0.000000000000000000000
-1,1,0,-1,-1.00000000000000000000,-1.00000000000000000000
-1,1,0,1,1.00000000000000000000,1.00000000000000000000
-1,1,1,-1,-1.00000000000000000000,0.000000000000000000000
-1,1,1,0,-1.00000000000000000000,1.00000000000000000000
-1,1,1,1,0.000000000000000000000,1.00000000000000000000
0,-1,-1,-1,0.500000000000000000000,0.500000000000000000000
0,-1,-1,0,0.000000000000000000000,1.00000000000000000000
0,-1,-1,1,-0.500000000000000000000,0.500000000000000000000
0,-1,0,-1,1.00000000000000000000,0.000000000000000000000
0,-1,0,1,-1.00000000000000000000,0.000000000000000000000
0,-1,1,-1,0.500000000000000000000,-0.500000000000000000000
0,-1,1,0,0.000000000000000000000,-1.00000000000000000000
0,-1,1,1,-0.500000000000000000000,-0.500000000000000000000
0,0,-1,-1,0.000000000000000000000,0.000000000000000000000
0,0,-1,0,0.000000000000000000000,0.000000000000000000000
0,0,-1,1,0.000000000000000000000,0.000000000000000000000
0,0,0,-1,0.000000000000000000000,0.000000000000000000000
0,0,0,1,0.000000000000000000000,0.000000000000000000000
0,0,1,-1,0.000000000000000000000,0.000000000000000000000
0,0,1,0,0.000000000000000000000,0.000000000000000000000
0,0,1,1,0.000000000000000000000,0.000000000000000000000
0,1,-1,-1,-0.500000000000000000000,-0.500000000000000000000
0,1,-1,0,0.000000000000000000000,-1.00000000000000000000
0,1,-1,1,0.500000000000000000000,-0.500000000000000000000
0,1,0,-1,-1.00000000000000000000,0.000000000000000000000
0,1,0,1,1.00000000000000000000,0.000000000000000000000
0,1,1,-1,-0.500000000000000000000,0.500000000000000000000
0,1,1,0,0.000000000000000000000,1.00000000000000000000
0,1,1,1,0.500000000000000000000,0.500000000000000000000
1,-1,-1,-1,0.000000000000000000000,1.00000000000000000000
1,-1,-1,0,-1.00000000000000000000,1.00000000000000000000
1,-1,-1,1,-1.00000000000000000000,0.000000000000000000000
1,-1,0,-1,1.00000000000000000000,1.00000000000000000000
1,-1,0,1,-1.00000000000000000000,-1.00000000000000000000
1,-1,1,-1,1.00000000000000000000,0.000000000000000000000
1,-1,1,0,1.00000000000000000000,-1.00000000000000000000
1,-1,1,1,0.000000000000000000000,-1.00000000000000000000
1,0,-1,-1,-0.500000000000000000000,0.500000000000000000000
1,0,-1,0,-1.00000000000000000000,0.000000000000000000000
1,0,-1,1,-0.500000000000000000000,-0.500000000000000000000
1,0,0,-1,0.000000000000000000000,1.00000000000000000000
1,0,0,1,0.000000000000000000000,-1.00000000000000000000
1,0,1,-1,0.500000000000000000000,0.500000000000000000000
1,0,1,0,1.00000000000000000000,0.000000000000000000000
1,0,1,1,0.500000000000000000000,-0.500000000000000000000
1,1,-1,-1,-1.00000000000000000000,0.000000000000000000000
1,1,-1,0,-1.00000000000000000000,-1.00000000000000000000
1,1,-1,1,0.000000000000000000000,-1.00000000000000000000
1,1,0,-1,-1.00000000000000000000,1.00000000000000000000
1,1,0,1,1.00000000000000000000,-1.00000000000000000000
1,1,1,-1,0.000000000000000000000,1.00000000000000000000
1,1,1,0,1.00000000000000000000,1.00000000000000000000
1,1,1,1,1.00000000000000000000,0.000000000000000000000
#
-2,-2,-2,-2,1.00000000000000000000,0.000000000000000000000
-2,-2,-2,2,0.000000000000000000000,1.00000000000000000000
-2,-2,2,-2,0.000000000000000000000,-1.00000000000000000000
-2,-2,2,2,-1.00000000000000000000,0.000000000000000000000
-2,2,-2,-2,0.000000000000000000000,-1.00000000000000000000
-2,2,-2,2,1.00000000000000000000,0.000000000000000000000
-2,2,2,-2,-1.00000000000000000000,0.000000000000000000000
-2,2,2,2,0.000000000000000000000,1.00000000000000000000
2,-2,-2,-2,0.000000000000000000000,1.00000000000000000000
2,-2,-2,2,-1.00000000000000000000,0.000000000000000000000
2,-2,2,-2,1.00000000000000000000,0.000000000000000000000
2,-2,2,2,0.000000000000000000000,-1.00000000000000000000
2,2,-2,-2,-1.00000000000000000000,0.000000000000000000000
2,2,-2,2,0.000000000000000000000,-1.00000000000000000000
2,2,2,-2,0.000000000000000000000,1.00000000000000000000
2,2,2,2,1.00000000000000000000,0.000000000000000000000
#
# Particular case : division by zero.
#
+1,+0,+0,+0,+Inf,+0
+1,+0,+0,-0,+Inf,+0
+1,+0,-0,+0,+Inf,+0
+1,+0,-0,-0,-Inf,+0
#
+1,+1,+0,+0,+Inf,+Inf
+1,-1,+0,+0,+Inf,-Inf
-1,+1,+0,+0,-Inf,+Inf
-1,-1,+0,+0,-Inf,-Inf
#
+1,+1,+0,+0,+Inf,+Inf
+1,+1,-0,+0,+Inf,+Inf
+1,+1,+0,-0,+Inf,+Inf
+1,+1,-0,-0,-Inf,-Inf
#
0.999999999999999999996e-308,1.00000000000000000000,1.00000000000000000000,1.00000000000000000000,0.500000000000000000000,0.500000000000000000000
0.999999999999999999994e-231,1.00000000000000000000,1.00000000000000000000,1.00000000000000000000,0.500000000000000000000,0.500000000000000000000
0.999999999999999999995e-155,1.00000000000000000000,1.00000000000000000000,1.00000000000000000000,0.500000000000000000000,0.500000000000000000000
0.100000000000000000001e-77,1.00000000000000000000,1.00000000000000000000,1.00000000000000000000,0.500000000000000000000,0.500000000000000000000
0.999999999999999999994e78,1.00000000000000000000,1.00000000000000000000,1.00000000000000000000,0.499999999999999999997e78,-0.499999999999999999997e78
0.100000000000000000000e156,1.00000000000000000000,1.00000000000000000000,1.00000000000000000000,0.500000000000000000001e155,-0.500000000000000000001e155
0.100000000000000000000e232,1.00000000000000000000,1.00000000000000000000,1.00000000000000000000,0.500000000000000000001e231,-0.500000000000000000001e231
0.100000000000000000000e309,1.00000000000000000000,1.00000000000000000000,1.00000000000000000000,0.500000000000000000002e308,-0.500000000000000000002e308
#
1.00000000000000000000,0.999999999999999999996e-308,1.00000000000000000000,1.00000000000000000000,0.500000000000000000000,-0.500000000000000000000
1.00000000000000000000,0.999999999999999999994e-231,1.00000000000000000000,1.00000000000000000000,0.500000000000000000000,-0.500000000000000000000
1.00000000000000000000,0.999999999999999999995e-155,1.00000000000000000000,1.00000000000000000000,0.500000000000000000000,-0.500000000000000000000
1.00000000000000000000,0.100000000000000000001e-77,1.00000000000000000000,1.00000000000000000000,0.500000000000000000000,-0.500000000000000000000
1.00000000000000000000,0.999999999999999999994e78,1.00000000000000000000,1.00000000000000000000,0.499999999999999999997e78,0.499999999999999999997e78
1.00000000000000000000,0.100000000000000000000e156,1.00000000000000000000,1.00000000000000000000,0.500000000000000000001e155,0.500000000000000000001e155
1.00000000000000000000,0.100000000000000000000e232,1.00000000000000000000,1.00000000000000000000,0.500000000000000000001e231,0.500000000000000000001e231
1.00000000000000000000,0.100000000000000000000e309,1.00000000000000000000,1.00000000000000000000,0.500000000000000000002e308,0.500000000000000000002e308
#
# Cases where the naive formula may fail, while Smith works.
#
1.00000000000000000000,1.00000000000000000000,0.999999999999999999996e-308,1.00000000000000000000,1.00000000000000000000,-1.00000000000000000000
1.00000000000000000000,1.00000000000000000000,0.999999999999999999994e-231,1.00000000000000000000,1.00000000000000000000,-1.00000000000000000000
1.00000000000000000000,1.00000000000000000000,0.999999999999999999995e-155,1.00000000000000000000,1.00000000000000000000,-1.00000000000000000000
1.00000000000000000000,1.00000000000000000000,0.100000000000000000001e-77,1.00000000000000000000,1.00000000000000000000,-1.00000000000000000000
1.00000000000000000000,1.00000000000000000000,0.999999999999999999994e78,1.00000000000000000000,0.999999999999999999998e-78,0.999999999999999999998e-78
1.00000000000000000000,1.00000000000000000000,0.100000000000000000000e156,1.00000000000000000000,0.100000000000000000001e-154,0.100000000000000000001e-154
1.00000000000000000000,1.00000000000000000000,0.100000000000000000000e232,1.00000000000000000000,0.100000000000000000000e-230,0.100000000000000000000e-230
1.00000000000000000000,1.00000000000000000000,0.100000000000000000000e309,1.00000000000000000000,0.100000000000000000000e-307,0.100000000000000000000e-307
#
1.00000000000000000000,1.00000000000000000000,1.00000000000000000000,0.999999999999999999996e-308,1.00000000000000000000,1.00000000000000000000
1.00000000000000000000,1.00000000000000000000,1.00000000000000000000,0.999999999999999999994e-231,1.00000000000000000000,1.00000000000000000000
1.00000000000000000000,1.00000000000000000000,1.00000000000000000000,0.999999999999999999995e-155,1.00000000000000000000,1.00000000000000000000
1.00000000000000000000,1.00000000000000000000,1.00000000000000000000,0.100000000000000000001e-77,1.00000000000000000000,1.00000000000000000000
1.00000000000000000000,1.00000000000000000000,1.00000000000000000000,0.999999999999999999994e78,0.999999999999999999998e-78,-0.999999999999999999998e-78
1.00000000000000000000,1.00000000000000000000,1.00000000000000000000,0.100000000000000000000e156,0.100000000000000000001e-154,-0.100000000000000000001e-154
1.00000000000000000000,1.00000000000000000000,1.00000000000000000000,0.100000000000000000000e232,0.100000000000000000000e-230,-0.100000000000000000000e-230
1.00000000000000000000,1.00000000000000000000,1.00000000000000000000,0.100000000000000000000e309,0.100000000000000000000e-307,-0.100000000000000000000e-307
#
# Cases where Smith produce a zero imaginary part.
#
0.999999999999999999997e210,0.100000000000000000000e-209,0.999999999999999999999e170,0.999999999999999999999e-170,0.100000000000000000001e41,-0.999999999999999999996e-300
0.999999999999999999997e220,0.100000000000000000000e-219,0.999999999999999999999e170,0.999999999999999999999e-170,0.999999999999999999998e50,-0.100000000000000000000e-289
0.100000000000000000001e231,0.999999999999999999992e-230,0.999999999999999999999e170,0.999999999999999999999e-170,0.100000000000000000001e61,-0.100000000000000000000e-279
0.999999999999999999995e240,0.100000000000000000000e-239,0.999999999999999999999e170,0.999999999999999999999e-170,0.100000000000000000001e71,-0.100000000000000000000e-269
0.100000000000000000000e251,0.999999999999999999996e-250,0.999999999999999999999e170,0.999999999999999999999e-170,0.100000000000000000000e81,-0.100000000000000000001e-259
0.999999999999999999997e260,0.100000000000000000001e-259,0.999999999999999999999e170,0.999999999999999999999e-170,0.999999999999999999999e90,-0.100000000000000000001e-249
0.100000000000000000000e271,0.100000000000000000000e-269,0.999999999999999999999e170,0.999999999999999999999e-170,0.100000000000000000000e101,-0.100000000000000000001e-239
0.100000000000000000000e281,0.999999999999999999996e-280,0.999999999999999999999e170,0.999999999999999999999e-170,0.100000000000000000000e111,-0.100000000000000000001e-229
0.100000000000000000000e291,0.999999999999999999994e-290,0.999999999999999999999e170,0.999999999999999999999e-170,0.100000000000000000000e121,-0.100000000000000000000e-219
0.100000000000000000000e301,0.999999999999999999996e-300,0.999999999999999999999e170,0.999999999999999999999e-170,0.999999999999999999999e130,-0.100000000000000000001e-209
0.999999999999999999995e240,0.100000000000000000000e-239,0.999999999999999999998e180,0.999999999999999999996e-180,0.100000000000000000001e61,-0.100000000000000000001e-299
0.100000000000000000000e251,0.999999999999999999996e-250,0.999999999999999999998e180,0.999999999999999999996e-180,0.100000000000000000000e71,-0.100000000000000000001e-289
0.999999999999999999997e260,0.100000000000000000001e-259,0.999999999999999999998e180,0.999999999999999999996e-180,0.100000000000000000000e81,-0.999999999999999999996e-280
0.100000000000000000000e271,0.100000000000000000000e-269,0.999999999999999999998e180,0.999999999999999999996e-180,0.999999999999999999999e90,-0.100000000000000000000e-269
0.100000000000000000000e281,0.999999999999999999996e-280,0.999999999999999999998e180,0.999999999999999999996e-180,0.100000000000000000000e101,-0.999999999999999999995e-260
0.100000000000000000000e291,0.999999999999999999994e-290,0.999999999999999999998e180,0.999999999999999999996e-180,0.999999999999999999991e110,-0.100000000000000000001e-249
0.100000000000000000000e301,0.999999999999999999996e-300,0.999999999999999999998e180,0.999999999999999999996e-180,0.999999999999999999995e120,-0.100000000000000000000e-239
0.100000000000000000000e271,0.100000000000000000000e-269,0.100000000000000000000e191,0.100000000000000000000e-189,0.100000000000000000000e81,-0.100000000000000000001e-299
0.100000000000000000000e281,0.999999999999999999996e-280,0.100000000000000000000e191,0.100000000000000000000e-189,0.999999999999999999999e90,-0.100000000000000000000e-289
0.100000000000000000000e291,0.999999999999999999994e-290,0.100000000000000000000e191,0.100000000000000000000e-189,0.100000000000000000000e101,-0.100000000000000000000e-279
0.100000000000000000000e301,0.999999999999999999996e-300,0.100000000000000000000e191,0.100000000000000000000e-189,0.100000000000000000001e111,-0.100000000000000000000e-269
0.100000000000000000000e301,0.999999999999999999996e-300,0.100000000000000000000e201,0.100000000000000000000e-199,0.999999999999999999991e100,-0.100000000000000000001e-299
#
# Cases where Smith produces an infinite real part.
# This is because the expression (+/-)a+b*r or b+(+/-)a*r overflows.
#
1e308,1e308,1.e0  ,1.e0  ,1e308,0
1e308,1e308,1.e1  ,1.e1  ,1e307,0
1e308,1e308,1.e2  ,1.e2  ,1e306,0
1e308,1e308,1.e3  ,1.e3  ,1e305,0
1e308,1e308,1.e4  ,1.e4  ,1e304,0
1e308,1e308,1.e5  ,1.e5  ,1e303,0
1e308,1e308,1.e6  ,1.e6  ,1e302,0
1e308,1e308,1.e7  ,1.e7  ,1e301,0
1e308,1e308,1.e8  ,1.e8  ,1e300,0
1e308,1e308,1.e9  ,1.e9  ,1e299,0
1e308,1e308,1.e10 ,1.e10 ,1e298,0
1e308,1e308,1.e20 ,1.e20 ,1e288,0
1e308,1e308,1.e30 ,1.e30 ,1e278,0
1e308,1e308,1.e40 ,1.e40 ,1e268,0
1e308,1e308,1.e50 ,1.e50 ,1e258,0
1e308,1e308,1.e60 ,1.e60 ,1e248,0
1e308,1e308,1.e70 ,1.e70 ,1e238,0
1e308,1e308,1.e80 ,1.e80 ,1e228,0
1e308,1e308,1.e90 ,1.e90 ,1e218,0
1e308,1e308,1.e100,1.e100,1e208,0
1e308,1e308,1.e110,1.e110,1e198,0
1e308,1e308,1.e120,1.e120,1e188,0
1e308,1e308,1.e130,1.e130,1e178,0
1e308,1e308,1.e140,1.e140,1e168,0
1e308,1e308,1.e150,1.e150,1e158,0
1e308,1e308,1.e160,1.e160,1e148,0
1e308,1e308,1.e170,1.e170,1e138,0
1e308,1e308,1.e180,1.e180,1e128,0
1e308,1e308,1.e190,1.e190,1e118,0
1e308,1e308,1.e200,1.e200,1e108,0
1e308,1e308,1.e210,1.e210,1e98 ,0
1e308,1e308,1.e220,1.e220,1e88 ,0
1e308,1e308,1.e230,1.e230,1e78 ,0
1e308,1e308,1.e240,1.e240,1e68 ,0
1e308,1e308,1.e250,1.e250,1e58 ,0
1e308,1e308,1.e260,1.e260,1e48 ,0
1e308,1e308,1.e270,1.e270,1e38 ,0
1e308,1e308,1.e280,1.e280,1e28 ,0
1e308,1e308,1.e290,1.e290,1e18 ,0
1e308,1e308,1.e300,1.e300,1e8  ,0
1e308,1e308,1.e308,1.e308,1e0  ,0
#
# Case where Smith fails and produce zero.
# This is because the expressions c+d*r or d+c*r overflows.
#
1e0  ,1e0  ,1.e308,1.e308,1e-308,0
1e1  ,1e1  ,1.e308,1.e308,1e-307,0
1e2  ,1e2  ,1.e308,1.e308,1e-306,0
1e3  ,1e3  ,1.e308,1.e308,1e-305,0
1e4  ,1e4  ,1.e308,1.e308,1e-304,0
1e5  ,1e5  ,1.e308,1.e308,1e-303,0
1e6  ,1e6  ,1.e308,1.e308,1e-302,0
1e7  ,1e7  ,1.e308,1.e308,1e-301,0
1e8  ,1e8  ,1.e308,1.e308,1e-300,0
1e9  ,1e9  ,1.e308,1.e308,1e-299,0
1e10 ,1e10 ,1.e308,1.e308,1e-298,0
1e20 ,1e20 ,1.e308,1.e308,1e-288,0
1e30 ,1e30 ,1.e308,1.e308,1e-278,0
1e40 ,1e40 ,1.e308,1.e308,1e-268,0
1e50 ,1e50 ,1.e308,1.e308,1e-258,0
1e60 ,1e60 ,1.e308,1.e308,1e-248,0
1e70 ,1e70 ,1.e308,1.e308,1e-238,0
1e80 ,1e80 ,1.e308,1.e308,1e-228,0
1e90 ,1e90 ,1.e308,1.e308,1e-218,0
1e100,1e100,1.e308,1.e308,1e-208,0
1e110,1e110,1.e308,1.e308,1e-198,0
1e120,1e120,1.e308,1.e308,1e-188,0
1e130,1e130,1.e308,1.e308,1e-178,0
1e140,1e140,1.e308,1.e308,1e-168,0
1e150,1e150,1.e308,1.e308,1e-158,0
1e160,1e160,1.e308,1.e308,1e-148,0
1e170,1e170,1.e308,1.e308,1e-138,0
1e180,1e180,1.e308,1.e308,1e-128,0
1e190,1e190,1.e308,1.e308,1e-118,0
1e200,1e200,1.e308,1.e308,1e-108,0
1e210,1e210,1.e308,1.e308,1e-98,0
1e220,1e220,1.e308,1.e308,1e-88,0
1e230,1e230,1.e308,1.e308,1e-78,0
1e240,1e240,1.e308,1.e308,1e-68,0
1e250,1e250,1.e308,1.e308,1e-58,0
1e260,1e260,1.e308,1.e308,1e-48,0
1e270,1e270,1.e308,1.e308,1e-38,0
1e280,1e280,1.e308,1.e308,1e-28,0
1e290,1e290,1.e308,1.e308,1e-18,0
1e300,1e300,1.e308,1.e308,1e-8 ,0
1e308,1e308,1.e308,1.e308,1e0 ,0
#
# Failure cases for Improved Smith.
# Empirically found on Scilab/X87.
#
4.235164736271501695D-22,2.24711641857789488D+307,2.14301721437253464D+301,5.852095443365247909D-98,1.976262583364986176706e-323,1.0485760000000000000000e6
9.88131291682493088353e-324,1.16536573925003230364e-156,3.87662540363128737292e-267,5.85209544336524790894e-98,1.991364888915565346286e-59,-1.6753170303771359849366e-226
3.81867045437450585256e-152,3.95252516672997235341e-323,1.59309191113245227703e-58,4.68655254342384673381e-243,2.397018293602405544D-94,2.48104025832395340D-265
2.26627774989027955951e-218,3.16202013338397788273e-322,2.39951490223300952771e-240,2.88530581805804243149e-129,1.0959047398252103513893e-193,-7.8545495444763624849532e-90
1.47881523270846838872e-272,1.58101006669198894137e-322,1.23922941275178184730e-119,1.27447352890596182162e-57,1.24052012916314020582e-265,-1.16033420794382313447e-215
6.47581723317038670383e-319,1.51273121673801495032e-123,2.84809453888921777036e-306,5.58099312149548331160e-104,2.71050543121376108502e-20,-1.16033406962120656402e-215
1.91961192178640762217e-239,7.90505033345994470683e-323,7.18212087483073508066e-189,1.11619862429909666232e-103,7.19277606166348493009e-220,-1.71977628353717472046e-136
3.66136917454988026079e-245,8.32498966371958945452e-258,1.70495788312977192029e-254,1.06559867695610745018e-255,2.13912768049808478355e+09,-1.33695480030642017722e+08
2.12199579096527231511e-314,1.99343899021951350710e-205,6.91613082852258166355e-223,1.82877982605163997155e-99,1.09003771904208658430e-106,-1.16033420794381901213e-215
1.25260522500560798625e-293,2.52961610670718230618e-321,5.00520773795775231107e-147,1.88274989461162821698e-183,2.50260386897887615554e-147,5.05396825552649416023e-175
4.94065645841246544177e-324,6.05722719317388652018e-269,2.19180934900840303975e-193,1.51273121673801495032e-123,4.00416619036620184886e-146,-3.26605044157564512837e-201
2.00416836000897277800e-292,1.01184644268287292247e-320,3.74924203473907738704e-242,2.15195939047912308701e-283,5.34552942018439129228e-51,2.69880267346670712709e-79
1.97626258336498617671e-323,6.84940421565125949923e-195,2.87284834993229403226e-188,1.71056941445900521353e-49,4.00416619036620184886e-146,-1.15532440048624219773e-274
4.88789818159936749128e-150,4.94065645841246544177e-324,1.77635683940025046468e-15,1.71235105391281487481e-195,2.75164205365947955273e-135,2.78133967063926302227e-309
9.88131291682493088353e-324,1.28266775040574257792e-290,1.25672792711621799759e-88,7.38638289422858862461e-127,7.86279041950968144563e-236,1.02064076299239091564e-202
1.61895430829259667596e-319,1.00208418000448638900e-292,8.20053235786998138646e-143,6.31746033117530454161e-176,1.97420729486722997507e-177,1.22197454539984187282e-150
7.57153399146735815023e-270,5.05923221341436461237e-321,4.21687917729220928974e-81,8.27180612553027674871e-25,6.11628311340362040629e-297,-9.15342293637470065196e-246
1.12355820928894744233e+307,8.52478941564885960143e-255,2.99004108316488185849e+197,1.57254608632742512408e-235,3.75766813243813316462e+109,-1.97626258336498617671e-323
1.29516344663407734077e-318,1.33199834619513431272e-256,3.31561842338323799236e-316,5.72088933523418790748e-247,2.32830643653869628906e-10,-2.26391963476654441853e-72
9.28267366355058507576e-215,2.02369288536574584495e-320,5.94091114467237444848e-213,9.14389913025819985773e-100,2.21316193108458953301e-221,-1.01517673492625968931e-115
5.40322720978326692465e-225,8.09477154146298337979e-320,4.61648930889286789038e-128,2.58493941422821148397e-26,3.13151343581946736691e-294,-2.09027228260841659522e-199
4.94065645841246544177e-324,1.10658093256361306617e-221,2.73976168626050379969e-194,2.91644880782255899684e-303,1.80331656623034740397e-130,4.03896783473158044371e-28
4.04738577073149168989e-320,1.72903270713064541589e-223,1.74587687232488644637e-251,1.56412741811179759721e-148,1.10542957505208891205e-75,-2.58763051777043380757e-172
2.05226840064918812467e-289,4.14452302922904749045e-317,9.77579636319873498257e-150,1.17671868413226763562e-184,2.09933628361471523493e-140,4.23957560920397147940e-168
7.90505033345994470683e-323,1.16033420794382313447e-215,2.67276471009219564614e-51,5.42665710323505244981e-166,2.95763055356119341146e-272,4.34132568258804195985e-165
1.69583034476095389057e-167,1.58101006669198894137e-322,3.10130032290502989833e-266,8.51591968001630143982e-109,1.86378682150976590974e-214,-1.99136488891556534629e-59
1.01184644268287292247e-320,7.12023634722304442589e-307,4.28087763478203718702e-196,3.71306946542023403030e-214,2.36378679144405126200e-125,1.66326556250318387496e-111
4.94065645841246544177e-324,2.84809453888921777036e-306,6.16297582203915472978e-33,2.67276471009219564614e-51,1.00208418000448638900e-291,4.62129760221396371474e-274
3.96553412080570191137e-118,5.18065378653630936306e-318,2.15904213877361115635e-78,4.20304568452953727932e-286,1.83670992315982423120e-40,2.39951486647745118249e-240
2.07908195312897984371e-112,5.05923221341436461237e-321,4.02152936677189759230e-87,1.86652723700643775798e-301,5.16987882845642296795e-26,1.25803446954703786625e-234
#
# A set of former failures for Smith7, fixed in the current algorithm
#
1.23387897093267666828e-178,6.13636683162215819137e-92,4.99479768050558757021e+145,3.06499108173177771672e+54,4.94065645841246544177e-324,1.22855162994330087819e-237
1.10658093256361306617e-221,1.01412048018258352120e+31,5.73374653997517877903e+104,8.00833238073240369772e-146,4.94065645841246544177e-324,1.76868732008334225928e-74
7.00649232162408535462e-46,1.21144543863477730404e-268,1.71977628353717472046e-136,2.20855883097298041198e+71,4.94065645841246544177e-324,-3.17242729664456152909e-117
2.43886605493436893077e+142,1.35525271560688054251e-20,4.33229639706377321809e+127,5.48612406879368868326e+303,4.94065645841246544177e-324,-4.44551749897015496689e-162
3.06499108173177771672e+54,7.24454326306136989401e-71,3.04858256866796116346e+141,6.15015778615681042839e+259,4.94065645841246544177e-324,-4.98359747554878376776e-206
4.19867256722943046987e-140,1.03613075730726187261e-317,7.28353587031270189775e-158,3.51843720888320000000e+13,4.94065645841246544177e-324,-1.19333451699203307893e-153
4.03896783473158044371e-28,6.45562469521727147414e+119,1.75555970201398037864e+305,1.17936325775673167258e+167,4.94065645841246544177e-324,3.67724588791333636130e-186
5.03214747624776039705e-234,1.08420217248550443401e-19,4.37450144956602384875e+99,4.36015087616834633719e-106,4.94065645841246544177e-324,2.47845882550356369460e-119
6.10351562500000000000e-05,5.24288000000000000000e+05,8.51591968001630143982e-109,6.81273574401304115186e-108,7.57730888403227957652e+112,9.47163609608137050194e+111
5.24288000000000000000e+05,8.00000000000000000000e+00,1.77052949210178090587e-220,7.08211796840712362347e-220,1.74198470450575608225e+224,-6.96748697578963101422e+224
4.02571798099820831764e-233,6.29018434530970049632e-235,6.08349301214451143525e-210,3.98687798043902701420e-205,1.57926255402983268247e-30,-1.00974171770655330446e-28
4.32778879906336969812e+273,6.09082125712499942522e+287,1.91561942608236107295e+53,3.83123885216472214590e+53,1.27182282121274524280e+234,6.35911410606361325342e+233
3.42470210782562974961e-195,1.30642017663026037201e-200,5.33996758980227520599e+95,2.73406340597876490547e+98,2.45126353898749521301e-296,-1.25260043738150833190e-293
1.68121827381181491173e-285,1.18305218616677471097e-271,5.88359342066133817808e-185,2.94179671033066908904e-185,8.04305873354402333559e-88,1.60861174670874751775e-87
5.42101086242752217004e-20,3.55271367880050092936e-15,5.80167103971911567235e-216,1.16033420794382313447e-215,2.44946034308544086301e+200,1.22468345215079598023e+200
#
# Tough ones, even for Smith 7
#
2.88831100138372732171e-275,1.73833895195875108054e-310,1.88079096131566001275e-37,7.03687441776640000000e+13,4.94065645841246544177e-324,-4.10453680129837624934e-289

