// Copyright (C) 2010-2011 - DIGITEO - Michael Baudin
//
// This file must be used under the terms of the CeCILL.
// This source file is licensed as described in the file COPYING, which
// you should have received as part of this distribution.  The terms
// are also available at
// http://www.cecill.info/licences/Licence_CeCILL_V2-en.txt
f = compdiv_isfinite ( [1 2 %inf -%inf %nan 0] );
expected = [%t %t %f %f %f %t];
assert_checkequal(f,expected);
//
ieee(2);
a = [-2  -1  0  1  2];
f = compdiv_isfinite (1 ./ a );
expected = [%t %t %f %t %t];
assert_checkequal(f,expected);
