// Copyright (C) 2010-2011 - Michael Baudin
//
// This file must be used under the terms of the CeCILL.
// This source file is licensed as described in the file COPYING, which
// you should have received as part of this distribution.  The terms
// are also available at
// http://www.cecill.info/licences/Licence_CeCILL_V2-en.txt
// <-- JVM NOT MANDATORY -->
expected = 11/25 + %i * 2/25;
z = compdiv_smithLi ( 1+2*%i , 3+4*%i );
assert_checkalmostequal(z,expected);
//
// Test on larger dataset.
ieee(2);
path = compdiv_getpath();
dataset = fullfile(path,"tests","unit_tests","cdiv.dataset.csv");
dg = compdiv_testdataset ( dataset , compdiv_smithLi );
assert_checktrue(mean(dg)>40);
//
// Test on difficult cases
ieee(2);
[x,y,z,q,digits] = compdiv_difficultcases(compdiv_smithLi);
Case 1: OK     (53.0 bits)
Case 2: OK     (53.0 bits)
Case 3: failed (0.0 bits)
Case 4: OK     (53.0 bits)
Case 5: failed (0.0 bits)
Case 6: failed (0.0 bits)
Case 7: OK     (53.0 bits)
Case 8: OK     (53.0 bits)
Case 9: OK     (53.0 bits)
Case 10: failed (6.0 bits)
Case 11: failed (0.0 bits)
Case 12: OK     (53.0 bits)
Case 13: failed (0.0 bits)
Case 14: OK     (53.0 bits)
Case 15: OK     (53.0 bits)
expected=[53,53,0,53,0,0,53,53,53,5,0,53,0,53,53]';
assert_checktrue(floor(digits)==expected);
