#FIG 3.2  Produced by xfig version 3.2.5b
Landscape
Center
Inches
Letter  
100.00
Single
-2
1200 2
2 1 0 1 0 7 50 -1 -1 0.000 0 0 -1 0 0 2
	 1800 2850 1800 2325
2 1 0 1 0 7 50 -1 -1 0.000 0 0 -1 0 0 2
	 1950 2850 1950 2550
2 1 0 1 0 7 50 -1 -1 0.000 0 0 -1 0 0 2
	 2100 2850 2100 2700
2 1 0 1 0 7 50 -1 -1 0.000 0 0 -1 0 0 2
	 2250 2850 2250 2775
2 1 0 1 0 7 50 -1 -1 0.000 0 0 -1 0 0 2
	 2400 2850 2400 2700
2 1 0 1 0 7 50 -1 -1 0.000 0 0 -1 1 0 2
	1 1 1.00 60.00 120.00
	 1650 2850 1650 2025
2 2 0 1 0 7 50 -1 -1 0.000 0 0 -1 0 0 5
	 1500 1800 2700 1800 2700 3000 1500 3000 1500 1800
2 1 0 1 0 7 50 -1 -1 0.000 0 0 -1 1 0 2
	1 1 1.00 60.00 120.00
	 1650 2850 2550 2850
4 0 0 50 -1 0 12 0.0000 4 135 975 1725 2025 Inverse FFT\001
