digraph "DLL dependencies" {
node [shape=box,color=red];
"wscilex.exe" -> "getwindowsversion.dll" [color=green];
"elementary_functions.dll" -> "libscilab.dll" [color=green];
"elementary_functions.dll" -> "elementary_functions_f.dll" [color=green];
"elementary_functions.dll" -> "malloc.dll" [color=green];
"elementary_functions.dll" -> "api_scilab.dll" [color=green];
"elementary_functions.dll" -> "output_stream.dll" [color=green];
"elementary_functions.dll" -> "libintl.dll" [color=green];
"elementary_functions_f.dll" -> "libscilab.dll" [color=green];
"elementary_functions_f.dll" -> "elementary_functions.dll" [color=green];
"elementary_functions_f.dll" -> "blasplus.dll" [color=green];
"elementary_functions_f.dll" -> "lapack.dll" [color=green];
"elementary_functions_f.dll" -> "libf2c.dll" [color=green];
"elementary_functions_f.dll" -> "cacsd_f.dll" [color=green];
"elementary_functions_f.dll" -> "integer.dll" [color=green];
"elementary_functions_f.dll" -> "output_stream.dll" [color=green];
"elementary_functions_f.dll" -> "polynomials_f.dll" [color=green];
"elementary_functions_f.dll" -> "sparse_f.dll" [color=green];
"elementary_functions_f.dll" -> "string.dll" [color=green];
"elementary_functions_f.dll" -> "eispack_f.dll" [color=green];
"elementary_functions_f.dll" -> "linpack_f.dll" [color=green];
"elementary_functions_f.dll" -> "slatec_f.dll" [color=green];
"statistics.dll" -> "libscilab.dll" [color=green];
"statistics.dll" -> "output_stream.dll" [color=green];
"statistics.dll" -> "dcd_f.dll" [color=green];
"statistics.dll" -> "libintl.dll" [color=green];
"libscilab.dll" -> "call_scilab.dll" [color=green];
"libscilab.dll" -> "libf2c.dll" [color=green];
"libscilab.dll" -> "libxml2.dll" [color=green];
"libscilab.dll" -> "libintl.dll" [color=green];
"libscilab.dll" -> "blasplus.dll" [color=green];
"libscilab.dll" -> "lapack.dll" [color=green];
"libscilab.dll" -> "msvcp100d.dll" [color=green];
"libscilab.dll" -> "gdi32.dll" [color=green];
"libscilab.dll" -> "advapi32.dll" [color=green];
"libscilab.dll" -> "api_scilab.dll" [color=green];
"libscilab.dll" -> "boolean.dll" [color=green];
"libscilab.dll" -> "boolean_f.dll" [color=green];
"libscilab.dll" -> "cacsd.dll" [color=green];
"libscilab.dll" -> "scicompletion.dll" [color=green];
"libscilab.dll" -> "sciconsole.dll" [color=green];
"libscilab.dll" -> "data_structures.dll" [color=green];
"libscilab.dll" -> "data_structures_f.dll" [color=green];
"libscilab.dll" -> "differential_equations.dll" [color=green];
"libscilab.dll" -> "double.dll" [color=green];
"libscilab.dll" -> "dynamic_link.dll" [color=green];
"libscilab.dll" -> "elementary_functions.dll" [color=green];
"libscilab.dll" -> "elementary_functions_f.dll" [color=green];
"libscilab.dll" -> "linpack_f.dll" [color=green];
"libscilab.dll" -> "fftw.dll" [color=green];
"libscilab.dll" -> "fileio.dll" [color=green];
"libscilab.dll" -> "graphics.dll" [color=green];
"libscilab.dll" -> "scigui.dll" [color=green];
"libscilab.dll" -> "scihistory_manager.dll" [color=green];
"libscilab.dll" -> "integer.dll" [color=green];
"libscilab.dll" -> "integer_f.dll" [color=green];
"libscilab.dll" -> "intersci.dll" [color=green];
"libscilab.dll" -> "io.dll" [color=green];
"libscilab.dll" -> "io_f.dll" [color=green];
"libscilab.dll" -> "libjvm.dll" [color=green];
"libscilab.dll" -> "linear_algebra.dll" [color=green];
"libscilab.dll" -> "scilocalization.dll" [color=green];
"libscilab.dll" -> "output_stream.dll" [color=green];
"libscilab.dll" -> "output_stream_f.dll" [color=green];
"libscilab.dll" -> "polynomials.dll" [color=green];
"libscilab.dll" -> "polynomials_f.dll" [color=green];
"libscilab.dll" -> "libshell.dll" [color=green];
"libscilab.dll" -> "sparse.dll" [color=green];
"libscilab.dll" -> "sparse_f.dll" [color=green];
"libscilab.dll" -> "string.dll" [color=green];
"libscilab.dll" -> "string_f.dll" [color=green];
"libscilab.dll" -> "time.dll" [color=green];
"libscilab.dll" -> "scilab_windows.dll" [color=green];
"libscilab.dll" -> "windows_tools.dll" [color=green];
"libscilab.dll" -> "dynamiclibrary.dll" [color=green];
"libscilab.dll" -> "getwindowsversion.dll" [color=green];
"libscilab.dll" -> "malloc.dll" [color=green];
"libscilab.dll" -> "updater.dll" [color=green];
"dumpexts.exe" -> "msvcr100.dll" [color=green];
"graphics.dll" -> "libscilab.dll" [color=green];
"graphics.dll" -> "scigui.dll" [color=green];
"graphics.dll" -> "scilab_windows.dll" [color=green];
"graphics.dll" -> "blasplus.dll" [color=green];
"graphics.dll" -> "lapack.dll" [color=green];
"graphics.dll" -> "doublylinkedlist.dll" [color=green];
"graphics.dll" -> "hashtable.dll" [color=green];
"graphics.dll" -> "malloc.dll" [color=green];
"graphics.dll" -> "elementary_functions_f.dll" [color=green];
"graphics.dll" -> "fileio.dll" [color=green];
"graphics.dll" -> "libjvm.dll" [color=green];
"graphics.dll" -> "output_stream.dll" [color=green];
"graphics.dll" -> "scirenderer.dll" [color=green];
"graphics.dll" -> "libintl.dll" [color=green];
"integer.dll" -> "libscilab.dll" [color=green];
"integer.dll" -> "integer_f.dll" [color=green];
"integer.dll" -> "polynomials_f.dll" [color=green];
"integer.dll" -> "output_stream.dll" [color=green];
"integer_f.dll" -> "libscilab.dll" [color=green];
"integer_f.dll" -> "elementary_functions_f.dll" [color=green];
"integer_f.dll" -> "blasplus.dll" [color=green];
"integer_f.dll" -> "libf2c.dll" [color=green];
"integer_f.dll" -> "elementary_functions.dll" [color=green];
"integer_f.dll" -> "linpack_f.dll" [color=green];
"integer_f.dll" -> "fileio.dll" [color=green];
"integer_f.dll" -> "output_stream.dll" [color=green];
"integer_f.dll" -> "string.dll" [color=green];
"integer_f.dll" -> "integer.dll" [color=green];
"intersci.dll" -> "libscilab.dll" [color=green];
"intersci.dll" -> "malloc.dll" [color=green];
"intersci.dll" -> "output_stream.dll" [color=green];
"intersci.dll" -> "string.dll" [color=green];
"scigui.dll" -> "libscilab.dll" [color=green];
"scigui.dll" -> "malloc.dll" [color=green];
"scigui.dll" -> "fileio.dll" [color=green];
"scigui.dll" -> "graphics.dll" [color=green];
"scigui.dll" -> "libjvm.dll" [color=green];
"scigui.dll" -> "output_stream.dll" [color=green];
"scigui.dll" -> "scirenderer.dll" [color=green];
"scigui.dll" -> "scilab_windows.dll" [color=green];
"scigui.dll" -> "msvcp100d.dll" [color=green];
"scigui.dll" -> "libintl.dll" [color=green];
"optimization.dll" -> "libscilab.dll" [color=green];
"optimization.dll" -> "optimization_f.dll" [color=green];
"optimization.dll" -> "blasplus.dll" [color=green];
"optimization.dll" -> "lapack.dll" [color=green];
"optimization.dll" -> "malloc.dll" [color=green];
"optimization.dll" -> "dynamic_link.dll" [color=green];
"optimization.dll" -> "output_stream.dll" [color=green];
"optimization.dll" -> "sparse_f.dll" [color=green];
"optimization.dll" -> "libintl.dll" [color=green];
"optimization_f.dll" -> "libscilab.dll" [color=green];
"optimization_f.dll" -> "optimization.dll" [color=green];
"optimization_f.dll" -> "string.dll" [color=green];
"optimization_f.dll" -> "output_stream.dll" [color=green];
"optimization_f.dll" -> "io_f.dll" [color=green];
"optimization_f.dll" -> "blasplus.dll" [color=green];
"optimization_f.dll" -> "lapack.dll" [color=green];
"optimization_f.dll" -> "libf2c.dll" [color=green];
"optimization_f.dll" -> "elementary_functions.dll" [color=green];
"optimization_f.dll" -> "elementary_functions_f.dll" [color=green];
"optimization_f.dll" -> "linpack_f.dll" [color=green];
"polynomials_f.dll" -> "libscilab.dll" [color=green];
"polynomials_f.dll" -> "polynomials.dll" [color=green];
"polynomials_f.dll" -> "output_stream.dll" [color=green];
"polynomials_f.dll" -> "linear_algebra.dll" [color=green];
"polynomials_f.dll" -> "elementary_functions_f.dll" [color=green];
"polynomials_f.dll" -> "elementary_functions.dll" [color=green];
"polynomials_f.dll" -> "blasplus.dll" [color=green];
"polynomials_f.dll" -> "lapack.dll" [color=green];
"polynomials_f.dll" -> "libf2c.dll" [color=green];
"polynomials_f.dll" -> "cacsd_f.dll" [color=green];
"polynomials_f.dll" -> "linpack_f.dll" [color=green];
"pvm.dll" -> "libscilab.dll" [color=green];
"pvm.dll" -> "advapi32.dll" [color=green];
"pvm.dll" -> "malloc.dll" [color=green];
"pvm.dll" -> "io.dll" [color=green];
"pvm.dll" -> "output_stream.dll" [color=green];
"pvm.dll" -> "sparse_f.dll" [color=green];
"pvm.dll" -> "libintl.dll" [color=green];
"pvm.dll" -> "wsock32.dll" [color=green];
"randlib.dll" -> "libscilab.dll" [color=green];
"randlib.dll" -> "randlib_f.dll" [color=green];
"randlib.dll" -> "elementary_functions_f.dll" [color=green];
"randlib.dll" -> "output_stream.dll" [color=green];
"randlib.dll" -> "libintl.dll" [color=green];
"randlib_f.dll" -> "libscilab.dll" [color=green];
"randlib_f.dll" -> "randlib.dll" [color=green];
"randlib_f.dll" -> "libf2c.dll" [color=green];
"randlib_f.dll" -> "linpack_f.dll" [color=green];
"randlib_f.dll" -> "output_stream.dll" [color=green];
"scicos.dll" -> "libscilab.dll" [color=green];
"scicos.dll" -> "output_stream.dll" [color=green];
"scicos.dll" -> "string.dll" [color=green];
"scicos.dll" -> "dynamic_link.dll" [color=green];
"scicos.dll" -> "graphics.dll" [color=green];
"scicos.dll" -> "scilocalization.dll" [color=green];
"scicos.dll" -> "blasplus.dll" [color=green];
"scicos.dll" -> "malloc.dll" [color=green];
"scicos.dll" -> "elementary_functions.dll" [color=green];
"scicos.dll" -> "elementary_functions_f.dll" [color=green];
"scicos.dll" -> "scicos_blocks.dll" [color=green];
"scicos.dll" -> "scicos_blocks_f.dll" [color=green];
"scicos.dll" -> "time.dll" [color=green];
"scicos.dll" -> "scilab_windows.dll" [color=green];
"scicos.dll" -> "scicos_f.dll" [color=green];
"scicos.dll" -> "scicos_sundials.dll" [color=green];
"scicos.dll" -> "libintl.dll" [color=green];
"scicos_f.dll" -> "libscilab.dll" [color=green];
"scicos_f.dll" -> "output_stream.dll" [color=green];
"scicos_f.dll" -> "scicos.dll" [color=green];
"scicos_f.dll" -> "blasplus.dll" [color=green];
"scicos_f.dll" -> "libf2c.dll" [color=green];
"scicos_f.dll" -> "elementary_functions.dll" [color=green];
"scicos_f.dll" -> "elementary_functions_f.dll" [color=green];
"signal_processing_f.dll" -> "libscilab.dll" [color=green];
"signal_processing_f.dll" -> "signal_processing.dll" [color=green];
"signal_processing_f.dll" -> "output_stream.dll" [color=green];
"signal_processing_f.dll" -> "blasplus.dll" [color=green];
"signal_processing_f.dll" -> "lapack.dll" [color=green];
"signal_processing_f.dll" -> "libf2c.dll" [color=green];
"signal_processing_f.dll" -> "elementary_functions.dll" [color=green];
"signal_processing_f.dll" -> "elementary_functions_f.dll" [color=green];
"slicot_f.dll" -> "linear_algebra_f.dll" [color=green];
"slicot_f.dll" -> "blasplus.dll" [color=green];
"slicot_f.dll" -> "lapack.dll" [color=green];
"slicot_f.dll" -> "libf2c.dll" [color=green];
"slicot_f.dll" -> "elementary_functions_f.dll" [color=green];
"slicot_f.dll" -> "linpack_f.dll" [color=green];
"fileio.dll" -> "libscilab.dll" [color=green];
"fileio.dll" -> "scilab_windows.dll" [color=green];
"fileio.dll" -> "scilocalization.dll" [color=green];
"fileio.dll" -> "oleaut32.dll" [color=green];
"fileio.dll" -> "libst.dll" [color=green];
"fileio.dll" -> "malloc.dll" [color=green];
"fileio.dll" -> "api_scilab.dll" [color=green];
"fileio.dll" -> "output_stream.dll" [color=green];
"fileio.dll" -> "libshell.dll" [color=green];
"fileio.dll" -> "string.dll" [color=green];
"fileio.dll" -> "libintl.dll" [color=green];
"fileio.dll" -> "shlwapi.dll" [color=green];
"sparse.dll" -> "libscilab.dll" [color=green];
"sparse.dll" -> "malloc.dll" [color=green];
"sparse.dll" -> "elementary_functions.dll" [color=green];
"sparse.dll" -> "elementary_functions_f.dll" [color=green];
"sparse.dll" -> "scilocalization.dll" [color=green];
"sparse.dll" -> "output_stream.dll" [color=green];
"sparse.dll" -> "sparse_f.dll" [color=green];
"sparse.dll" -> "libintl.dll" [color=green];
"sparse_f.dll" -> "libscilab.dll" [color=green];
"sparse_f.dll" -> "elementary_functions_f.dll" [color=green];
"sparse_f.dll" -> "sparse.dll" [color=green];
"sparse_f.dll" -> "blasplus.dll" [color=green];
"sparse_f.dll" -> "libf2c.dll" [color=green];
"sparse_f.dll" -> "elementary_functions.dll" [color=green];
"sparse_f.dll" -> "linpack_f.dll" [color=green];
"sparse_f.dll" -> "output_stream.dll" [color=green];
"scilex.exe" -> "getwindowsversion.dll" [color=green];
"scilex.exe" -> "malloc.dll" [color=green];
"libmex.dll" -> "libintl.dll" [color=green];
"libmex.dll" -> "blasplus.dll" [color=green];
"libmex.dll" -> "lapack.dll" [color=green];
"libmex.dll" -> "libscilab.dll" [color=green];
"libmex.dll" -> "malloc.dll" [color=green];
"libmex.dll" -> "data_structures.dll" [color=green];
"libmex.dll" -> "elementary_functions_f.dll" [color=green];
"libmex.dll" -> "output_stream.dll" [color=green];
"libmex.dll" -> "string.dll" [color=green];
"libmx.dll" -> "libintl.dll" [color=green];
"libmx.dll" -> "blasplus.dll" [color=green];
"libmx.dll" -> "lapack.dll" [color=green];
"libmx.dll" -> "libscilab.dll" [color=green];
"libmx.dll" -> "malloc.dll" [color=green];
"libmx.dll" -> "data_structures.dll" [color=green];
"libmx.dll" -> "elementary_functions_f.dll" [color=green];
"libmx.dll" -> "output_stream.dll" [color=green];
"libmx.dll" -> "string.dll" [color=green];
"libmat.dll" -> "libintl.dll" [color=green];
"libmat.dll" -> "blasplus.dll" [color=green];
"libmat.dll" -> "lapack.dll" [color=green];
"libmat.dll" -> "libscilab.dll" [color=green];
"libmat.dll" -> "malloc.dll" [color=green];
"libmat.dll" -> "data_structures.dll" [color=green];
"libmat.dll" -> "elementary_functions_f.dll" [color=green];
"libmat.dll" -> "output_stream.dll" [color=green];
"libmat.dll" -> "string.dll" [color=green];
"setupatlas.exe" -> "advapi32.dll" [color=green];
"setupatlas.exe" -> "libxml2.dll" [color=green];
"tclsci.dll" -> "libscilab.dll" [color=green];
"tclsci.dll" -> "scilab_windows.dll" [color=green];
"tclsci.dll" -> "malloc.dll" [color=green];
"tclsci.dll" -> "fileio.dll" [color=green];
"tclsci.dll" -> "output_stream.dll" [color=green];
"tclsci.dll" -> "libintl.dll" [color=green];
"tclsci.dll" -> "tcl85.dll" [color=green];
"tclsci.dll" -> "tk85.dll" [color=green];
"javasci.dll" -> "libscilab.dll" [color=green];
"javasci.dll" -> "malloc.dll" [color=green];
"javasci.dll" -> "api_scilab.dll" [color=green];
"javasci.dll" -> "call_scilab.dll" [color=green];
"javasci.dll" -> "graphics.dll" [color=green];
"javasci.dll" -> "output_stream.dll" [color=green];
"javasci.dll" -> "scilab_windows.dll" [color=green];
"time.dll" -> "libscilab.dll" [color=green];
"time.dll" -> "malloc.dll" [color=green];
"time.dll" -> "output_stream.dll" [color=green];
"time.dll" -> "libintl.dll" [color=green];
"sound.dll" -> "libscilab.dll" [color=green];
"sound.dll" -> "scilab_windows.dll" [color=green];
"sound.dll" -> "malloc.dll" [color=green];
"sound.dll" -> "api_scilab.dll" [color=green];
"sound.dll" -> "fileio.dll" [color=green];
"sound.dll" -> "output_stream.dll" [color=green];
"sound.dll" -> "libintl.dll" [color=green];
"sound.dll" -> "winmm.dll" [color=green];
"scilocalization.dll" -> "libscilab.dll" [color=green];
"scilocalization.dll" -> "io.dll" [color=green];
"scilocalization.dll" -> "advapi32.dll" [color=green];
"scilocalization.dll" -> "getwindowsversion.dll" [color=green];
"scilocalization.dll" -> "malloc.dll" [color=green];
"scilocalization.dll" -> "fileio.dll" [color=green];
"scilocalization.dll" -> "output_stream.dll" [color=green];
"scilocalization.dll" -> "string.dll" [color=green];
"scilocalization.dll" -> "scilab_windows.dll" [color=green];
"scilocalization.dll" -> "libintl.dll" [color=green];
"hashtable.dll" -> "malloc.dll" [color=green];
"libjvm.dll" -> "libscilab.dll" [color=green];
"libjvm.dll" -> "scilab_windows.dll" [color=green];
"libjvm.dll" -> "string.dll" [color=green];
"libjvm.dll" -> "call_scilab.dll" [color=green];
"libjvm.dll" -> "advapi32.dll" [color=green];
"libjvm.dll" -> "dynamiclibrary.dll" [color=green];
"libjvm.dll" -> "getwindowsversion.dll" [color=green];
"libjvm.dll" -> "malloc.dll" [color=green];
"libjvm.dll" -> "fileio.dll" [color=green];
"libjvm.dll" -> "scilocalization.dll" [color=green];
"libjvm.dll" -> "output_stream.dll" [color=green];
"libjvm.dll" -> "libxml2.dll" [color=green];
"libjvm.dll" -> "libintl.dll" [color=green];
"detectframework.dll" -> "advapi32.dll" [color=green];
"io.dll" -> "libscilab.dll" [color=green];
"io.dll" -> "io_f.dll" [color=green];
"io.dll" -> "scilab_windows.dll" [color=green];
"io.dll" -> "malloc.dll" [color=green];
"io.dll" -> "api_scilab.dll" [color=green];
"io.dll" -> "fileio.dll" [color=green];
"io.dll" -> "scilocalization.dll" [color=green];
"io.dll" -> "output_stream.dll" [color=green];
"io.dll" -> "libintl.dll" [color=green];
"io_f.dll" -> "libscilab.dll" [color=green];
"io_f.dll" -> "output_stream_f.dll" [color=green];
"io_f.dll" -> "io.dll" [color=green];
"io_f.dll" -> "elementary_functions_f.dll" [color=green];
"io_f.dll" -> "libf2c.dll" [color=green];
"io_f.dll" -> "elementary_functions.dll" [color=green];
"io_f.dll" -> "linpack_f.dll" [color=green];
"io_f.dll" -> "fileio.dll" [color=green];
"io_f.dll" -> "integer_f.dll" [color=green];
"io_f.dll" -> "output_stream.dll" [color=green];
"io_f.dll" -> "string.dll" [color=green];
"string.dll" -> "scilab_windows.dll" [color=green];
"string.dll" -> "libscilab.dll" [color=green];
"string.dll" -> "string_f.dll" [color=green];
"string.dll" -> "scilocalization.dll" [color=green];
"string.dll" -> "malloc.dll" [color=green];
"string.dll" -> "api_scilab.dll" [color=green];
"string.dll" -> "linpack_f.dll" [color=green];
"string.dll" -> "integer.dll" [color=green];
"string.dll" -> "output_stream.dll" [color=green];
"string.dll" -> "pcre.dll" [color=green];
"string.dll" -> "libintl.dll" [color=green];
"string_f.dll" -> "libscilab.dll" [color=green];
"string_f.dll" -> "elementary_functions.dll" [color=green];
"string_f.dll" -> "elementary_functions_f.dll" [color=green];
"string_f.dll" -> "linpack_f.dll" [color=green];
"string_f.dll" -> "output_stream.dll" [color=green];
"string_f.dll" -> "polynomials_f.dll" [color=green];
"symbolic_f.dll" -> "libscilab.dll" [color=green];
"symbolic_f.dll" -> "linpack_f.dll" [color=green];
"symbolic_f.dll" -> "output_stream.dll" [color=green];
"symbolic.dll" -> "libscilab.dll" [color=green];
"symbolic.dll" -> "symbolic_f.dll" [color=green];
"symbolic.dll" -> "output_stream.dll" [color=green];
"symbolic.dll" -> "libintl.dll" [color=green];
"polynomials.dll" -> "libscilab.dll" [color=green];
"polynomials.dll" -> "polynomials_f.dll" [color=green];
"arnoldi.dll" -> "libscilab.dll" [color=green];
"arnoldi.dll" -> "output_stream.dll" [color=green];
"arnoldi.dll" -> "libintl.dll" [color=green];
"arnoldi.dll" -> "arpack.dll" [color=green];
"signal_processing.dll" -> "libscilab.dll" [color=green];
"signal_processing.dll" -> "signal_processing_f.dll" [color=green];
"signal_processing.dll" -> "dynamic_link.dll" [color=green];
"cacsd_f.dll" -> "libscilab.dll" [color=green];
"cacsd_f.dll" -> "cacsd.dll" [color=green];
"cacsd_f.dll" -> "elementary_functions.dll" [color=green];
"cacsd_f.dll" -> "elementary_functions_f.dll" [color=green];
"cacsd_f.dll" -> "slicot_f.dll" [color=green];
"cacsd_f.dll" -> "polynomials_f.dll" [color=green];
"cacsd_f.dll" -> "output_stream_f.dll" [color=green];
"cacsd_f.dll" -> "output_stream.dll" [color=green];
"cacsd_f.dll" -> "slatec_f.dll" [color=green];
"cacsd_f.dll" -> "differential_equations_f.dll" [color=green];
"cacsd_f.dll" -> "blasplus.dll" [color=green];
"cacsd_f.dll" -> "lapack.dll" [color=green];
"cacsd_f.dll" -> "libf2c.dll" [color=green];
"cacsd_f.dll" -> "eispack_f.dll" [color=green];
"cacsd_f.dll" -> "linpack_f.dll" [color=green];
"cacsd.dll" -> "libscilab.dll" [color=green];
"cacsd.dll" -> "cacsd_f.dll" [color=green];
"cacsd.dll" -> "lapack.dll" [color=green];
"cacsd.dll" -> "linpack_f.dll" [color=green];
"cacsd.dll" -> "output_stream.dll" [color=green];
"cacsd.dll" -> "slicot_f.dll" [color=green];
"cacsd.dll" -> "libintl.dll" [color=green];
"dcd_f.dll" -> "output_stream.dll" [color=green];
"dcd_f.dll" -> "statistics.dll" [color=green];
"dcd_f.dll" -> "lapack.dll" [color=green];
"dcd_f.dll" -> "libf2c.dll" [color=green];
"linear_algebra_f.dll" -> "libscilab.dll" [color=green];
"linear_algebra_f.dll" -> "linear_algebra.dll" [color=green];
"linear_algebra_f.dll" -> "blasplus.dll" [color=green];
"linear_algebra_f.dll" -> "lapack.dll" [color=green];
"linear_algebra_f.dll" -> "libf2c.dll" [color=green];
"linear_algebra_f.dll" -> "elementary_functions.dll" [color=green];
"linear_algebra_f.dll" -> "elementary_functions_f.dll" [color=green];
"linear_algebra_f.dll" -> "output_stream.dll" [color=green];
"linear_algebra.dll" -> "libscilab.dll" [color=green];
"linear_algebra.dll" -> "linear_algebra_f.dll" [color=green];
"linear_algebra.dll" -> "blasplus.dll" [color=green];
"linear_algebra.dll" -> "lapack.dll" [color=green];
"linear_algebra.dll" -> "malloc.dll" [color=green];
"linear_algebra.dll" -> "slicot_f.dll" [color=green];
"linear_algebra.dll" -> "dynamic_link.dll" [color=green];
"linear_algebra.dll" -> "elementary_functions.dll" [color=green];
"linear_algebra.dll" -> "elementary_functions_f.dll" [color=green];
"linear_algebra.dll" -> "output_stream.dll" [color=green];
"linear_algebra.dll" -> "libintl.dll" [color=green];
"special_functions.dll" -> "libscilab.dll" [color=green];
"special_functions.dll" -> "special_functions_f.dll" [color=green];
"special_functions.dll" -> "blasplus.dll" [color=green];
"special_functions.dll" -> "elementary_functions.dll" [color=green];
"special_functions.dll" -> "elementary_functions_f.dll" [color=green];
"special_functions.dll" -> "slatec_f.dll" [color=green];
"special_functions.dll" -> "output_stream.dll" [color=green];
"special_functions.dll" -> "dcd_f.dll" [color=green];
"special_functions.dll" -> "libintl.dll" [color=green];
"special_functions_f.dll" -> "libscilab.dll" [color=green];
"special_functions_f.dll" -> "elementary_functions_f.dll" [color=green];
"special_functions_f.dll" -> "slatec_f.dll" [color=green];
"special_functions_f.dll" -> "output_stream.dll" [color=green];
"differential_equations.dll" -> "libscilab.dll" [color=green];
"differential_equations.dll" -> "differential_equations_f.dll" [color=green];
"differential_equations.dll" -> "dynamic_link.dll" [color=green];
"differential_equations.dll" -> "elementary_functions.dll" [color=green];
"differential_equations_f.dll" -> "libscilab.dll" [color=green];
"differential_equations_f.dll" -> "differential_equations.dll" [color=green];
"differential_equations_f.dll" -> "blasplus.dll" [color=green];
"differential_equations_f.dll" -> "lapack.dll" [color=green];
"differential_equations_f.dll" -> "libf2c.dll" [color=green];
"differential_equations_f.dll" -> "elementary_functions.dll" [color=green];
"differential_equations_f.dll" -> "elementary_functions_f.dll" [color=green];
"differential_equations_f.dll" -> "linpack_f.dll" [color=green];
"differential_equations_f.dll" -> "slatec_f.dll" [color=green];
"differential_equations_f.dll" -> "output_stream.dll" [color=green];
"differential_equations_f.dll" -> "string.dll" [color=green];
"double.dll" -> "libscilab.dll" [color=green];
"double.dll" -> "double_f.dll" [color=green];
"double.dll" -> "boolean.dll" [color=green];
"double_f.dll" -> "libscilab.dll" [color=green];
"double_f.dll" -> "blasplus.dll" [color=green];
"double_f.dll" -> "lapack.dll" [color=green];
"double_f.dll" -> "libf2c.dll" [color=green];
"double_f.dll" -> "elementary_functions.dll" [color=green];
"double_f.dll" -> "elementary_functions_f.dll" [color=green];
"double_f.dll" -> "linpack_f.dll" [color=green];
"double_f.dll" -> "linear_algebra.dll" [color=green];
"double_f.dll" -> "output_stream.dll" [color=green];
"double_f.dll" -> "polynomials_f.dll" [color=green];
"boolean.dll" -> "libscilab.dll" [color=green];
"boolean.dll" -> "boolean_f.dll" [color=green];
"boolean.dll" -> "malloc.dll" [color=green];
"boolean.dll" -> "output_stream.dll" [color=green];
"boolean.dll" -> "libintl.dll" [color=green];
"boolean_f.dll" -> "libscilab.dll" [color=green];
"boolean_f.dll" -> "blasplus.dll" [color=green];
"boolean_f.dll" -> "libf2c.dll" [color=green];
"boolean_f.dll" -> "elementary_functions.dll" [color=green];
"boolean_f.dll" -> "elementary_functions_f.dll" [color=green];
"boolean_f.dll" -> "linpack_f.dll" [color=green];
"boolean_f.dll" -> "output_stream.dll" [color=green];
"interpolation.dll" -> "libscilab.dll" [color=green];
"interpolation.dll" -> "interpolation_f.dll" [color=green];
"interpolation.dll" -> "malloc.dll" [color=green];
"interpolation.dll" -> "elementary_functions_f.dll" [color=green];
"interpolation.dll" -> "slatec_f.dll" [color=green];
"interpolation.dll" -> "output_stream.dll" [color=green];
"interpolation.dll" -> "string.dll" [color=green];
"interpolation.dll" -> "libintl.dll" [color=green];
"data_structures.dll" -> "libscilab.dll" [color=green];
"data_structures.dll" -> "data_structures_f.dll" [color=green];
"data_structures.dll" -> "linpack_f.dll" [color=green];
"data_structures.dll" -> "integer.dll" [color=green];
"data_structures.dll" -> "output_stream.dll" [color=green];
"data_structures.dll" -> "polynomials_f.dll" [color=green];
"data_structures.dll" -> "string.dll" [color=green];
"data_structures.dll" -> "libintl.dll" [color=green];
"data_structures_f.dll" -> "libscilab.dll" [color=green];
"data_structures_f.dll" -> "data_structures.dll" [color=green];
"data_structures_f.dll" -> "libf2c.dll" [color=green];
"data_structures_f.dll" -> "elementary_functions.dll" [color=green];
"data_structures_f.dll" -> "elementary_functions_f.dll" [color=green];
"data_structures_f.dll" -> "linpack_f.dll" [color=green];
"data_structures_f.dll" -> "output_stream.dll" [color=green];
"interpolation_f.dll" -> "libscilab.dll" [color=green];
"interpolation_f.dll" -> "blasplus.dll" [color=green];
"interpolation_f.dll" -> "libf2c.dll" [color=green];
"interpolation_f.dll" -> "elementary_functions_f.dll" [color=green];
"interpolation_f.dll" -> "slatec_f.dll" [color=green];
"nofftw.dll" -> "libintl.dll" [color=green];
"nofftw.dll" -> "output_stream.dll" [color=green];
"fftw.dll" -> "libscilab.dll" [color=green];
"fftw.dll" -> "scilab_windows.dll" [color=green];
"fftw.dll" -> "dynamiclibrary.dll" [color=green];
"fftw.dll" -> "malloc.dll" [color=green];
"fftw.dll" -> "elementary_functions_f.dll" [color=green];
"fftw.dll" -> "scilocalization.dll" [color=green];
"fftw.dll" -> "output_stream.dll" [color=green];
"fftw.dll" -> "libintl.dll" [color=green];
"noscicos.dll" -> "output_stream.dll" [color=green];
"slatec_f.dll" -> "libscilab.dll" [color=green];
"slatec_f.dll" -> "elementary_functions_f.dll" [color=green];
"slatec_f.dll" -> "lapack.dll" [color=green];
"slatec_f.dll" -> "libf2c.dll" [color=green];
"slatec_f.dll" -> "output_stream.dll" [color=green];
"slatec_f.dll" -> "elementary_functions.dll" [color=green];
"nosound.dll" -> "libintl.dll" [color=green];
"nosound.dll" -> "output_stream.dll" [color=green];
"norandlib.dll" -> "libintl.dll" [color=green];
"norandlib.dll" -> "output_stream.dll" [color=green];
"libshell.dll" -> "libscilab.dll" [color=green];
"libshell.dll" -> "sciconsole.dll" [color=green];
"libshell.dll" -> "scilab_windows.dll" [color=green];
"libshell.dll" -> "scicompletion.dll" [color=green];
"libshell.dll" -> "malloc.dll" [color=green];
"libshell.dll" -> "scihistory_manager.dll" [color=green];
"libshell.dll" -> "output_stream.dll" [color=green];
"libshell.dll" -> "libintl.dll" [color=green];
"nographics.dll" -> "libintl.dll" [color=green];
"nographics.dll" -> "libscilab.dll" [color=green];
"nographics.dll" -> "output_stream.dll" [color=green];
"scirenderer.dll" -> "graphics.dll" [color=green];
"scirenderer.dll" -> "libscilab.dll" [color=green];
"scirenderer.dll" -> "scilab_windows.dll" [color=green];
"scirenderer.dll" -> "scigui.dll" [color=green];
"scirenderer.dll" -> "doublylinkedlist.dll" [color=green];
"scirenderer.dll" -> "malloc.dll" [color=green];
"scirenderer.dll" -> "libjvm.dll" [color=green];
"scirenderer.dll" -> "output_stream.dll" [color=green];
"scirenderer.dll" -> "msvcp100d.dll" [color=green];
"scirenderer.dll" -> "libintl.dll" [color=green];
"sciconsole.dll" -> "libscilab.dll" [color=green];
"sciconsole.dll" -> "malloc.dll" [color=green];
"sciconsole.dll" -> "fileio.dll" [color=green];
"sciconsole.dll" -> "libjvm.dll" [color=green];
"sciconsole.dll" -> "libshell.dll" [color=green];
"sciconsole.dll" -> "scilab_windows.dll" [color=green];
"sciconsole.dll" -> "msvcp100d.dll" [color=green];
"doublylinkedlist.dll" -> "malloc.dll" [color=green];
"scicompletion.dll" -> "libscilab.dll" [color=green];
"scicompletion.dll" -> "scilab_windows.dll" [color=green];
"scicompletion.dll" -> "malloc.dll" [color=green];
"scicompletion.dll" -> "api_scilab.dll" [color=green];
"scicompletion.dll" -> "fileio.dll" [color=green];
"scicompletion.dll" -> "functions.dll" [color=green];
"scicompletion.dll" -> "graphics.dll" [color=green];
"scicompletion.dll" -> "output_stream.dll" [color=green];
"scicompletion.dll" -> "libintl.dll" [color=green];
"nocompletion.dll" -> "libintl.dll" [color=green];
"nocompletion.dll" -> "output_stream.dll" [color=green];
"scihistory_manager.dll" -> "libscilab.dll" [color=green];
"scihistory_manager.dll" -> "scilab_windows.dll" [color=green];
"scihistory_manager.dll" -> "scilocalization.dll" [color=green];
"scihistory_manager.dll" -> "fileio.dll" [color=green];
"scihistory_manager.dll" -> "history_browser.dll" [color=green];
"scihistory_manager.dll" -> "malloc.dll" [color=green];
"scihistory_manager.dll" -> "output_stream.dll" [color=green];
"scihistory_manager.dll" -> "msvcp100d.dll" [color=green];
"scihistory_manager.dll" -> "libintl.dll" [color=green];
"windows_tools.dll" -> "libscilab.dll" [color=green];
"windows_tools.dll" -> "scilab_windows.dll" [color=green];
"windows_tools.dll" -> "scilocalization.dll" [color=green];
"windows_tools.dll" -> "call_scilab.dll" [color=green];
"windows_tools.dll" -> "advapi32.dll" [color=green];
"windows_tools.dll" -> "shell32.dll" [color=green];
"windows_tools.dll" -> "ole32.dll" [color=green];
"windows_tools.dll" -> "getwindowsversion.dll" [color=green];
"windows_tools.dll" -> "malloc.dll" [color=green];
"windows_tools.dll" -> "api_scilab.dll" [color=green];
"windows_tools.dll" -> "fileio.dll" [color=green];
"windows_tools.dll" -> "output_stream.dll" [color=green];
"windows_tools.dll" -> "libintl.dll" [color=green];
"windows_tools.dll" -> "shlwapi.dll" [color=green];
"windows_tools.dll" -> "winmm.dll" [color=green];
"nowindows_tools.dll" -> "output_stream.dll" [color=green];
"scilab_windows.dll" -> "libscilab.dll" [color=green];
"scilab_windows.dll" -> "scilocalization.dll" [color=green];
"scilab_windows.dll" -> "scigui.dll" [color=green];
"scilab_windows.dll" -> "gdi32.dll" [color=green];
"scilab_windows.dll" -> "comdlg32.dll" [color=green];
"scilab_windows.dll" -> "advapi32.dll" [color=green];
"scilab_windows.dll" -> "shell32.dll" [color=green];
"scilab_windows.dll" -> "malloc.dll" [color=green];
"scilab_windows.dll" -> "fileio.dll" [color=green];
"scilab_windows.dll" -> "output_stream.dll" [color=green];
"scilab_windows.dll" -> "windows_tools.dll" [color=green];
"scilab_windows.dll" -> "shlwapi.dll" [color=green];
"scilab_windows.dll" -> "libintl.dll" [color=green];
"spreadsheet.dll" -> "libscilab.dll" [color=green];
"spreadsheet.dll" -> "malloc.dll" [color=green];
"spreadsheet.dll" -> "fileio.dll" [color=green];
"spreadsheet.dll" -> "scilocalization.dll" [color=green];
"spreadsheet.dll" -> "output_stream.dll" [color=green];
"spreadsheet.dll" -> "scilab_windows.dll" [color=green];
"spreadsheet.dll" -> "libintl.dll" [color=green];
"nospreadsheet.dll" -> "libintl.dll" [color=green];
"nospreadsheet.dll" -> "output_stream.dll" [color=green];
"sciaction_binding.dll" -> "libscilab.dll" [color=green];
"sciaction_binding.dll" -> "malloc.dll" [color=green];
"sciaction_binding.dll" -> "api_scilab.dll" [color=green];
"sciaction_binding.dll" -> "libjvm.dll" [color=green];
"sciaction_binding.dll" -> "output_stream.dll" [color=green];
"sciaction_binding.dll" -> "libintl.dll" [color=green];
"sciaction_binding.dll" -> "msvcp100d.dll" [color=green];
"output_stream.dll" -> "libscilab.dll" [color=green];
"output_stream.dll" -> "sciconsole.dll" [color=green];
"output_stream.dll" -> "libshell.dll" [color=green];
"output_stream.dll" -> "string.dll" [color=green];
"output_stream.dll" -> "scilocalization.dll" [color=green];
"output_stream.dll" -> "scilab_windows.dll" [color=green];
"output_stream.dll" -> "api_scilab.dll" [color=green];
"output_stream.dll" -> "malloc.dll" [color=green];
"output_stream.dll" -> "output_stream_f.dll" [color=green];
"output_stream.dll" -> "msvcp100d.dll" [color=green];
"output_stream.dll" -> "libintl.dll" [color=green];
"dynamic_link.dll" -> "libscilab.dll" [color=green];
"dynamic_link.dll" -> "dynamic_link_f.dll" [color=green];
"dynamic_link.dll" -> "io.dll" [color=green];
"dynamic_link.dll" -> "scilab_windows.dll" [color=green];
"dynamic_link.dll" -> "dynamiclibrary.dll" [color=green];
"dynamic_link.dll" -> "malloc.dll" [color=green];
"dynamic_link.dll" -> "scilocalization.dll" [color=green];
"dynamic_link.dll" -> "output_stream.dll" [color=green];
"dynamic_link.dll" -> "libintl.dll" [color=green];
"scigraphic_export.dll" -> "graphics.dll" [color=green];
"scigraphic_export.dll" -> "libscilab.dll" [color=green];
"scigraphic_export.dll" -> "scirenderer.dll" [color=green];
"scigraphic_export.dll" -> "malloc.dll" [color=green];
"scigraphic_export.dll" -> "fileio.dll" [color=green];
"scigraphic_export.dll" -> "libjvm.dll" [color=green];
"scigraphic_export.dll" -> "scilocalization.dll" [color=green];
"scigraphic_export.dll" -> "output_stream.dll" [color=green];
"scigraphic_export.dll" -> "msvcp100d.dll" [color=green];
"scigraphic_export.dll" -> "libintl.dll" [color=green];
"nographic_export.dll" -> "libintl.dll" [color=green];
"nographic_export.dll" -> "output_stream.dll" [color=green];
"dynamic_link_f.dll" -> "libscilab.dll" [color=green];
"dynamic_link_f.dll" -> "output_stream.dll" [color=green];
"dynamic_link_f.dll" -> "string.dll" [color=green];
"dynamic_link_f.dll" -> "libf2c.dll" [color=green];
"dynamic_link_f.dll" -> "elementary_functions.dll" [color=green];
"dynamic_link_f.dll" -> "elementary_functions_f.dll" [color=green];
"dynamic_link_f.dll" -> "linpack_f.dll" [color=green];
"dynamic_link_f.dll" -> "dynamic_link.dll" [color=green];
"scicos_blocks.dll" -> "libscilab.dll" [color=green];
"scicos_blocks.dll" -> "scicos.dll" [color=green];
"scicos_blocks.dll" -> "output_stream.dll" [color=green];
"scicos_blocks.dll" -> "string.dll" [color=green];
"scicos_blocks.dll" -> "fileio.dll" [color=green];
"scicos_blocks.dll" -> "linear_algebra_f.dll" [color=green];
"scicos_blocks.dll" -> "scirenderer.dll" [color=green];
"scicos_blocks.dll" -> "graphics.dll" [color=green];
"scicos_blocks.dll" -> "slicot_f.dll" [color=green];
"scicos_blocks.dll" -> "blasplus.dll" [color=green];
"scicos_blocks.dll" -> "lapack.dll" [color=green];
"scicos_blocks.dll" -> "malloc.dll" [color=green];
"scicos_blocks.dll" -> "elementary_functions_f.dll" [color=green];
"scicos_blocks.dll" -> "libjvm.dll" [color=green];
"scicos_blocks.dll" -> "scilocalization.dll" [color=green];
"scicos_blocks.dll" -> "polynomials_f.dll" [color=green];
"scicos_blocks.dll" -> "scilab_windows.dll" [color=green];
"scicos_blocks.dll" -> "msvcp100d.dll" [color=green];
"scicos_blocks.dll" -> "libintl.dll" [color=green];
"scicos_blocks_f.dll" -> "libscilab.dll" [color=green];
"scicos_blocks_f.dll" -> "output_stream.dll" [color=green];
"scicos_blocks_f.dll" -> "output_stream_f.dll" [color=green];
"scicos_blocks_f.dll" -> "string.dll" [color=green];
"scicos_blocks_f.dll" -> "scicos_f.dll" [color=green];
"scicos_blocks_f.dll" -> "scicos.dll" [color=green];
"scicos_blocks_f.dll" -> "scicos_blocks.dll" [color=green];
"scicos_blocks_f.dll" -> "blasplus.dll" [color=green];
"scicos_blocks_f.dll" -> "libf2c.dll" [color=green];
"scicos_blocks_f.dll" -> "elementary_functions.dll" [color=green];
"scicos_blocks_f.dll" -> "elementary_functions_f.dll" [color=green];
"scicos_blocks_f.dll" -> "polynomials_f.dll" [color=green];
"noumfpack.dll" -> "libintl.dll" [color=green];
"noumfpack.dll" -> "output_stream.dll" [color=green];
"umfpack.dll" -> "libscilab.dll" [color=green];
"umfpack.dll" -> "sparse_f.dll" [color=green];
"umfpack.dll" -> "malloc.dll" [color=green];
"umfpack.dll" -> "output_stream.dll" [color=green];
"umfpack.dll" -> "libumfpack.dll" [color=green];
"umfpack.dll" -> "blasplus.dll" [color=green];
"umfpack.dll" -> "lapack.dll" [color=green];
"umfpack.dll" -> "libintl.dll" [color=green];
"matio.dll" -> "libscilab.dll" [color=green];
"matio.dll" -> "malloc.dll" [color=green];
"matio.dll" -> "api_scilab.dll" [color=green];
"matio.dll" -> "output_stream.dll" [color=green];
"matio.dll" -> "sparse_f.dll" [color=green];
"matio.dll" -> "scilab_windows.dll" [color=green];
"matio.dll" -> "libintl.dll" [color=green];
"matio.dll" -> "libmatio.dll" [color=green];
"helptools.dll" -> "libscilab.dll" [color=green];
"helptools.dll" -> "api_scilab.dll" [color=green];
"helptools.dll" -> "libjvm.dll" [color=green];
"helptools.dll" -> "scilocalization.dll" [color=green];
"helptools.dll" -> "output_stream.dll" [color=green];
"helptools.dll" -> "msvcp100d.dll" [color=green];
"helptools.dll" -> "libintl.dll" [color=green];
"linpack_f.dll" -> "elementary_functions_f.dll" [color=green];
"linpack_f.dll" -> "elementary_functions.dll" [color=green];
"linpack_f.dll" -> "blasplus.dll" [color=green];
"linpack_f.dll" -> "libf2c.dll" [color=green];
"eispack_f.dll" -> "lapack.dll" [color=green];
"eispack_f.dll" -> "libf2c.dll" [color=green];
"call_scilab.dll" -> "libscilab.dll" [color=green];
"call_scilab.dll" -> "malloc.dll" [color=green];
"call_scilab.dll" -> "api_scilab.dll" [color=green];
"call_scilab.dll" -> "fileio.dll" [color=green];
"call_scilab.dll" -> "graphics.dll" [color=green];
"call_scilab.dll" -> "output_stream.dll" [color=green];
"call_scilab.dll" -> "scilab_windows.dll" [color=green];
"output_stream_f.dll" -> "libscilab.dll" [color=green];
"output_stream_f.dll" -> "output_stream.dll" [color=green];
"output_stream_f.dll" -> "string.dll" [color=green];
"output_stream_f.dll" -> "io_f.dll" [color=green];
"output_stream_f.dll" -> "polynomials_f.dll" [color=green];
"output_stream_f.dll" -> "elementary_functions_f.dll" [color=green];
"output_stream_f.dll" -> "elementary_functions.dll" [color=green];
"output_stream_f.dll" -> "lapack.dll" [color=green];
"output_stream_f.dll" -> "libf2c.dll" [color=green];
"output_stream_f.dll" -> "linpack_f.dll" [color=green];
"functions.dll" -> "libscilab.dll" [color=green];
"functions.dll" -> "functions_f.dll" [color=green];
"functions.dll" -> "malloc.dll" [color=green];
"functions.dll" -> "api_scilab.dll" [color=green];
"functions.dll" -> "fileio.dll" [color=green];
"functions.dll" -> "scilocalization.dll" [color=green];
"functions.dll" -> "output_stream.dll" [color=green];
"functions.dll" -> "string.dll" [color=green];
"functions.dll" -> "scilab_windows.dll" [color=green];
"functions.dll" -> "libintl.dll" [color=green];
"functions_f.dll" -> "libscilab.dll" [color=green];
"functions_f.dll" -> "string.dll" [color=green];
"functions_f.dll" -> "output_stream.dll" [color=green];
"functions_f.dll" -> "fileio.dll" [color=green];
"functions_f.dll" -> "io_f.dll" [color=green];
"functions_f.dll" -> "libf2c.dll" [color=green];
"functions_f.dll" -> "elementary_functions.dll" [color=green];
"functions_f.dll" -> "elementary_functions_f.dll" [color=green];
"functions_f.dll" -> "linpack_f.dll" [color=green];
"api_scilab.dll" -> "libscilab.dll" [color=green];
"api_scilab.dll" -> "string.dll" [color=green];
"api_scilab.dll" -> "scilocalization.dll" [color=green];
"api_scilab.dll" -> "scilab_windows.dll" [color=green];
"api_scilab.dll" -> "blasplus.dll" [color=green];
"api_scilab.dll" -> "malloc.dll" [color=green];
"api_scilab.dll" -> "output_stream.dll" [color=green];
"api_scilab.dll" -> "libintl.dll" [color=green];
"hdf5.dll" -> "libscilab.dll" [color=green];
"hdf5.dll" -> "malloc.dll" [color=green];
"hdf5.dll" -> "api_scilab.dll" [color=green];
"hdf5.dll" -> "fileio.dll" [color=green];
"hdf5.dll" -> "libjvm.dll" [color=green];
"hdf5.dll" -> "output_stream.dll" [color=green];
"hdf5.dll" -> "scilab_windows.dll" [color=green];
"hdf5.dll" -> "libintl.dll" [color=green];
"hdf5.dll" -> "hdf5dll.dll" [color=green];
"hdf5.dll" -> "msvcp100d.dll" [color=green];
"sciscinotes.dll" -> "scilocalization.dll" [color=green];
"sciscinotes.dll" -> "libscilab.dll" [color=green];
"sciscinotes.dll" -> "malloc.dll" [color=green];
"sciscinotes.dll" -> "api_scilab.dll" [color=green];
"sciscinotes.dll" -> "fileio.dll" [color=green];
"sciscinotes.dll" -> "functions.dll" [color=green];
"sciscinotes.dll" -> "libjvm.dll" [color=green];
"sciscinotes.dll" -> "output_stream.dll" [color=green];
"sciscinotes.dll" -> "msvcp100d.dll" [color=green];
"sciscinotes.dll" -> "libintl.dll" [color=green];
"xcos.dll" -> "libscilab.dll" [color=green];
"xcos.dll" -> "malloc.dll" [color=green];
"xcos.dll" -> "api_scilab.dll" [color=green];
"xcos.dll" -> "fileio.dll" [color=green];
"xcos.dll" -> "libjvm.dll" [color=green];
"xcos.dll" -> "scilocalization.dll" [color=green];
"xcos.dll" -> "output_stream.dll" [color=green];
"xcos.dll" -> "msvcp100d.dll" [color=green];
"xcos.dll" -> "libintl.dll" [color=green];
"parameters.dll" -> "libscilab.dll" [color=green];
"parameters.dll" -> "scilab_windows.dll" [color=green];
"parameters.dll" -> "malloc.dll" [color=green];
"parameters.dll" -> "api_scilab.dll" [color=green];
"parameters.dll" -> "output_stream.dll" [color=green];
"parameters.dll" -> "libintl.dll" [color=green];
"sciui_data.dll" -> "libscilab.dll" [color=green];
"sciui_data.dll" -> "malloc.dll" [color=green];
"sciui_data.dll" -> "api_scilab.dll" [color=green];
"sciui_data.dll" -> "libjvm.dll" [color=green];
"sciui_data.dll" -> "output_stream.dll" [color=green];
"sciui_data.dll" -> "scilab_windows.dll" [color=green];
"sciui_data.dll" -> "msvcp100d.dll" [color=green];
"sciui_data.dll" -> "libintl.dll" [color=green];
"history_browser.dll" -> "libscilab.dll" [color=green];
"history_browser.dll" -> "libjvm.dll" [color=green];
"history_browser.dll" -> "msvcp100d.dll" [color=green];
"nolibjvm.dll" -> "libintl.dll" [color=green];
"nolibjvm.dll" -> "output_stream.dll" [color=green];
"nogui.dll" -> "libintl.dll" [color=green];
"nogui.dll" -> "output_stream.dll" [color=green];
"scicommons.dll" -> "libscilab.dll" [color=green];
"updater.dll" -> "libcurl.dll" [color=green];
"updater.dll" -> "mspatcha.dll" [color=green];
"updater.dll" -> "libscilab.dll" [color=green];
"updater.dll" -> "msvcp100d.dll" [color=green];
}
