//<-- JVM NOT MANDATORY -->
//=================================
// tests with integers <10^16 
x=bigint('987654321') 
 x  =
 
 
 987654321   
y=bigint('123456789') 
 y  =
 
 
 123456789   
z=x-y
 z  =
 
 
 864197532   
zz=987654321-123456789
 zz  =
 
    8.642D+08  
zzz=bigint(zz)
 zzz  =
 
 
 864197532   
assert_checkequal(z,zzz)
 ans  =
 
  T  
//negatives
x=bigint('987654321') 
 x  =
 
 
 987654321   
y=bigint('-123456789') 
 y  =
 
 
 -123456789   
z=x-y
 z  =
 
 
 1111111110   
zz=987654321+123456789
 zz  =
 
    1.111D+09  
zzz=bigint(zz)
 zzz  =
 
 
 1111111110   
assert_checkequal(z,zzz)
 ans  =
 
  T  
//
x=bigint('-987654321') 
 x  =
 
 
 -987654321   
y=bigint('123456789') 
 y  =
 
 
 123456789   
z=x-y
 z  =
 
 
 -1111111110   
zz=-(987654321+123456789)
 zz  =
 
  - 1.111D+09  
zzz=bigint(zz)
 zzz  =
 
 
 -1111111110   
assert_checkequal(z,zzz)
 ans  =
 
  T  
//
x=bigint('-987654321') 
 x  =
 
 
 -987654321   
y=bigint('-123456789') 
 y  =
 
 
 -123456789   
z=x-y
 z  =
 
 
 -864197532   
zz=-987654321+123456789
 zz  =
 
  - 8.642D+08  
zzz=bigint(zz)
 zzz  =
 
 
 -864197532   
assert_checkequal(z,zzz)
 ans  =
 
  T  
// mixed bigint / double 
x=bigint('987654321') 
 x  =
 
 
 987654321   
y=123456789
 y  =
 
    1.235D+08  
z=x-y
 z  =
 
 
 864197532   
zz=987654321-123456789
 zz  =
 
    8.642D+08  
zzz=bigint(zz)
 zzz  =
 
 
 864197532   
assert_checkequal(z,zzz)
 ans  =
 
  T  
x=bigint('987654321') 
 x  =
 
 
 987654321   
y=123456789*ones(2,2)
 y  =
 
 10^8 *
 
    1.2345679    1.2345679  
    1.2345679    1.2345679  
z=(x-y)
 z  =
 
 
!864197532  864197532  !
!                      !
!864197532  864197532  !
zz=987654321-123456789
 zz  =
 
    8.642D+08  
zzz=bigint(zz)
 zzz  =
 
 
 864197532   
assert_checkequal(z,zzz*ones(2,2))
 ans  =
 
  T  
// 
x=987654321
 x  =
 
    9.877D+08  
y=bigint('123456789') 
 y  =
 
 
 123456789   
z=x-y
 z  =
 
 
 864197532   
zz=987654321-123456789
 zz  =
 
    8.642D+08  
zzz=bigint(zz)
 zzz  =
 
 
 864197532   
assert_checkequal(z,zzz)
 ans  =
 
  T  
x=987654321*ones(2,2)
 x  =
 
 10^8 *
 
    9.8765432    9.8765432  
    9.8765432    9.8765432  
y=bigint('123456789') 
 y  =
 
 
 123456789   
z=x-y
 z  =
 
 
!864197532  864197532  !
!                      !
!864197532  864197532  !
zz=987654321-123456789
 zz  =
 
    8.642D+08  
zzz=bigint(zz)
 zzz  =
 
 
 864197532   
assert_checkequal(z,zzz*ones(2,2))
 ans  =
 
  T  
