//<-- JVM NOT MANDATORY -->
//=================================
x=bigint('12345678') 
 x  =
 
 
 12345678   
y=bigint('98765432')
 y  =
 
 
 98765432   
my=bigint('-98765432')
 my  =
 
 
 -98765432   
M=[x my]
 M  =
 
 
!12345678  -98765432  !
A=[x y]
 A  =
 
 
!12345678  98765432  !
assert_checkequal(abs(M),A)
 ans  =
 
  T  
