//<-- JVM NOT MANDATORY -->
//=================================
// 
x=bigint(123456789);
y=bigint(987654321);
z=x-y;
O=bigint(0);
L=[x y z O];
M=[L;L];
N=[x;y; z; O];
P=[y z; y z];
Q=[y;y];
assert_checktrue(M(1,4)==O)
 ans  =
 
  T  
assert_checktrue(M(2,1)==x)
 ans  =
 
  T  
assert_checktrue(M(4)==y)
 ans  =
 
  T  
assert_checktrue(L(3)==z)
 ans  =
 
  T  
assert_checktrue(L(1,3)==z)
 ans  =
 
  T  
assert_checktrue(N(2,1)==y)
 ans  =
 
  T  
assert_checktrue(N(2)==y)
 ans  =
 
  T  
assert_checktrue(M(2,:)==L)
 ans  =
 
  T  
assert_checktrue(M(:,2)==Q)
 ans  =
 
  T  
assert_checktrue(M(:,2:3)==P) 
 ans  =
 
  T  
//double overloading
xx=123456789;
yy=987654321;
zz=x-y;
LL=[xx yy zz 0];
PP=[yy zz; yy zz];
QQ=[yy;yy];
assert_checktrue(M(1,4)==0)
 ans  =
 
  T  
assert_checktrue(M(2,1)==xx)
 ans  =
 
  T  
assert_checktrue(M(4)==yy)
 ans  =
 
  T  
assert_checktrue(L(3)==zz)
 ans  =
 
  T  
assert_checktrue(L(1,3)==zz)
 ans  =
 
  T  
assert_checktrue(N(2,1)==yy)
 ans  =
 
  T  
assert_checktrue(N(2)==yy)
 ans  =
 
  T  
assert_checktrue(M(2,:)==LL)
 ans  =
 
  T  
assert_checktrue(M(:,2)==QQ)
 ans  =
 
  T  
assert_checktrue(M(:,2:3)==PP) 
 ans  =
 
  T  
