//<-- JVM NOT MANDATORY -->
//=================================
// tests with integers <10^16 
N=100;
L=mbigint(1:N)
 L  =
 
 
 
         column  1 to 19
 
!1  2  3  4  5  6  7  8  9  10  11  12  13  14  15  16  17  18  19  !
 
         column 20 to 36
 
!20  21  22  23  24  25  26  27  28  29  30  31  32  33  34  35  36  !
 
         column 37 to 53
 
!37  38  39  40  41  42  43  44  45  46  47  48  49  50  51  52  53  !
 
         column 54 to 70
 
!54  55  56  57  58  59  60  61  62  63  64  65  66  67  68  69  70  !
 
         column 71 to 87
 
!71  72  73  74  75  76  77  78  79  80  81  82  83  84  85  86  87  !
 
         column  88 to 100
 
!88  89  90  91  92  93  94  95  96  97  98  99  100  !
s=sum(L)
 s  =
 
 
 5050   
assert_checkequal(s,bigint(N*(N+1)/2))
 ans  =
 
  T  
M=zeros(10,10)
 M  =
 
    0.    0.    0.    0.    0.    0.    0.    0.    0.    0.  
    0.    0.    0.    0.    0.    0.    0.    0.    0.    0.  
    0.    0.    0.    0.    0.    0.    0.    0.    0.    0.  
    0.    0.    0.    0.    0.    0.    0.    0.    0.    0.  
    0.    0.    0.    0.    0.    0.    0.    0.    0.    0.  
    0.    0.    0.    0.    0.    0.    0.    0.    0.    0.  
    0.    0.    0.    0.    0.    0.    0.    0.    0.    0.  
    0.    0.    0.    0.    0.    0.    0.    0.    0.    0.  
    0.    0.    0.    0.    0.    0.    0.    0.    0.    0.  
    0.    0.    0.    0.    0.    0.    0.    0.    0.    0.  
M(:)=1:N
 M  =
 
 
         column 1 to 9
 
    1.     11.    21.    31.    41.    51.    61.    71.    81.  
    2.     12.    22.    32.    42.    52.    62.    72.    82.  
    3.     13.    23.    33.    43.    53.    63.    73.    83.  
    4.     14.    24.    34.    44.    54.    64.    74.    84.  
    5.     15.    25.    35.    45.    55.    65.    75.    85.  
    6.     16.    26.    36.    46.    56.    66.    76.    86.  
    7.     17.    27.    37.    47.    57.    67.    77.    87.  
    8.     18.    28.    38.    48.    58.    68.    78.    88.  
    9.     19.    29.    39.    49.    59.    69.    79.    89.  
    10.    20.    30.    40.    50.    60.    70.    80.    90.  
 
         column 10
 
    91.   
    92.   
    93.   
    94.   
    95.   
    96.   
    97.   
    98.   
    99.   
    100.  
S1=mbigint(sum(M))
 S1  =
 
 
 5050   
S2=mbigint(sum(M,'c'))
 S2  =
 
 
!460  !
!     !
!470  !
!     !
!480  !
!     !
!490  !
!     !
!500  !
!     !
!510  !
!     !
!520  !
!     !
!530  !
!     !
!540  !
!     !
!550  !
S3=mbigint(sum(M,'r'))
 S3  =
 
 
!55  155  255  355  455  555  655  755  855  955  !
M=mbigint(M)
 M  =
 
 
!1   11  21  31  41  51  61  71  81  91   !
!                                         !
!2   12  22  32  42  52  62  72  82  92   !
!                                         !
!3   13  23  33  43  53  63  73  83  93   !
!                                         !
!4   14  24  34  44  54  64  74  84  94   !
!                                         !
!5   15  25  35  45  55  65  75  85  95   !
!                                         !
!6   16  26  36  46  56  66  76  86  96   !
!                                         !
!7   17  27  37  47  57  67  77  87  97   !
!                                         !
!8   18  28  38  48  58  68  78  88  98   !
!                                         !
!9   19  29  39  49  59  69  79  89  99   !
!                                         !
!10  20  30  40  50  60  70  80  90  100  !
s1=sum(M)
 s1  =
 
 
 5050   
assert_checkequal(s1,S1)
 ans  =
 
  T  
s2=sum(M,'c') 
 s2  =
 
 
!460  !
!     !
!470  !
!     !
!480  !
!     !
!490  !
!     !
!500  !
!     !
!510  !
!     !
!520  !
!     !
!530  !
!     !
!540  !
!     !
!550  !
assert_checkequal(s2,S2)
 ans  =
 
  T  
s3=sum(M,'r')
 s3  =
 
 
!55  155  255  355  455  555  655  755  855  955  !
assert_checkequal(s3,S3)
 ans  =
 
  T  
//scalar case
NN=bigint(N)
 NN  =
 
 
 100   
assert_checkequal(NN,sum(NN))
 ans  =
 
  T  
