//<-- JVM NOT MANDATORY -->
//=================================
// tests with integers <10^16 
N=10;
L=mbigint(1:N)
 L  =
 
 
!1  2  3  4  5  6  7  8  9  10  !
s=prod(L)
 s  =
 
 
 3628800   
assert_checkequal(s,bigint(factorial(N)))
 ans  =
 
  T  
M=zeros(2,5)
 M  =
 
    0.    0.    0.    0.    0.  
    0.    0.    0.    0.    0.  
M(:)=1:N
 M  =
 
    1.    3.    5.    7.    9.   
    2.    4.    6.    8.    10.  
S1=mbigint(prod(M))
 S1  =
 
 
 3628800   
S2=mbigint(prod(M,'c'))
 S2  =
 
 
!945   !
!      !
!3840  !
S3=mbigint(prod(M,'r'))
 S3  =
 
 
!2  12  30  56  90  !
M=mbigint(M)
 M  =
 
 
!1  3  5  7  9   !
!                !
!2  4  6  8  10  !
s1=prod(M)
 s1  =
 
 
 3628800   
assert_checkequal(s1,S1)
 ans  =
 
  T  
s2=prod(M,'c') 
 s2  =
 
 
!945   !
!      !
!3840  !
assert_checkequal(s2,S2)
 ans  =
 
  T  
s3=prod(M,'r')
 s3  =
 
 
!2  12  30  56  90  !
assert_checkequal(s3,S3)
 ans  =
 
  T  
//scalar case
NN=bigint(N)
 NN  =
 
 
 10   
assert_checkequal(NN,prod(NN))
 ans  =
 
  T  
