//<-- JVM NOT MANDATORY -->
//=================================
// tests with integers <10^16 
x=bigint(123456789)
 x  =
 
 
 123456789   
y=bigint(987654321)
 y  =
 
 
 987654321   
L1=[x y x]
 L1  =
 
 
!123456789  987654321  123456789  !
L2=[x;y;x]
 L2  =
 
 
!123456789  !
!           !
!987654321  !
!           !
!123456789  !
assert_checkequal(L1',L2)
 ans  =
 
  T  
assert_checkequal(L1,L2')
 ans  =
 
  T  
assert_checkequal(L1.',L2)
 ans  =
 
  T  
assert_checkequal(L1,L2.')
 ans  =
 
  T  
//
M=[x y; x-y bigint(0)]
 M  =
 
 
!123456789   987654321  !
!                       !
!-864197532  0          !
N=[x x-y; y bigint(0)]
 N  =
 
 
!123456789  -864197532  !
!                       !
!987654321  0           !
assert_checkequal(M',N)
 ans  =
 
  T  
assert_checkequal(M,N')
 ans  =
 
  T  
assert_checkequal(M.',N)
 ans  =
 
  T  
assert_checkequal(M,N.')
 ans  =
 
  T  
