//<-- JVM NOT MANDATORY -->
//=================================
x=bigint('123456789');
y=bigint('987654321');
assert_checktrue(x<=x)
 ans  =
 
  T  
assert_checktrue(x<=y)
 ans  =
 
  T  
assert_checktrue(-y<=-x)
 ans  =
 
  T  
assert_checktrue(-y<=x)
 ans  =
 
  T  
assert_checkfalse(y<=x)
 ans  =
 
  T  
assert_checkfalse(-x<=-y)
 ans  =
 
  T  
assert_checkfalse(x<=-y)
 ans  =
 
  T  
// mixed bigint double expressions
x=123456789;
y=bigint('987654321');
assert_checktrue(x<=x)
 ans  =
 
  T  
assert_checktrue(x<=y)
 ans  =
 
  T  
assert_checktrue(-y<=-x)
 ans  =
 
  T  
assert_checktrue(-y<=x)
 ans  =
 
  T  
assert_checkfalse(y<=x)
 ans  =
 
  T  
assert_checkfalse(-x<=-y)
 ans  =
 
  T  
assert_checkfalse(x<=-y)
 ans  =
 
  T  
//
x=bigint('123456789');
y=987654321;
assert_checktrue(x<=x)
 ans  =
 
  T  
assert_checktrue(x<=y)
 ans  =
 
  T  
assert_checktrue(-y<=-x)
 ans  =
 
  T  
assert_checktrue(-y<=x)
 ans  =
 
  T  
assert_checkfalse(y<=x)
 ans  =
 
  T  
assert_checkfalse(-x<=-y)
 ans  =
 
  T  
assert_checkfalse(x<=-y)
 ans  =
 
  T  
// mixed bigint double matrix expressions
x=123456789*ones(2,2);
y=bigint('987654321');
assert_checktrue(and(x<=x))
 ans  =
 
  T  
assert_checktrue(and(x<=y))
 ans  =
 
  T  
assert_checktrue(and(-y<=-x))
 ans  =
 
  T  
assert_checktrue(and(-y<=x))
 ans  =
 
  T  
assert_checkfalse(and(y<=x))
 ans  =
 
  T  
assert_checkfalse(and(-x<=-y))
 ans  =
 
  T  
assert_checkfalse(and(x<=-y))
 ans  =
 
  T  
//
x=bigint('123456789');
y=987654321*ones(2,2);
assert_checktrue(and(x<=x))
 ans  =
 
  T  
assert_checktrue(and(x<=y))
 ans  =
 
  T  
assert_checktrue(and(-y<=-x))
 ans  =
 
  T  
assert_checktrue(and(-y<=x))
 ans  =
 
  T  
assert_checkfalse(and(y<=x))
 ans  =
 
  T  
assert_checkfalse(and(-x<=-y))
 ans  =
 
  T  
assert_checkfalse(and(x<=-y))
 ans  =
 
  T  
