//<-- JVM NOT MANDATORY -->
//=================================
x=bigint('987654321')
 x  =
 
 
 987654321   
y=bigint('123456789')
 y  =
 
 
 123456789   
q=x/y  //  bigint division
 q  =
 
 
 8   
qq=bigint(int(987654321/123456789))
 qq  =
 
 
 8   
assert_checkequal(q,qq)
 ans  =
 
  T  
r=x-q*y
 r  =
 
 
 9   
rr=bigint(pmodulo(987654321,123456789))
 rr  =
 
 
 9   
assert_checkequal(r,rr)
 ans  =
 
  T  
assert_checktrue(r<abs(y))
 ans  =
 
  T  
//overloading compatibility
x=987654321
 x  =
 
    9.877D+08  
y=bigint('123456789')
 y  =
 
 
 123456789   
q=x/y  //  bigint division
 q  =
 
 
 8   
qq=bigint(int(987654321/123456789))
 qq  =
 
 
 8   
assert_checkequal(q,qq)
 ans  =
 
  T  
r=x-q*y
 r  =
 
 
 9   
rr=bigint(pmodulo(987654321,123456789))
 rr  =
 
 
 9   
assert_checkequal(r,rr)
 ans  =
 
  T  
assert_checktrue(r<abs(y))
 ans  =
 
  T  
//overloading compatibility
x=bigint('987654321')
 x  =
 
 
 987654321   
y=123456789
 y  =
 
    1.235D+08  
q=x/y  //  bigint division
 q  =
 
 
 8   
qq=bigint(int(987654321/123456789))
 qq  =
 
 
 8   
assert_checkequal(q,qq)
 ans  =
 
  T  
r=x-q*y
 r  =
 
 
 9   
rr=bigint(pmodulo(987654321,123456789))
 rr  =
 
 
 9   
assert_checkequal(r,rr)
 ans  =
 
  T  
assert_checktrue(r<abs(y))
 ans  =
 
  T  
//interger greather than 10^16
y=bigint('1234567890')
 y  =
 
 
 1234567890   
x=bigint('987654321123456789')
 x  =
 
 
 987654321123456789   
q=x/y  //  bigint division
 q  =
 
 
 800000007   
r=x-q*y
 r  =
 
 
 481481559   
assert_checkequal(x,y*q+r)
 ans  =
 
  T  
assert_checktrue(r<abs(y))
 ans  =
 
  T  
