//<-- JVM NOT MANDATORY -->
//=================================
 x=bigint('123456789') 
 x  =
 
 
 123456789   
 y=bigint('02345678') 
 y  =
 
 
 2345678   
 z=bigint('1234567890') 
 z  =
 
 
 1234567890   
 M=[x y; z x-z]
 M  =
 
 
!123456789   2345678      !
!                         !
!1234567890  -1111111101  !
 N=[x x; x x]
 N  =
 
 
!123456789  123456789  !
!                      !
!123456789  123456789  !
 assert_checkequal((N>=M),[%T %T;%F %T])
 ans  =
 
  T  
 N=[y y; y y]
 N  =
 
 
!2345678  2345678  !
!                  !
!2345678  2345678  !
 assert_checkequal((N>=M),[%F %T;%F %T])
 ans  =
 
  T  
 N=[z z; z z]
 N  =
 
 
!1234567890  1234567890  !
!                        !
!1234567890  1234567890  !
 assert_checkequal((N>=M),[%T %T;%T %T])
 ans  =
 
  T  
 N=[x-z x-z; x-z x-z]
 N  =
 
 
!-1111111101  -1111111101  !
!                          !
!-1111111101  -1111111101  !
 assert_checkequal((x-z>=M),[%F %F;%F %T])
 ans  =
 
  T  
// mixed bigint / mbigint
 assert_checkequal((x>=M),[%T %T;%F %T])
 ans  =
 
  T  
 assert_checkequal((y>=M),[%F %T;%F %T])
 ans  =
 
  T  
 assert_checkequal((z>=M),[%T %T;%T %T])
 ans  =
 
  T  
 assert_checkequal((x-z>=M),[%F %F;%F %T])
 ans  =
 
  T  
 assert_checkequal((M>=x),[%t %f;%t %f])
 ans  =
 
  T  
 assert_checkequal((M>=y),[%t %t;%t %f])
 ans  =
 
  T  
 assert_checkequal((M>=z),[%f %f;%t %f])
 ans  =
 
  T  
 assert_checkequal((M>=x-z),[%t %t;%t %t])
 ans  =
 
  T  
// mixed bigint double expressions
 assert_checkequal(123456789>=M,[%T %T;%F %T])
 ans  =
 
  T  
 assert_checkequal(02345678>=M,[%F %T;%F %T])
 ans  =
 
  T  
 assert_checkequal(1234567890>=M,[%T %T;%T %T])
 ans  =
 
  T  
 assert_checkequal(-1111111101>=M,[%F %F;%F %T])
 ans  =
 
  T  
 assert_checkequal(M>=123456789,[%t %f;%t %f])
 ans  =
 
  T  
 assert_checkequal(M>=02345678,[%t %t;%t %f])
 ans  =
 
  T  
 assert_checkequal(M>=1234567890,[%f %f;%t %f])
 ans  =
 
  T  
 assert_checkequal(M>=-1111111101,[%t %t;%t %t])
 ans  =
 
  T  
