//<-- JVM NOT MANDATORY -->
//=================================
//check if  log10(bigint)=int(log10(double))+1
for k=8:16
    p10k=bigint(10)^(k-1)
    x=brand(10*p10k,p10k)
    assert_checktrue(int(log10(double(x)))+1==log10(x))
end
 p10k  =
 
 
 10000000   
 x  =
 
 
 39211612   
 ans  =
 
  T  
 p10k  =
 
 
 100000000   
 x  =
 
 
 115346734   
 ans  =
 
  T  
 p10k  =
 
 
 1000000000   
 x  =
 
 
 5065404204   
 ans  =
 
  T  
 p10k  =
 
 
 10000000000   
 x  =
 
 
 85162919429   
 ans  =
 
  T  
 p10k  =
 
 
 100000000000   
 x  =
 
 
 226975962298   
 ans  =
 
  T  
 p10k  =
 
 
 1000000000000   
 x  =
 
 
 4919548932835   
 ans  =
 
  T  
 p10k  =
 
 
 10000000000000   
 x  =
 
 
 90943376140740   
 ans  =
 
  T  
 p10k  =
 
 
 100000000000000   
 x  =
 
 
 741646979768804   
 ans  =
 
  T  
 p10k  =
 
 
 1000000000000000   
 x  =
 
 
 2674546096943009   
 ans  =
 
  T  
//check if log10(x)= number of decimal digits
for k=8:20
    p10k=bigint(10)^(k-1)
    x=brand(10*p10k,p10k)
    assert_checktrue(k==log10(x))
end
 p10k  =
 
 
 10000000   
 x  =
 
 
 73834039   
 ans  =
 
  T  
 p10k  =
 
 
 100000000   
 x  =
 
 
 471852626   
 ans  =
 
  T  
 p10k  =
 
 
 1000000000   
 x  =
 
 
 5127838553   
 ans  =
 
  T  
 p10k  =
 
 
 10000000000   
 x  =
 
 
 35095731771   
 ans  =
 
  T  
 p10k  =
 
 
 100000000000   
 x  =
 
 
 100802544909   
 ans  =
 
  T  
 p10k  =
 
 
 1000000000000   
 x  =
 
 
 1497563031418   
 ans  =
 
  T  
 p10k  =
 
 
 10000000000000   
 x  =
 
 
 15041757762695   
 ans  =
 
  T  
 p10k  =
 
 
 100000000000000   
 x  =
 
 
 189885872830893   
 ans  =
 
  T  
 p10k  =
 
 
 1000000000000000   
 x  =
 
 
 9670773066384844   
 ans  =
 
  T  
 p10k  =
 
 
 10000000000000000   
 x  =
 
 
 85769825971745920   
 ans  =
 
  T  
 p10k  =
 
 
 100000000000000000   
 x  =
 
 
 143864169341470445   
 ans  =
 
  T  
 p10k  =
 
 
 1000000000000000000   
 x  =
 
 
 7034944690582568902   
 ans  =
 
  T  
 p10k  =
 
 
 10000000000000000000   
 x  =
 
 
 80035190730061729660   
 ans  =
 
  T  
