// =============================================================================
// Scilab ( http://www.scilab.org/ ) - This file is part of Scilab
// Copyright (C) 2009 - DIGITEO - Pierre MARECHAL <pierre.marechal@scilab.org>
//
//  This file is distributed under the same license as the Scilab package.
// =============================================================================
// <-- ATOMS MANDATORY -->
// <-- CLI SHELL MODE -->
this_toolbox_name = "toolbox_1";
atomsLoad(this_toolbox_name);
StartToolbox1
	Loadmacros
	Loadgateways
	Loadhelp

this_toolbox_path = atomsGetLoadedPath(this_toolbox_name);
t1_common         = pathconvert(this_toolbox_path+"/tests/unit_tests/t1_common.txt",%F);
if t1_function2() <> "Toolbox 1 -> Function 2" then bugmes();quit;end
if isempty(fileinfo(t1_common)) then bugmes();quit;end
t1_common_mat = mgetl(t1_common);
if t1_function2()<>t1_common_mat(2) then bugmes();quit;end
