// =============================================================================
// Scilab ( http://www.scilab.org/ ) - This file is part of Scilab
// Copyright (C) 2009 - DIGITEO - Pierre MARECHAL <pierre.marechal@scilab.org>
//
//  This file is distributed under the same license as the Scilab package.
// =============================================================================
// <-- ATOMS MANDATORY -->
// <-- CLI SHELL MODE -->
this_toolbox_name = "toolbox_5";
atomsLoad(this_toolbox_name);
StartToolbox5
	Loadmacros
	Loadhelp

StartToolbox4
	Loadmacros
	Loadhelp

StartToolbox2
	Loadmacros
	Loadhelp

StartToolbox1
	Loadmacros
	Loadgateways
	Loadhelp

this_toolbox_path = atomsGetLoadedPath(this_toolbox_name);
t5_common         = pathconvert(this_toolbox_path+"/tests/unit_tests/t5_common.txt",%F);
ref = [ "Toolbox 5 -> Function 1" ; "Toolbox 4 -> Function 1" ; "Toolbox 2 -> Function 1" ; "Toolbox 1 -> Function 1" ];
if or( t5_function1() <> ref ) then bugmes();quit;end
if isempty(fileinfo(t5_common)) then bugmes();quit;end
t5_common_mat = mgetl(t5_common);
if t5_function1()<>t5_common_mat(1:4) then bugmes();quit;end
