<?xml version="1.0" encoding="UTF-8" standalone="no"?>
<!-- Created with Inkscape (http://www.inkscape.org/) -->

<svg
   xmlns:dc="http://purl.org/dc/elements/1.1/"
   xmlns:cc="http://creativecommons.org/ns#"
   xmlns:rdf="http://www.w3.org/1999/02/22-rdf-syntax-ns#"
   xmlns:svg="http://www.w3.org/2000/svg"
   xmlns="http://www.w3.org/2000/svg"
   xmlns:xlink="http://www.w3.org/1999/xlink"
   xmlns:sodipodi="http://sodipodi.sourceforge.net/DTD/sodipodi-0.dtd"
   xmlns:inkscape="http://www.inkscape.org/namespaces/inkscape"
   id="svg11300"
   height="48px"
   width="48px"
   version="1.1"
   inkscape:version="0.48.4 r9939"
   sodipodi:docname="GEOMAG_MODEL.svg">
  <sodipodi:namedview
     pagecolor="#ffffff"
     bordercolor="#666666"
     borderopacity="1"
     objecttolerance="10"
     gridtolerance="10"
     guidetolerance="10"
     inkscape:pageopacity="0"
     inkscape:pageshadow="2"
     inkscape:window-width="1400"
     inkscape:window-height="991"
     id="namedview29"
     showgrid="false"
     inkscape:zoom="7.1889189"
     inkscape:cx="-10.956071"
     inkscape:cy="46.056533"
     inkscape:window-x="0"
     inkscape:window-y="27"
     inkscape:window-maximized="1"
     inkscape:current-layer="svg11300" />
  <defs
     id="defs3">
    <linearGradient
       id="linearGradient2308">
      <stop
         id="stop2310"
         stop-color="#73d216"
         offset="0" />
      <stop
         id="stop2312"
         stop-color="#4e9a06"
         offset="1" />
    </linearGradient>
    <radialGradient
       id="radialGradient41523"
       xlink:href="#linearGradient2308"
       gradientUnits="userSpaceOnUse"
       cy="11.13"
       cx="16.762"
       gradientTransform="matrix(1,0,0,1.0143566,0,-0.15979618)"
       r="5.1606" />
    <radialGradient
       id="radialGradient41559"
       xlink:href="#linearGradient2308"
       gradientUnits="userSpaceOnUse"
       cy="23.852"
       cx="16.558"
       gradientTransform="matrix(1,0,0,1.6724318,0,-16.038632)"
       r="10.621" />
    <radialGradient
       id="radialGradient41567"
       xlink:href="#linearGradient2308"
       gradientUnits="userSpaceOnUse"
       cy="24"
       cx="24"
       gradientTransform="matrix(1,0,0,0.94526472,0,1.3136468)"
       r="21.402" />
    <radialGradient
       id="radialGradient41611"
       xlink:href="#linearGradient2308"
       gradientUnits="userSpaceOnUse"
       cy="32.798"
       cx="22.292"
       gradientTransform="matrix(0,0.79622462,0.28794563,0,10.370068,0.08587213)"
       r="16.956" />
    <inkscape:perspective
       sodipodi:type="inkscape:persp3d"
       inkscape:vp_x="0 : 80.001045 : 1"
       inkscape:vp_y="0 : 1000 : 0"
       inkscape:vp_z="159.99997 : 80.001045 : 1"
       inkscape:persp3d-origin="79.999985 : 53.33403 : 1"
       id="perspective3486" />
    <linearGradient
       id="linearGradient5142">
      <stop
         style="stop-color: rgb(191, 209, 235); stop-opacity: 1;"
         offset="0"
         id="stop5144" />
      <stop
         id="stop5150"
         offset="0.61538464"
         style="stop-color: rgb(49, 92, 155); stop-opacity: 1;" />
      <stop
         style="stop-color: rgb(17, 35, 58); stop-opacity: 1;"
         offset="1"
         id="stop5146" />
    </linearGradient>
    <linearGradient
       id="linearGradient13206">
      <stop
         id="stop13208"
         offset="0"
         style="stop-color:#b0ae13;stop-opacity:1;" />
      <stop
         id="stop2186"
         offset="1"
         style="stop-color:#3b6617;stop-opacity:0.90588236;" />
    </linearGradient>
    <linearGradient
       id="linearGradient6339">
      <stop
         style="stop-color: rgb(110, 159, 75); stop-opacity: 1;"
         offset="0"
         id="stop6341" />
      <stop
         id="stop12671"
         offset="0.5"
         style="stop-color: rgb(66, 95, 45); stop-opacity: 1;" />
      <stop
         id="stop6347"
         offset="1"
         style="stop-color: rgb(42, 61, 29); stop-opacity: 1;" />
    </linearGradient>
    <inkscape:perspective
       sodipodi:type="inkscape:persp3d"
       inkscape:vp_x="0 : 526.18109 : 1"
       inkscape:vp_y="0 : 1000 : 0"
       inkscape:vp_z="744.09448 : 526.18109 : 1"
       inkscape:persp3d-origin="372.04724 : 350.78739 : 1"
       id="perspective3286" />
    <inkscape:perspective
       id="perspective2495"
       inkscape:persp3d-origin="372.04724 : 350.78739 : 1"
       inkscape:vp_z="744.09448 : 526.18109 : 1"
       inkscape:vp_y="0 : 1000 : 0"
       inkscape:vp_x="0 : 526.18109 : 1"
       sodipodi:type="inkscape:persp3d" />
  </defs>
  <metadata
     id="metadata4">
    <rdf:RDF>
      <cc:Work
         rdf:about="">
        <dc:format>image/svg+xml</dc:format>
        <dc:type
           rdf:resource="http://purl.org/dc/dcmitype/StillImage" />
        <dc:creator>
          <cc:Agent>
            <dc:title />
          </cc:Agent>
        </dc:creator>
        <dc:source />
        <cc:license
           rdf:resource="" />
        <dc:title></dc:title>
        <dc:subject>
          <rdf:Bag />
        </dc:subject>
      </cc:Work>
    </rdf:RDF>
  </metadata>
  <text
     xml:space="preserve"
     style="font-size:16.79375076px;font-style:normal;font-weight:normal;line-height:125%;letter-spacing:0px;word-spacing:0px;fill:#000000;fill-opacity:1;stroke:none;font-family:Sans"
     x="5.1711817"
     y="45.562256"
     id="text3082"
     sodipodi:linespacing="125%"><tspan
       sodipodi:role="line"
       id="tspan3084"
       x="5.1711817"
       y="45.562256">IGRF</tspan></text>
  <rect
     style="fill:#ff0000;fill-opacity:0.99607842999999996;stroke:#000000;stroke-width:2;stroke-linecap:round;stroke-linejoin:round;stroke-miterlimit:4;stroke-opacity:1;stroke-dasharray:none;stroke-dashoffset:0"
     id="rect3606-9-7"
     width="15.579532"
     height="20.030828"
     x="9.4372711"
     y="6.4082108" />
  <rect
     style="fill:#6791ff;fill-opacity:0.99607842999999996;stroke:#000000;stroke-width:2;stroke-linecap:round;stroke-linejoin:round;stroke-miterlimit:4;stroke-opacity:1;stroke-dasharray:none;stroke-dashoffset:0"
     id="rect3606-9-7-4"
     width="15.579532"
     height="20.030828"
     x="25.038536"
     y="6.4082108" />
  <text
     xml:space="preserve"
     style="font-size:16px;font-style:normal;font-weight:bold;line-height:125%;letter-spacing:9.56999969px;word-spacing:0px;fill:#ffffff;fill-opacity:1;stroke:none;font-family:Sans;-inkscape-font-specification:Sans Bold"
     x="10.432723"
     y="22.265949"
     id="text4448"
     sodipodi:linespacing="125%"><tspan
       sodipodi:role="line"
       id="tspan4450"
       x="10.432723"
       y="22.265949">N</tspan></text>
  <text
     xml:space="preserve"
     style="font-size:18px;font-style:normal;font-weight:bold;line-height:125%;letter-spacing:9.56999969px;word-spacing:0px;fill:#ffffff;fill-opacity:1;stroke:none;font-family:Sans;-inkscape-font-specification:Sans Bold"
     x="26.965311"
     y="22.428247"
     id="text4448-3"
     sodipodi:linespacing="125%"><tspan
       sodipodi:role="line"
       id="tspan4450-9"
       x="26.965311"
       y="22.428247"
       style="font-size:16px">S</tspan></text>
</svg>
