// Copyright (C) 2011 - Michael Baudin
//
// This file must be used under the terms of the CeCILL.
// This source file is licensed as described in the file COPYING, which
// you should have received as part of this distribution.  The terms
// are also available at
// http://www.cecill.info/licences/Licence_CeCILL_V2-en.txt
//
// <-- CLI SHELL MODE -->
// <-- ENGLISH IMPOSED -->
x = [-9.9 5.5 2.2 -3.3 -6.6 0 1.1]
 x  =
 
  - 9.9    5.5    2.2  - 3.3  - 6.6    0.    1.1  
for o = 1 : 7
  y = accsum_order ( x , o );
  order(o,:) = [o y'];
end
expected = [
    1.  -9.9    5.5    2.2  -3.3  -6.6    0.    1.1  
    2.  -9.9  -6.6  -3.3    0.    1.1    2.2    5.5  
    3.    5.5    2.2    1.1    0.  -3.3  -6.6  -9.9  
    4.    0.    1.1    2.2  -3.3    5.5  -6.6  -9.9  
    5.  -9.9  -6.6    5.5  -3.3    2.2    1.1    0.  
    6.  -9.9  -6.6  -3.3    0.    5.5    2.2    1.1  
    7.  -3.3  -6.6  -9.9    0.    1.1    2.2    5.5  
];
assert_checkequal(order,expected);
//
// Check random order
  y1 = accsum_order ( x , 8 );
  y2 = accsum_order ( x , 8 );
assert_checktrue(~(and(y1==y2)));
