%!PS-Adobe-2.0 EPSF-2.0
%%Title: erreur_krig_rast_2d.eps
%%Creator: gnuplot 4.0 patchlevel 0
%%CreationDate: Fri Sep  5 18:04:46 2008
%%DocumentFonts: (atend)
%%BoundingBox: 50 50 500 402
%%Orientation: Portrait
%%EndComments
/gnudict 256 dict def
gnudict begin
/Color true def
/Solid false def
/gnulinewidth 5.000 def
/userlinewidth gnulinewidth def
/vshift -60 def
/dl {10.0 mul} def
/hpt_ 31.5 def
/vpt_ 31.5 def
/hpt hpt_ def
/vpt vpt_ def
/Rounded false def
/M {moveto} bind def
/L {lineto} bind def
/R {rmoveto} bind def
/V {rlineto} bind def
/N {newpath moveto} bind def
/C {setrgbcolor} bind def
/f {rlineto fill} bind def
/vpt2 vpt 2 mul def
/hpt2 hpt 2 mul def
/Lshow { currentpoint stroke M
  0 vshift R show } def
/Rshow { currentpoint stroke M
  dup stringwidth pop neg vshift R show } def
/Cshow { currentpoint stroke M
  dup stringwidth pop -2 div vshift R show } def
/UP { dup vpt_ mul /vpt exch def hpt_ mul /hpt exch def
  /hpt2 hpt 2 mul def /vpt2 vpt 2 mul def } def
/DL { Color {setrgbcolor Solid {pop []} if 0 setdash }
 {pop pop pop 0 setgray Solid {pop []} if 0 setdash} ifelse } def
/BL { stroke userlinewidth 2 mul setlinewidth
      Rounded { 1 setlinejoin 1 setlinecap } if } def
/AL { stroke userlinewidth 2 div setlinewidth
      Rounded { 1 setlinejoin 1 setlinecap } if } def
/UL { dup gnulinewidth mul /userlinewidth exch def
      dup 1 lt {pop 1} if 10 mul /udl exch def } def
/PL { stroke userlinewidth setlinewidth
      Rounded { 1 setlinejoin 1 setlinecap } if } def
/LTw { PL [] 1 setgray } def
/LTb { BL [] 0 0 0 DL } def
/LTa { AL [1 udl mul 2 udl mul] 0 setdash 0 0 0 setrgbcolor } def
/LT0 { PL [] 1 0 0 DL } def
/LT1 { PL [4 dl 2 dl] 0 1 0 DL } def
/LT2 { PL [2 dl 3 dl] 0 0 1 DL } def
/LT3 { PL [1 dl 1.5 dl] 1 0 1 DL } def
/LT4 { PL [5 dl 2 dl 1 dl 2 dl] 0 1 1 DL } def
/LT5 { PL [4 dl 3 dl 1 dl 3 dl] 1 1 0 DL } def
/LT6 { PL [2 dl 2 dl 2 dl 4 dl] 0 0 0 DL } def
/LT7 { PL [2 dl 2 dl 2 dl 2 dl 2 dl 4 dl] 1 0.3 0 DL } def
/LT8 { PL [2 dl 2 dl 2 dl 2 dl 2 dl 2 dl 2 dl 4 dl] 0.5 0.5 0.5 DL } def
/Pnt { stroke [] 0 setdash
   gsave 1 setlinecap M 0 0 V stroke grestore } def
/Dia { stroke [] 0 setdash 2 copy vpt add M
  hpt neg vpt neg V hpt vpt neg V
  hpt vpt V hpt neg vpt V closepath stroke
  Pnt } def
/Pls { stroke [] 0 setdash vpt sub M 0 vpt2 V
  currentpoint stroke M
  hpt neg vpt neg R hpt2 0 V stroke
  } def
/Box { stroke [] 0 setdash 2 copy exch hpt sub exch vpt add M
  0 vpt2 neg V hpt2 0 V 0 vpt2 V
  hpt2 neg 0 V closepath stroke
  Pnt } def
/Crs { stroke [] 0 setdash exch hpt sub exch vpt add M
  hpt2 vpt2 neg V currentpoint stroke M
  hpt2 neg 0 R hpt2 vpt2 V stroke } def
/TriU { stroke [] 0 setdash 2 copy vpt 1.12 mul add M
  hpt neg vpt -1.62 mul V
  hpt 2 mul 0 V
  hpt neg vpt 1.62 mul V closepath stroke
  Pnt  } def
/Star { 2 copy Pls Crs } def
/BoxF { stroke [] 0 setdash exch hpt sub exch vpt add M
  0 vpt2 neg V  hpt2 0 V  0 vpt2 V
  hpt2 neg 0 V  closepath fill } def
/TriUF { stroke [] 0 setdash vpt 1.12 mul add M
  hpt neg vpt -1.62 mul V
  hpt 2 mul 0 V
  hpt neg vpt 1.62 mul V closepath fill } def
/TriD { stroke [] 0 setdash 2 copy vpt 1.12 mul sub M
  hpt neg vpt 1.62 mul V
  hpt 2 mul 0 V
  hpt neg vpt -1.62 mul V closepath stroke
  Pnt  } def
/TriDF { stroke [] 0 setdash vpt 1.12 mul sub M
  hpt neg vpt 1.62 mul V
  hpt 2 mul 0 V
  hpt neg vpt -1.62 mul V closepath fill} def
/DiaF { stroke [] 0 setdash vpt add M
  hpt neg vpt neg V hpt vpt neg V
  hpt vpt V hpt neg vpt V closepath fill } def
/Pent { stroke [] 0 setdash 2 copy gsave
  translate 0 hpt M 4 {72 rotate 0 hpt L} repeat
  closepath stroke grestore Pnt } def
/PentF { stroke [] 0 setdash gsave
  translate 0 hpt M 4 {72 rotate 0 hpt L} repeat
  closepath fill grestore } def
/Circle { stroke [] 0 setdash 2 copy
  hpt 0 360 arc stroke Pnt } def
/CircleF { stroke [] 0 setdash hpt 0 360 arc fill } def
/C0 { BL [] 0 setdash 2 copy moveto vpt 90 450  arc } bind def
/C1 { BL [] 0 setdash 2 copy        moveto
       2 copy  vpt 0 90 arc closepath fill
               vpt 0 360 arc closepath } bind def
/C2 { BL [] 0 setdash 2 copy moveto
       2 copy  vpt 90 180 arc closepath fill
               vpt 0 360 arc closepath } bind def
/C3 { BL [] 0 setdash 2 copy moveto
       2 copy  vpt 0 180 arc closepath fill
               vpt 0 360 arc closepath } bind def
/C4 { BL [] 0 setdash 2 copy moveto
       2 copy  vpt 180 270 arc closepath fill
               vpt 0 360 arc closepath } bind def
/C5 { BL [] 0 setdash 2 copy moveto
       2 copy  vpt 0 90 arc
       2 copy moveto
       2 copy  vpt 180 270 arc closepath fill
               vpt 0 360 arc } bind def
/C6 { BL [] 0 setdash 2 copy moveto
      2 copy  vpt 90 270 arc closepath fill
              vpt 0 360 arc closepath } bind def
/C7 { BL [] 0 setdash 2 copy moveto
      2 copy  vpt 0 270 arc closepath fill
              vpt 0 360 arc closepath } bind def
/C8 { BL [] 0 setdash 2 copy moveto
      2 copy vpt 270 360 arc closepath fill
              vpt 0 360 arc closepath } bind def
/C9 { BL [] 0 setdash 2 copy moveto
      2 copy  vpt 270 450 arc closepath fill
              vpt 0 360 arc closepath } bind def
/C10 { BL [] 0 setdash 2 copy 2 copy moveto vpt 270 360 arc closepath fill
       2 copy moveto
       2 copy vpt 90 180 arc closepath fill
               vpt 0 360 arc closepath } bind def
/C11 { BL [] 0 setdash 2 copy moveto
       2 copy  vpt 0 180 arc closepath fill
       2 copy moveto
       2 copy  vpt 270 360 arc closepath fill
               vpt 0 360 arc closepath } bind def
/C12 { BL [] 0 setdash 2 copy moveto
       2 copy  vpt 180 360 arc closepath fill
               vpt 0 360 arc closepath } bind def
/C13 { BL [] 0 setdash  2 copy moveto
       2 copy  vpt 0 90 arc closepath fill
       2 copy moveto
       2 copy  vpt 180 360 arc closepath fill
               vpt 0 360 arc closepath } bind def
/C14 { BL [] 0 setdash 2 copy moveto
       2 copy  vpt 90 360 arc closepath fill
               vpt 0 360 arc } bind def
/C15 { BL [] 0 setdash 2 copy vpt 0 360 arc closepath fill
               vpt 0 360 arc closepath } bind def
/Rec   { newpath 4 2 roll moveto 1 index 0 rlineto 0 exch rlineto
       neg 0 rlineto closepath } bind def
/Square { dup Rec } bind def
/Bsquare { vpt sub exch vpt sub exch vpt2 Square } bind def
/S0 { BL [] 0 setdash 2 copy moveto 0 vpt rlineto BL Bsquare } bind def
/S1 { BL [] 0 setdash 2 copy vpt Square fill Bsquare } bind def
/S2 { BL [] 0 setdash 2 copy exch vpt sub exch vpt Square fill Bsquare } bind def
/S3 { BL [] 0 setdash 2 copy exch vpt sub exch vpt2 vpt Rec fill Bsquare } bind def
/S4 { BL [] 0 setdash 2 copy exch vpt sub exch vpt sub vpt Square fill Bsquare } bind def
/S5 { BL [] 0 setdash 2 copy 2 copy vpt Square fill
       exch vpt sub exch vpt sub vpt Square fill Bsquare } bind def
/S6 { BL [] 0 setdash 2 copy exch vpt sub exch vpt sub vpt vpt2 Rec fill Bsquare } bind def
/S7 { BL [] 0 setdash 2 copy exch vpt sub exch vpt sub vpt vpt2 Rec fill
       2 copy vpt Square fill
       Bsquare } bind def
/S8 { BL [] 0 setdash 2 copy vpt sub vpt Square fill Bsquare } bind def
/S9 { BL [] 0 setdash 2 copy vpt sub vpt vpt2 Rec fill Bsquare } bind def
/S10 { BL [] 0 setdash 2 copy vpt sub vpt Square fill 2 copy exch vpt sub exch vpt Square fill
       Bsquare } bind def
/S11 { BL [] 0 setdash 2 copy vpt sub vpt Square fill 2 copy exch vpt sub exch vpt2 vpt Rec fill
       Bsquare } bind def
/S12 { BL [] 0 setdash 2 copy exch vpt sub exch vpt sub vpt2 vpt Rec fill Bsquare } bind def
/S13 { BL [] 0 setdash 2 copy exch vpt sub exch vpt sub vpt2 vpt Rec fill
       2 copy vpt Square fill Bsquare } bind def
/S14 { BL [] 0 setdash 2 copy exch vpt sub exch vpt sub vpt2 vpt Rec fill
       2 copy exch vpt sub exch vpt Square fill Bsquare } bind def
/S15 { BL [] 0 setdash 2 copy Bsquare fill Bsquare } bind def
/D0 { gsave translate 45 rotate 0 0 S0 stroke grestore } bind def
/D1 { gsave translate 45 rotate 0 0 S1 stroke grestore } bind def
/D2 { gsave translate 45 rotate 0 0 S2 stroke grestore } bind def
/D3 { gsave translate 45 rotate 0 0 S3 stroke grestore } bind def
/D4 { gsave translate 45 rotate 0 0 S4 stroke grestore } bind def
/D5 { gsave translate 45 rotate 0 0 S5 stroke grestore } bind def
/D6 { gsave translate 45 rotate 0 0 S6 stroke grestore } bind def
/D7 { gsave translate 45 rotate 0 0 S7 stroke grestore } bind def
/D8 { gsave translate 45 rotate 0 0 S8 stroke grestore } bind def
/D9 { gsave translate 45 rotate 0 0 S9 stroke grestore } bind def
/D10 { gsave translate 45 rotate 0 0 S10 stroke grestore } bind def
/D11 { gsave translate 45 rotate 0 0 S11 stroke grestore } bind def
/D12 { gsave translate 45 rotate 0 0 S12 stroke grestore } bind def
/D13 { gsave translate 45 rotate 0 0 S13 stroke grestore } bind def
/D14 { gsave translate 45 rotate 0 0 S14 stroke grestore } bind def
/D15 { gsave translate 45 rotate 0 0 S15 stroke grestore } bind def
/DiaE { stroke [] 0 setdash vpt add M
  hpt neg vpt neg V hpt vpt neg V
  hpt vpt V hpt neg vpt V closepath stroke } def
/BoxE { stroke [] 0 setdash exch hpt sub exch vpt add M
  0 vpt2 neg V hpt2 0 V 0 vpt2 V
  hpt2 neg 0 V closepath stroke } def
/TriUE { stroke [] 0 setdash vpt 1.12 mul add M
  hpt neg vpt -1.62 mul V
  hpt 2 mul 0 V
  hpt neg vpt 1.62 mul V closepath stroke } def
/TriDE { stroke [] 0 setdash vpt 1.12 mul sub M
  hpt neg vpt 1.62 mul V
  hpt 2 mul 0 V
  hpt neg vpt -1.62 mul V closepath stroke } def
/PentE { stroke [] 0 setdash gsave
  translate 0 hpt M 4 {72 rotate 0 hpt L} repeat
  closepath stroke grestore } def
/CircE { stroke [] 0 setdash 
  hpt 0 360 arc stroke } def
/Opaque { gsave closepath 1 setgray fill grestore 0 setgray closepath } def
/DiaW { stroke [] 0 setdash vpt add M
  hpt neg vpt neg V hpt vpt neg V
  hpt vpt V hpt neg vpt V Opaque stroke } def
/BoxW { stroke [] 0 setdash exch hpt sub exch vpt add M
  0 vpt2 neg V hpt2 0 V 0 vpt2 V
  hpt2 neg 0 V Opaque stroke } def
/TriUW { stroke [] 0 setdash vpt 1.12 mul add M
  hpt neg vpt -1.62 mul V
  hpt 2 mul 0 V
  hpt neg vpt 1.62 mul V Opaque stroke } def
/TriDW { stroke [] 0 setdash vpt 1.12 mul sub M
  hpt neg vpt 1.62 mul V
  hpt 2 mul 0 V
  hpt neg vpt -1.62 mul V Opaque stroke } def
/PentW { stroke [] 0 setdash gsave
  translate 0 hpt M 4 {72 rotate 0 hpt L} repeat
  Opaque stroke grestore } def
/CircW { stroke [] 0 setdash 
  hpt 0 360 arc Opaque stroke } def
/BoxFill { gsave Rec 1 setgray fill grestore } def
/BoxColFill {
  gsave Rec
  /Fillden exch def
  currentrgbcolor
  /ColB exch def /ColG exch def /ColR exch def
  /ColR ColR Fillden mul Fillden sub 1 add def
  /ColG ColG Fillden mul Fillden sub 1 add def
  /ColB ColB Fillden mul Fillden sub 1 add def
  ColR ColG ColB setrgbcolor
  fill grestore } def
%
% PostScript Level 1 Pattern Fill routine
% Usage: x y w h s a XX PatternFill
%	x,y = lower left corner of box to be filled
%	w,h = width and height of box
%	  a = angle in degrees between lines and x-axis
%	 XX = 0/1 for no/yes cross-hatch
%
/PatternFill { gsave /PFa [ 9 2 roll ] def
    PFa 0 get PFa 2 get 2 div add PFa 1 get PFa 3 get 2 div add translate
    PFa 2 get -2 div PFa 3 get -2 div PFa 2 get PFa 3 get Rec
    gsave 1 setgray fill grestore clip
    currentlinewidth 0.5 mul setlinewidth
    /PFs PFa 2 get dup mul PFa 3 get dup mul add sqrt def
    0 0 M PFa 5 get rotate PFs -2 div dup translate
	0 1 PFs PFa 4 get div 1 add floor cvi
	{ PFa 4 get mul 0 M 0 PFs V } for
    0 PFa 6 get ne {
	0 1 PFs PFa 4 get div 1 add floor cvi
	{ PFa 4 get mul 0 2 1 roll M PFs 0 V } for
    } if
    stroke grestore } def
%
/Symbol-Oblique /Symbol findfont [1 0 .167 1 0 0] makefont
dup length dict begin {1 index /FID eq {pop pop} {def} ifelse} forall
currentdict end definefont pop
/MFshow {
   { dup 5 get 3 ge
     { 5 get 3 eq {gsave} {grestore} ifelse }
     {dup dup 0 get findfont exch 1 get scalefont setfont
     [ currentpoint ] exch dup 2 get 0 exch R dup 5 get 2 ne {dup dup 6
     get exch 4 get {show} {stringwidth pop 0 R} ifelse }if dup 5 get 0 eq
     {dup 3 get {2 get neg 0 exch R pop} {pop aload pop M} ifelse} {dup 5
     get 1 eq {dup 2 get exch dup 3 get exch 6 get stringwidth pop -2 div
     dup 0 R} {dup 6 get stringwidth pop -2 div 0 R 6 get
     show 2 index {aload pop M neg 3 -1 roll neg R pop pop} {pop pop pop
     pop aload pop M} ifelse }ifelse }ifelse }
     ifelse }
   forall} bind def
/MFwidth {0 exch {dup 3 get{dup dup 0 get findfont exch 1 get scalefont
     setfont 6 get stringwidth pop add} {pop} ifelse} forall} bind def
/MLshow { currentpoint stroke M
  0 exch R MFshow } bind def
/MRshow { currentpoint stroke M
  exch dup MFwidth neg 3 -1 roll R MFshow } def
/MCshow { currentpoint stroke M
  exch dup MFwidth -2 div 3 -1 roll R MFshow } def
end
%%EndProlog
gnudict begin
gsave
50 50 translate
0.050 0.050 scale
0 setgray
newpath
(Helvetica) findfont 180 scalefont setfont
1.000 UL
LTb
gsave %% colour palette begin
/maxcolors 0 def
/HSV2RGB {  exch dup 0.0 eq {pop exch pop dup dup} % achromatic gray
  { /HSVs exch def /HSVv exch def 6.0 mul dup floor dup 3 1 roll sub
     /HSVf exch def /HSVi exch cvi def /HSVp HSVv 1.0 HSVs sub mul def
	 /HSVq HSVv 1.0 HSVs HSVf mul sub mul def 
	 /HSVt HSVv 1.0 HSVs 1.0 HSVf sub mul sub mul def
	 /HSVi HSVi 6 mod def 0 HSVi eq {HSVv HSVt HSVp}
	 {1 HSVi eq {HSVq HSVv HSVp}{2 HSVi eq {HSVp HSVv HSVt}
	 {3 HSVi eq {HSVp HSVq HSVv}{4 HSVi eq {HSVt HSVp HSVv}
	 {HSVv HSVp HSVq} ifelse} ifelse} ifelse} ifelse} ifelse
  } ifelse} def
/Constrain {
  dup 0 lt {0 exch pop}{dup 1 gt {1 exch pop} if} ifelse} def
/YIQ2RGB {
  3 copy -1.702 mul exch -1.105 mul add add Constrain 4 1 roll
  3 copy -0.647 mul exch -0.272 mul add add Constrain 5 1 roll
  0.621 mul exch -0.956 mul add add Constrain 3 1 roll } def
/CMY2RGB {  1 exch sub exch 1 exch sub 3 2 roll 1 exch sub 3 1 roll exch } def
/XYZ2RGB {  3 copy -0.9017 mul exch -0.1187 mul add exch 0.0585 mul exch add
  Constrain 4 1 roll 3 copy -0.0279 mul exch 1.999 mul add exch
  -0.9844 mul add Constrain 5 1 roll -0.2891 mul exch -0.5338 mul add
  exch 1.91 mul exch add Constrain 3 1 roll} def
/SelectSpace {ColorSpace (HSV) eq {HSV2RGB}{ColorSpace (XYZ) eq {
  XYZ2RGB}{ColorSpace (CMY) eq {CMY2RGB}{ColorSpace (YIQ) eq {YIQ2RGB}
  if} ifelse} ifelse} ifelse} def
/InterpolatedColor true def
/grayindex {/gidx 0 def
  {GrayA gidx get grayv ge {exit} if /gidx gidx 1 add def} loop} def
/dgdx {grayv GrayA gidx get sub GrayA gidx 1 sub get
  GrayA gidx get sub div} def 
/redvalue {RedA gidx get RedA gidx 1 sub get
  RedA gidx get sub dgdxval mul add} def
/greenvalue {GreenA gidx get GreenA gidx 1 sub get
  GreenA gidx get sub dgdxval mul add} def
/bluevalue {BlueA gidx get BlueA gidx 1 sub get
  BlueA gidx get sub dgdxval mul add} def
/interpolate {
  grayindex grayv GrayA gidx get sub abs 1e-5 le
    {RedA gidx get GreenA gidx get BlueA gidx get}
    {/dgdxval dgdx def redvalue greenvalue bluevalue} ifelse} def
/GrayA [0 1 ] def
/RedA [0 1 ] def
/GreenA [1 1 ] def
/BlueA [1 1 ] def
/maxcolorsLast {maxcolors 1 sub maxcolors div} def
/pm3dround {maxcolors 0 gt {dup maxcolorsLast ge {pop 1}
{maxcolors mul floor maxcolors div} ifelse} if} def
/pm3dGamma 1.0 1.5 div def
/ColorSpace (HSV) def
Color true and { % COLOUR vs. GRAY map
  InterpolatedColor { %% Interpolation vs. RGB-Formula
    /g {stroke pm3dround /grayv exch def interpolate
        SelectSpace setrgbcolor} bind def
  }{
  /g {stroke pm3dround dup cF7 Constrain exch dup cF5 Constrain exch cF15 Constrain 
       SelectSpace setrgbcolor} bind def
  } ifelse
}{
  /g {stroke pm3dround pm3dGamma exp setgray} bind def
} ifelse
/h {rlineto rlineto rlineto fill} bind def
stroke gsave	%% draw gray scale smooth box
maxcolors 0 gt {/imax maxcolors def} {/imax 1024 def} ifelse
7920 3010 translate 333 2264 scale 0 setlinewidth
/ystep 1 imax div def /y0 0 def /ii 0 def
{ y0 g 0 y0 N 1 0 V 0 ystep V -1 0 f
/y0 y0 ystep add def /ii ii 1 add def
ii imax ge {exit} if } loop
grestore 0 setgray
1.000 UL
LTb
7920 3010 M
333 0 V
0 2264 V
-333 0 V
0 -2264 V
1.000 UL
LTb
1.000 UL
LTb
8253 3010 M
-63 0 V
stroke
8361 3010 M
[ [(Helvetica) 180.0 0.0 true true 0 (-4)]
] -60.0 MLshow
1.000 UL
LTb
7920 3010 M
63 0 V
270 251 R
-63 0 V
stroke
8361 3261 M
[ [(Helvetica) 180.0 0.0 true true 0 (-3.5)]
] -60.0 MLshow
1.000 UL
LTb
7920 3261 M
63 0 V
270 252 R
-63 0 V
stroke
8361 3513 M
[ [(Helvetica) 180.0 0.0 true true 0 (-3)]
] -60.0 MLshow
1.000 UL
LTb
7920 3513 M
63 0 V
270 251 R
-63 0 V
stroke
8361 3764 M
[ [(Helvetica) 180.0 0.0 true true 0 (-2.5)]
] -60.0 MLshow
1.000 UL
LTb
7920 3764 M
63 0 V
270 252 R
-63 0 V
stroke
8361 4016 M
[ [(Helvetica) 180.0 0.0 true true 0 (-2)]
] -60.0 MLshow
1.000 UL
LTb
7920 4016 M
63 0 V
270 251 R
-63 0 V
stroke
8361 4267 M
[ [(Helvetica) 180.0 0.0 true true 0 (-1.5)]
] -60.0 MLshow
1.000 UL
LTb
7920 4267 M
63 0 V
270 252 R
-63 0 V
stroke
8361 4519 M
[ [(Helvetica) 180.0 0.0 true true 0 (-1)]
] -60.0 MLshow
1.000 UL
LTb
7920 4519 M
63 0 V
270 251 R
-63 0 V
stroke
8361 4770 M
[ [(Helvetica) 180.0 0.0 true true 0 (-0.5)]
] -60.0 MLshow
1.000 UL
LTb
7920 4770 M
63 0 V
270 252 R
-63 0 V
stroke
8361 5022 M
[ [(Helvetica) 180.0 0.0 true true 0 ( 0)]
] -60.0 MLshow
1.000 UL
LTb
7920 5022 M
63 0 V
270 252 R
-63 0 V
stroke
8361 5274 M
[ [(Helvetica) 180.0 0.0 true true 0 ( 0.5)]
] -60.0 MLshow
1.000 UL
LTb
7920 5274 M
63 0 V
1.000 UL
LTb
1206 1657 M
2412 941 V
1.000 UL
LTb
7794 2054 M
3618 2598 L
1.000 UL
LTb
1206 1657 M
0 3343 V
1.000 UL
LTb
3618 2598 M
0 3095 V
1.000 UL
LTb
7794 2054 M
0 3096 V
1.000 UL
LTb
1206 1657 M
43 17 V
1.000 UL
LTb
1132 1609 M
[ [(Helvetica) 180.0 0.0 true true 0 ( 0)]
] -60.0 MCshow
1.000 UL
LTb
1.000 UL
LTb
3618 2598 M
-44 -17 V
1.000 UL
LTb
1623 1602 M
44 17 V
1.000 UL
LTb
1549 1554 M
[ [(Helvetica) 180.0 0.0 true true 0 ( 0.2)]
] -60.0 MCshow
1.000 UL
LTb
1.000 UL
LTb
4035 2543 M
-43 -17 V
1.000 UL
LTb
2041 1548 M
43 17 V
1.000 UL
LTb
1967 1500 M
[ [(Helvetica) 180.0 0.0 true true 0 ( 0.4)]
] -60.0 MCshow
1.000 UL
LTb
1.000 UL
LTb
4453 2489 M
-43 -17 V
1.000 UL
LTb
2459 1494 M
43 17 V
1.000 UL
LTb
2385 1446 M
[ [(Helvetica) 180.0 0.0 true true 0 ( 0.6)]
] -60.0 MCshow
1.000 UL
LTb
1.000 UL
LTb
4870 2435 M
-43 -17 V
1.000 UL
LTb
2877 1439 M
43 17 V
1.000 UL
LTb
2803 1391 M
[ [(Helvetica) 180.0 0.0 true true 0 ( 0.8)]
] -60.0 MCshow
1.000 UL
LTb
1.000 UL
LTb
5288 2380 M
-43 -17 V
1.000 UL
LTb
3295 1385 M
43 17 V
1.000 UL
LTb
3220 1337 M
[ [(Helvetica) 180.0 0.0 true true 0 ( 1)]
] -60.0 MCshow
1.000 UL
LTb
1.000 UL
LTb
5705 2326 M
-43 -17 V
1.000 UL
LTb
3712 1331 M
43 17 V
1.000 UL
LTb
3638 1283 M
[ [(Helvetica) 180.0 0.0 true true 0 ( 1.2)]
] -60.0 MCshow
1.000 UL
LTb
1.000 UL
LTb
6123 2272 M
-43 -17 V
1.000 UL
LTb
4130 1276 M
43 17 V
1.000 UL
LTb
4056 1228 M
[ [(Helvetica) 180.0 0.0 true true 0 ( 1.4)]
] -60.0 MCshow
1.000 UL
LTb
1.000 UL
LTb
6541 2217 M
-43 -16 V
1.000 UL
LTb
4547 1222 M
43 17 V
1.000 UL
LTb
4474 1174 M
[ [(Helvetica) 180.0 0.0 true true 0 ( 1.6)]
] -60.0 MCshow
1.000 UL
LTb
1.000 UL
LTb
6959 2163 M
-43 -17 V
1.000 UL
LTb
4965 1168 M
43 17 V
1.000 UL
LTb
4890 1120 M
[ [(Helvetica) 180.0 0.0 true true 0 ( 1.8)]
] -60.0 MCshow
1.000 UL
LTb
1.000 UL
LTb
7377 2109 M
-44 -17 V
1.000 UL
LTb
5382 1113 M
44 17 V
1.000 UL
LTb
5308 1065 M
[ [(Helvetica) 180.0 0.0 true true 0 ( 2)]
] -60.0 MCshow
1.000 UL
LTb
1.000 UL
LTb
7794 2054 M
-43 -16 V
1.000 UL
LTb
5382 1113 M
-54 8 V
stroke
5476 1093 M
[ [(Helvetica) 180.0 0.0 true true 0 ( 0)]
] -60.0 MCshow
1.000 UL
LTb
1.000 UL
LTb
1206 1657 M
54 -7 V
1.000 UL
LTb
5985 1349 M
-54 7 V
stroke
6079 1328 M
[ [(Helvetica) 180.0 0.0 true true 0 ( 0.5)]
] -60.0 MCshow
1.000 UL
LTb
1.000 UL
LTb
1809 1892 M
54 -7 V
1.000 UL
LTb
6588 1584 M
-54 7 V
stroke
6682 1564 M
[ [(Helvetica) 180.0 0.0 true true 0 ( 1)]
] -60.0 MCshow
1.000 UL
LTb
1.000 UL
LTb
2412 2127 M
54 -7 V
1.000 UL
LTb
7191 1819 M
-54 7 V
stroke
7285 1799 M
[ [(Helvetica) 180.0 0.0 true true 0 ( 1.5)]
] -60.0 MCshow
1.000 UL
LTb
1.000 UL
LTb
3015 2362 M
54 -7 V
1.000 UL
LTb
7794 2054 M
-54 7 V
stroke
7888 2034 M
[ [(Helvetica) 180.0 0.0 true true 0 ( 2)]
] -60.0 MCshow
1.000 UL
LTb
1.000 UL
LTb
3618 2598 M
54 -7 V
1.000 UL
LTb
1206 2771 M
63 0 V
stroke
1080 2771 M
[ [(Helvetica) 180.0 0.0 true true 0 (-4)]
] -60.0 MRshow
1.000 UL
LTb
1.000 UL
LTb
1206 3019 M
63 0 V
stroke
1080 3019 M
[ [(Helvetica) 180.0 0.0 true true 0 (-3.5)]
] -60.0 MRshow
1.000 UL
LTb
1.000 UL
LTb
1206 3267 M
63 0 V
stroke
1080 3267 M
[ [(Helvetica) 180.0 0.0 true true 0 (-3)]
] -60.0 MRshow
1.000 UL
LTb
1.000 UL
LTb
1206 3514 M
63 0 V
stroke
1080 3514 M
[ [(Helvetica) 180.0 0.0 true true 0 (-2.5)]
] -60.0 MRshow
1.000 UL
LTb
1.000 UL
LTb
1206 3761 M
63 0 V
stroke
1080 3761 M
[ [(Helvetica) 180.0 0.0 true true 0 (-2)]
] -60.0 MRshow
1.000 UL
LTb
1.000 UL
LTb
1206 4009 M
63 0 V
stroke
1080 4009 M
[ [(Helvetica) 180.0 0.0 true true 0 (-1.5)]
] -60.0 MRshow
1.000 UL
LTb
1.000 UL
LTb
1206 4257 M
63 0 V
stroke
1080 4257 M
[ [(Helvetica) 180.0 0.0 true true 0 (-1)]
] -60.0 MRshow
1.000 UL
LTb
1.000 UL
LTb
1206 4504 M
63 0 V
stroke
1080 4504 M
[ [(Helvetica) 180.0 0.0 true true 0 (-0.5)]
] -60.0 MRshow
1.000 UL
LTb
1.000 UL
LTb
1206 4752 M
63 0 V
stroke
1080 4752 M
[ [(Helvetica) 180.0 0.0 true true 0 ( 0)]
] -60.0 MRshow
1.000 UL
LTb
1.000 UL
LTb
1206 5000 M
63 0 V
stroke
1080 5000 M
[ [(Helvetica) 180.0 0.0 true true 0 ( 0.5)]
] -60.0 MRshow
1.000 UL
LTb
LTb
1205 5836 M
[ [(Helvetica) 180.0 0.0 true true 0 (Erreur)]
] -60.0 MCshow
LTb
4500 6172 M
[ [(Times-Roman) 300.0 0.0 true true 0 (Erreur relative \(%\))]
] -100.0 MCshow
1.000 UP
%pm3d_map_begin
.6379 g 3490 4981 N -220 646 127 391 220 -325 h
.6692 g 3363 5566 N -220 325 127 -600 220 -310 h
.8425 g 3236 5604 N -220 310 127 -123 220 -225 h
.8656 g 3109 5505 N -220 225 127 54 220 -180 h
.8537 g 2982 5426 N -220 180 127 71 220 -172 h
.8473 g 2855 5387 N -220 172 127 67 220 -200 h
.8436 g 2728 5366 N -220 200 127 104 220 -283 h
.8173 g 2601 5323 N -220 283 127 265 220 -505 h
.711 g 2474 5141 N -220 505 127 656 220 -979 h
.6192 g 2347 5076 N -220 979 127 113 220 -1027 h
.6981 g 2220 5178 N -220 1027 127 -581 220 -548 h
.8113 g 2093 5120 N -220 548 127 -186 220 -304 h
.8399 g 1966 5039 N -220 304 127 -10 220 -213 h
.8436 g 1839 4978 N -220 213 127 33 220 -185 h
.85 g 1712 4961 N -220 185 127 30 220 -198 h
.8625 g 1585 4973 N -220 198 127 52 220 -262 h
.8279 g 1459 4810 N -220 262 127 304 219 -403 h
.4338 g 1332 2993 N -219 403 127 1428 219 -14 h
.2821 g 1205 4752 N -219 14 126 64 220 -1837 h
.6758 g 3710 4656 N -219 -563 127 322 219 632 h
.7096 g 3583 5256 N -219 -632 126 -216 220 248 h
.8385 g 3456 5379 N -220 -248 127 -11 220 136 h
.8606 g 3329 5325 N -220 -136 127 80 220 110 h
.8518 g 3202 5254 N -220 -110 127 70 220 111 h
.8459 g 3075 5187 N -220 -111 127 44 220 134 h
.8402 g 2948 5083 N -220 -134 127 35 220 203 h
.8106 g 2821 4818 N -220 -203 127 58 220 410 h
.7129 g 2694 4162 N -220 -410 127 90 220 976 h
.6331 g 2567 4049 N -220 -976 127 50 220 1039 h
.7012 g 2440 4630 N -220 -1039 127 9 220 449 h
.8039 g 2313 4816 N -220 -449 127 41 220 222 h
.8362 g 2186 4826 N -220 -222 127 64 220 148 h
.8422 g 2059 4793 N -220 -148 127 57 220 124 h
.848 g 1932 4763 N -220 -124 127 27 220 127 h
.8564 g 1805 4711 N -220 -127 127 14 220 165 h
.8235 g 1678 4407 N -220 -165 127 122 220 347 h
.5902 g 1551 2979 N -220 -347 127 425 220 1350 h
.4338 g 1425 2915 N -220 -1350 127 -325 219 1739 h
.8442 g 3929 5288 N -220 -53 127 235 220 140 h
.8404 g 3803 5504 N -220 -140 127 -108 219 32 h
.8985 g 3676 5515 N -219 -32 127 16 219 5 h
.9024 g 3549 5435 N -219 -5 127 79 219 6 h
.8913 g 3422 5365 N -219 -6 126 67 220 9 h
.8887 g 3295 5321 N -220 -9 127 40 220 13 h
.8945 g 3168 5286 N -220 -13 127 28 220 20 h
.8989 g 3041 5228 N -220 -20 127 38 220 40 h
.8944 g 2914 5138 N -220 -40 127 53 220 77 h
.8894 g 2787 5088 N -220 -77 127 48 220 79 h
.8945 g 2660 5079 N -220 -79 127 45 220 43 h
.8992 g 2533 5038 N -220 -43 127 62 220 22 h
.8947 g 2406 4974 N -220 -22 127 71 220 15 h
.8886 g 2279 4917 N -220 -15 127 59 220 13 h
.8914 g 2152 4890 N -220 -13 127 31 220 9 h
.9038 g 2025 4876 N -220 -9 127 16 220 7 h
.8994 g 1898 4754 N -220 -7 127 85 220 44 h
.8235 g 1771 4329 N -220 -44 127 243 220 226 h
.8279 g 1644 4654 N -220 -226 127 -184 220 85 h
.8667 g 4149 5428 N -220 75 127 192 220 -32 h
.8623 g 4022 5536 N -220 32 127 -81 220 -59 h
.9023 g 3895 5520 N -220 59 127 15 220 -58 h
.9041 g 3768 5441 N -220 58 127 72 220 -51 h
.8948 g 3642 5374 N -220 51 127 64 219 -48 h
.8929 g 3515 5334 N -219 48 127 43 219 -51 h
.8984 g 3388 5306 N -219 51 126 37 220 -60 h
.9036 g 3261 5268 N -220 60 127 49 220 -71 h
.9033 g 3134 5215 N -220 71 127 62 220 -80 h
.9017 g 3007 5167 N -220 80 127 49 220 -81 h
.9036 g 2880 5122 N -220 81 127 37 220 -73 h
.9041 g 2753 5060 N -220 73 127 50 220 -61 h
.8988 g 2626 4989 N -220 61 127 63 220 -53 h
.8931 g 2499 4930 N -220 53 127 56 220 -50 h
.8952 g 2372 4899 N -220 50 127 34 220 -53 h
.9056 g 2245 4883 N -220 53 127 25 220 -62 h
.9038 g 2118 4798 N -220 62 127 87 220 -64 h
.8564 g 1991 4555 N -220 64 127 205 220 -26 h
.8625 g 1864 4739 N -220 26 127 -120 220 -90 h
.8561 g 4369 5396 N -220 56 127 183 220 -47 h
.8542 g 4242 5477 N -220 47 127 -79 220 -49 h
.8913 g 4115 5462 N -220 49 127 12 220 -46 h
.8947 g 3988 5390 N -220 46 127 69 220 -43 h
.8869 g 3861 5326 N -220 43 127 63 220 -42 h
.8848 g 3734 5283 N -220 42 127 46 220 -45 h
.8883 g 3608 5246 N -220 45 127 40 219 -48 h
.8902 g 3481 5197 N -219 48 127 55 219 -54 h
.8866 g 3354 5135 N -219 54 126 66 220 -58 h
.8834 g 3227 5086 N -220 58 127 50 220 -59 h
.8866 g 3100 5049 N -220 59 127 33 220 -55 h
.8903 g 2973 4999 N -220 55 127 44 220 -49 h
.8883 g 2846 4936 N -220 49 127 59 220 -45 h
.8846 g 2719 4880 N -220 45 127 54 220 -43 h
.8867 g 2592 4846 N -220 43 127 35 220 -44 h
.8952 g 2465 4821 N -220 44 127 29 220 -48 h
.8914 g 2338 4734 N -220 48 127 90 220 -51 h
.848 g 2211 4529 N -220 51 127 203 220 -49 h
.85 g 2084 4649 N -220 49 127 -108 220 -61 h
.851 g 4589 5349 N -220 19 127 203 220 -39 h
.8495 g 4462 5428 N -220 39 127 -96 220 -22 h
.8888 g 4335 5416 N -220 22 127 10 220 -20 h
.8927 g 4208 5347 N -220 20 127 72 220 -23 h
.8848 g 4081 5284 N -220 23 127 64 220 -24 h
.8826 g 3954 5238 N -220 24 127 45 220 -23 h
.8859 g 3827 5198 N -220 23 127 38 220 -21 h
.8872 g 3700 5143 N -220 21 127 53 220 -19 h
.8826 g 3574 5077 N -220 19 127 66 219 -19 h
.8788 g 3447 5027 N -219 19 127 50 219 -19 h
.8825 g 3320 4994 N -219 19 126 32 220 -18 h
.8872 g 3193 4950 N -220 18 127 47 220 -21 h
.8858 g 3066 4891 N -220 21 127 61 220 -23 h
.8823 g 2939 4837 N -220 23 127 55 220 -24 h
.8846 g 2812 4802 N -220 24 127 33 220 -22 h
.8931 g 2685 4773 N -220 22 127 26 220 -19 h
.8886 g 2558 4683 N -220 19 127 93 220 -22 h
.8422 g 2431 4480 N -220 22 127 226 220 -45 h
.8436 g 2304 4588 N -220 45 127 -136 220 -17 h
.8495 g 4809 5310 N -220 5 127 262 220 -64 h
.8465 g 4682 5406 N -220 64 127 -145 220 -15 h
.8942 g 4555 5396 N -220 15 127 4 220 -9 h
.8978 g 4428 5324 N -220 9 127 79 220 -16 h
.8883 g 4301 5260 N -220 16 127 68 220 -20 h
.886 g 4174 5215 N -220 20 127 42 220 -17 h
.8906 g 4047 5177 N -220 17 127 32 220 -11 h
.8937 g 3920 5124 N -220 11 127 47 220 -5 h
.89 g 3793 5058 N -220 5 127 66 220 -5 h
.8862 g 3666 5008 N -220 5 127 50 220 -5 h
.8901 g 3540 4976 N -220 5 127 32 219 -5 h
.894 g 3413 4929 N -219 5 127 52 219 -10 h
.8907 g 3286 4868 N -219 10 127 68 219 -17 h
.8858 g 3159 4813 N -219 17 126 57 220 -19 h
.8883 g 3032 4780 N -220 19 127 30 220 -16 h
.8988 g 2905 4754 N -220 16 127 16 220 -6 h
.8947 g 2778 4661 N -220 6 127 100 220 -13 h
.8362 g 2651 4435 N -220 13 127 301 220 -88 h
.8399 g 2524 4571 N -220 88 127 -226 220 2 h
.834 g 5029 5246 N -220 27 127 391 220 -156 h
.8291 g 4902 5391 N -220 156 127 -266 220 -35 h
.8981 g 4775 5387 N -220 35 127 -11 220 -20 h
.9024 g 4648 5308 N -220 20 127 88 220 -29 h
.8901 g 4521 5240 N -220 29 127 73 220 -34 h
.8873 g 4394 5198 N -220 34 127 40 220 -32 h
.8937 g 4267 5166 N -220 32 127 27 220 -27 h
.8991 g 4140 5119 N -220 27 127 44 220 -24 h
.8949 g 4013 5053 N -220 24 127 79 220 -37 h
.8896 g 3886 5003 N -220 37 127 50 220 -37 h
.8952 g 3759 4971 N -220 37 127 17 220 -22 h
.8997 g 3632 4919 N -220 22 127 56 220 -26 h
.894 g 3505 4851 N -220 26 127 74 220 -32 h
.8872 g 3379 4794 N -220 32 127 59 219 -34 h
.8903 g 3252 4764 N -219 34 127 24 219 -28 h
.9041 g 3125 4748 N -219 28 126 5 220 -17 h
.8992 g 2998 4648 N -220 17 127 120 220 -37 h
.8038 g 2871 4347 N -220 37 127 528 220 -264 h
.8112 g 2744 4573 N -220 264 127 -470 220 -20 h
.7892 g 5249 5090 N -220 77 127 568 220 -254 h
.7855 g 5122 5356 N -220 254 127 -462 220 -58 h
.8945 g 4995 5367 N -220 58 127 -35 220 -34 h
.9016 g 4868 5279 N -220 34 127 93 220 -39 h
.8867 g 4741 5206 N -220 39 127 77 220 -43 h
.883 g 4614 5166 N -220 43 127 41 220 -44 h
.89 g 4487 5139 N -220 44 127 28 220 -45 h
.8948 g 4360 5095 N -220 45 127 57 220 -58 h
.8788 g 4233 5016 N -220 58 127 160 220 -139 h
.8621 g 4106 4966 N -220 139 127 58 220 -147 h
.878 g 3979 4949 N -220 147 127 -69 220 -61 h
.8952 g 3852 4893 N -220 61 127 41 220 -46 h
.8901 g 3725 4819 N -220 46 127 73 220 -45 h
.8825 g 3598 4760 N -220 45 127 59 220 -45 h
.8866 g 3471 4736 N -220 45 127 20 220 -41 h
.9036 g 3345 4731 N -220 41 127 -3 219 -33 h
.8945 g 3218 4611 N -219 33 127 157 219 -70 h
.7012 g 3091 4083 N -219 70 126 1117 220 -659 h
.6981 g 2964 4553 N -220 659 127 -949 220 -180 h
.7604 g 5469 4836 N -219 28 127 552 219 -12 h
.7588 g 5342 5298 N -219 12 126 -446 220 -28 h
.8906 g 5215 5333 N -220 28 127 -34 220 -29 h
.8997 g 5088 5240 N -220 29 127 93 220 -29 h
.8839 g 4961 5163 N -220 29 127 76 220 -28 h
.8797 g 4834 5122 N -220 28 127 41 220 -28 h
.8864 g 4707 5094 N -220 28 127 29 220 -29 h
.8896 g 4580 5037 N -220 29 127 56 220 -28 h
.8639 g 4453 4877 N -220 28 127 153 220 -21 h
.8381 g 4326 4819 N -220 21 127 57 220 -20 h
.8621 g 4199 4888 N -220 20 127 -61 220 -28 h
.8896 g 4072 4847 N -220 28 127 42 220 -29 h
.8862 g 3945 4774 N -220 29 127 73 220 -29 h
.8788 g 3818 4715 N -220 29 127 58 220 -28 h
.8834 g 3691 4695 N -220 28 127 20 220 -28 h
.9017 g 3564 4698 N -220 28 127 -2 220 -29 h
.8894 g 3437 4541 N -220 29 127 155 220 -27 h
.6331 g 3311 3424 N -220 27 127 1055 219 35 h
.6192 g 3184 4373 N -219 -35 127 -901 219 -13 h
.7931 g 5688 4824 N -220 -18 127 371 220 199 h
.7895 g 5562 5270 N -220 -199 127 -247 219 0 h
.8943 g 5435 5304 N -219 0 127 -10 219 -24 h
.9013 g 5308 5211 N -219 24 126 87 220 -18 h
.8868 g 5181 5135 N -220 18 127 72 220 -14 h
.8831 g 5054 5094 N -220 14 127 41 220 -14 h
.8899 g 4927 5065 N -220 14 127 27 220 -12 h
.8945 g 4800 5009 N -220 12 127 45 220 -1 h
.8795 g 4673 4856 N -220 1 127 78 220 74 h
.8639 g 4546 4799 N -220 -74 127 49 220 82 h
.8788 g 4419 4860 N -220 -82 127 20 220 1 h
.8949 g 4292 4818 N -220 -1 127 54 220 -11 h
.89 g 4165 4745 N -220 11 127 73 220 -11 h
.8826 g 4038 4687 N -220 11 127 60 220 -13 h
.8866 g 3911 4667 N -220 13 127 24 220 -17 h
.9033 g 3784 4669 N -220 17 127 7 220 -26 h
.8944 g 3657 4514 N -220 26 127 118 220 11 h
.7129 g 3530 3459 N -220 -11 127 488 220 578 h
.711 g 3403 4360 N -220 -578 127 -427 220 104 h
.8372 g 5908 5023 N -220 30 127 249 220 92 h
.8326 g 5781 5270 N -220 -92 127 -133 220 -22 h
.8978 g 5654 5280 N -220 22 127 6 220 -38 h
.9019 g 5528 5193 N -220 38 127 78 219 -29 h
.8901 g 5401 5121 N -219 29 127 67 219 -24 h
.8873 g 5274 5080 N -219 24 126 42 220 -25 h
.8935 g 5147 5053 N -220 25 127 33 220 -31 h
.8986 g 5020 5008 N -220 31 127 47 220 -33 h
.8945 g 4893 4930 N -220 33 127 66 220 -21 h
.8896 g 4766 4881 N -220 21 127 49 220 -21 h
.8948 g 4639 4861 N -220 21 127 33 220 -34 h
.8991 g 4512 4807 N -220 34 127 52 220 -32 h
.8937 g 4385 4734 N -220 32 127 67 220 -26 h
.8872 g 4258 4674 N -220 26 127 57 220 -23 h
.8902 g 4131 4650 N -220 23 127 30 220 -29 h
.9036 g 4004 4643 N -220 29 127 18 220 -40 h
.8989 g 3877 4525 N -220 40 127 98 220 -20 h
.8106 g 3750 4037 N -220 20 127 281 220 187 h
.8173 g 3623 4464 N -220 -187 127 -204 220 -36 h
.852 g 6128 5115 N -220 50 127 193 220 6 h
.8492 g 6001 5248 N -220 -6 127 -86 220 -41 h
.894 g 5874 5242 N -220 41 127 12 220 -47 h
.8975 g 5747 5164 N -220 47 127 71 220 -40 h
.8883 g 5620 5097 N -220 40 127 64 220 -37 h
.8861 g 5494 5055 N -220 37 127 44 219 -39 h
.8905 g 5367 5022 N -219 39 127 39 219 -45 h
.8935 g 5240 4975 N -219 45 127 53 219 -51 h
.8899 g 5113 4909 N -219 51 126 65 220 -50 h
.8864 g 4986 4860 N -220 50 127 50 220 -51 h
.89 g 4859 4827 N -220 51 127 33 220 -51 h
.8937 g 4732 4775 N -220 51 127 47 220 -46 h
.8906 g 4605 4708 N -220 46 127 60 220 -39 h
.8859 g 4478 4651 N -220 39 127 55 220 -37 h
.8883 g 4351 4621 N -220 37 127 34 220 -41 h
.8984 g 4224 4603 N -220 41 127 27 220 -50 h
.8945 g 4097 4505 N -220 50 127 91 220 -43 h
.8402 g 3970 4224 N -220 43 127 212 220 26 h
.8436 g 3843 4428 N -220 -26 127 -121 220 -57 h
.8537 g 6348 5121 N -220 38 127 173 220 -18 h
.8523 g 6221 5207 N -220 18 127 -70 220 -34 h
.8889 g 6094 5195 N -220 34 127 15 220 -37 h
.8925 g 5967 5124 N -220 37 127 68 220 -34 h
.885 g 5840 5060 N -220 34 127 63 220 -33 h
.8829 g 5713 5016 N -220 33 127 45 220 -34 h
.8861 g 5586 4977 N -220 34 127 41 220 -36 h
.8873 g 5459 4924 N -220 36 127 54 220 -37 h
.8831 g 5333 4859 N -220 37 127 65 219 -37 h
.8797 g 5206 4809 N -219 37 127 50 219 -37 h
.883 g 5079 4776 N -219 37 126 34 220 -38 h
.8873 g 4952 4729 N -220 38 127 45 220 -36 h
.886 g 4825 4669 N -220 36 127 58 220 -34 h
.8826 g 4698 4614 N -220 34 127 54 220 -33 h
.8848 g 4571 4580 N -220 33 127 36 220 -35 h
.8929 g 4444 4553 N -220 35 127 30 220 -38 h
.8887 g 4317 4462 N -220 38 127 88 220 -35 h
.8459 g 4190 4250 N -220 35 127 189 220 -12 h
.8473 g 4063 4371 N -220 12 127 -94 220 -39 h
.8588 g 6568 5103 N -220 4 127 178 220 -9 h
.8571 g 6441 5173 N -220 9 127 -69 220 -10 h
.8911 g 6314 5158 N -220 10 127 18 220 -13 h
.8943 g 6187 5090 N -220 13 127 70 220 -15 h
.8869 g 6060 5027 N -220 15 127 63 220 -15 h
.885 g 5933 4982 N -220 15 127 44 220 -14 h
.8883 g 5806 4941 N -220 14 127 38 220 -11 h
.8901 g 5679 4887 N -220 11 127 49 220 -6 h
.8868 g 5552 4822 N -220 6 127 60 220 -1 h
.8839 g 5425 4772 N -220 1 127 50 220 -1 h
.8867 g 5299 4738 N -220 1 127 38 219 -5 h
.8901 g 5172 4693 N -219 5 127 50 219 -10 h
.8883 g 5045 4635 N -219 10 126 62 220 -14 h
.8848 g 4918 4581 N -220 14 127 55 220 -15 h
.8869 g 4791 4545 N -220 15 127 35 220 -14 h
.8948 g 4664 4515 N -220 14 127 27 220 -11 h
.8913 g 4537 4427 N -220 11 127 84 220 -7 h
.8518 g 4410 4238 N -220 7 127 189 220 -7 h
.8537 g 4283 4332 N -220 7 127 -102 220 1 h
.869 g 6788 5094 N -220 -11 127 210 220 -21 h
.8653 g 6661 5163 N -220 21 127 -88 220 -2 h
.901 g 6534 5145 N -220 2 127 18 220 -2 h
.9029 g 6407 5075 N -220 2 127 76 220 -8 h
.8943 g 6280 5012 N -220 8 127 66 220 -11 h
.8925 g 6153 4968 N -220 11 127 41 220 -8 h
.8975 g 6026 4930 N -220 8 127 31 220 -1 h
.9019 g 5899 4881 N -220 1 127 40 220 8 h
.9013 g 5772 4821 N -220 -8 127 54 220 14 h
.8997 g 5645 4771 N -220 -14 127 49 220 15 h
.9016 g 5518 4733 N -220 -15 127 44 220 9 h
.9024 g 5391 4683 N -220 -9 127 59 220 0 h
.8978 g 5265 4621 N -220 0 127 68 219 -6 h
.8927 g 5138 4566 N -219 6 127 59 219 -10 h
.8947 g 5011 4531 N -219 10 126 32 220 -7 h
.9041 g 4884 4504 N -220 7 127 19 220 1 h
.9024 g 4757 4420 N -220 -1 127 83 220 2 h
.8606 g 4630 4231 N -220 -2 127 214 220 -23 h
.8656 g 4503 4333 N -220 23 127 -146 220 21 h
.8526 g 7008 5073 N -220 96 127 268 220 -154 h
.8493 g 6881 5161 N -220 154 127 -162 220 -80 h
.8977 g 6754 5143 N -220 80 127 -2 220 -60 h
.9011 g 6627 5067 N -220 60 127 77 220 -61 h
.8911 g 6500 5001 N -220 61 127 68 220 -63 h
.8889 g 6373 4960 N -220 63 127 43 220 -65 h
.894 g 6246 4929 N -220 65 127 37 220 -71 h
.8978 g 6119 4889 N -220 71 127 56 220 -87 h
.8943 g 5992 4835 N -220 87 127 79 220 -112 h
.8906 g 5865 4786 N -220 112 127 50 220 -113 h
.8945 g 5738 4742 N -220 113 127 20 220 -89 h
.8981 g 5611 4683 N -220 89 127 43 220 -73 h
.8942 g 5484 4615 N -220 73 127 63 220 -68 h
.8888 g 5357 4556 N -220 68 127 56 220 -65 h
.8913 g 5231 4524 N -220 65 127 30 219 -63 h
.9023 g 5104 4505 N -219 63 127 19 219 -63 h
.8985 g 4977 4422 N -219 63 127 109 219 -89 h
.8385 g 4850 4208 N -219 89 126 327 220 -202 h
.8425 g 4723 4354 N -220 202 127 -232 220 -116 h
.7443 g 7228 4919 N -219 392 126 314 220 -438 h
.7598 g 7101 5081 N -220 438 127 -360 220 -240 h
.8493 g 6974 5083 N -220 240 127 -76 220 -166 h
.8653 g 6847 5006 N -220 166 127 58 220 -147 h
.8571 g 6720 4938 N -220 147 127 68 220 -147 h
.8523 g 6593 4895 N -220 147 127 61 220 -165 h
.8492 g 6466 4858 N -220 165 127 84 220 -212 h
.8326 g 6339 4802 N -220 212 127 170 220 -326 h
.7895 g 6212 4723 N -220 326 127 277 220 -524 h
.7588 g 6085 4673 N -220 524 127 66 220 -540 h
.7855 g 5958 4653 N -220 540 127 -176 220 -344 h
.8291 g 5831 4610 N -220 344 127 -77 220 -224 h
.8466 g 5704 4547 N -220 224 127 13 220 -174 h
.8495 g 5577 4491 N -220 174 127 39 220 -157 h
.8542 g 5450 4461 N -220 157 127 32 220 -159 h
.8623 g 5323 4442 N -220 159 127 46 220 -186 h
.8404 g 5196 4333 N -220 186 127 218 220 -295 h
.7096 g 5070 4006 N -220 295 127 710 219 -678 h
.6692 g 4943 4238 N -219 678 127 -247 219 -663 h
.7303 g 7448 4481 N -220 -355 127 433 219 236 h
.7443 g 7321 4841 N -219 -236 127 -313 219 189 h
.8526 g 7194 4917 N -219 -189 126 -19 220 132 h
.869 g 7067 4859 N -220 -132 127 89 220 101 h
.8588 g 6940 4791 N -220 -101 127 74 220 95 h
.8537 g 6813 4730 N -220 -95 127 41 220 115 h
.852 g 6686 4646 N -220 -115 127 28 220 171 h
.8372 g 6559 4476 N -220 -171 127 48 220 293 h
.7931 g 6432 4199 N -220 -293 127 96 220 474 h
.7604 g 6305 4133 N -220 -474 127 50 220 490 h
.7892 g 6178 4309 N -220 -490 127 1 220 313 h
.834 g 6051 4386 N -220 -313 127 51 220 185 h
.8495 g 5924 4373 N -220 -185 127 73 220 125 h
.851 g 5797 4334 N -220 -125 127 59 220 105 h
.8561 g 5670 4302 N -220 -105 127 23 220 114 h
.8667 g 5543 4256 N -220 -114 127 3 220 157 h
.8442 g 5416 4038 N -220 -157 127 131 220 244 h
.6758 g 5289 3328 N -220 -244 127 641 220 313 h
.6379 g 5162 3575 N -220 -313 127 -568 220 634 h
%pm3d_map_end
1.000 UL
LT0
.7403 g 3617 5693 M
3490 4981 L
.734 g 3490 4981 M
-127 585 V
.896 g 3363 5566 M
-127 38 V
.9046 g 3236 5604 M
-127 -99 V
.8868 g 3109 5505 M
-127 -79 V
.8825 g 2982 5426 M
-127 -39 V
.8912 g 2855 5387 M
-127 -21 V
.8992 g 2728 5366 M
-127 -43 V
.871 g 2601 5323 M
2474 5141 L
.8377 g 2474 5141 M
-127 -65 V
.8682 g 2347 5076 M
-127 102 V
.9004 g 2220 5178 M
-127 -58 V
.8915 g 2093 5120 M
-127 -81 V
.8819 g 1966 5039 M
-127 -61 V
.8867 g 1839 4978 M
-127 -17 V
.9077 g 1712 4961 M
-127 12 V
.8961 g 1585 4973 M
1459 4810 L
.4742 g 1459 4810 M
1332 2993 L
.4833 g 1332 2993 M
1205 4752 L
.5355 g 3837 5047 M
3710 4656 L
.6045 g 3710 4656 M
-127 600 V
.789 g 3583 5256 M
-127 123 V
.8266 g 3456 5379 M
-127 -54 V
.8206 g 3329 5325 M
-127 -71 V
.812 g 3202 5254 M
-127 -67 V
.7959 g 3075 5187 M
2948 5083 L
.7354 g 2948 5083 M
2821 4818 L
.551 g 2821 4818 M
2694 4162 L
.4007 g 2694 4162 M
2567 4049 L
.5279 g 2567 4049 M
-127 581 V
.7221 g 2440 4630 M
-127 186 V
.7883 g 2313 4816 M
-127 10 V
.8053 g 2186 4826 M
-127 -33 V
.8134 g 2059 4793 M
-127 -30 V
.8172 g 1932 4763 M
-127 -52 V
.7597 g 1805 4711 M
1678 4407 L
.3934 g 1678 4407 M
1551 2979 L
.0809 g 1551 2979 M
-126 -64 V
.8161 g 4056 5610 M
3929 5288 L
.8147 g 3929 5288 M
-126 216 V
.888 g 3803 5504 M
-127 11 V
.8947 g 3676 5515 M
-127 -80 V
.8831 g 3549 5435 M
-127 -70 V
.8798 g 3422 5365 M
-127 -44 V
.8844 g 3295 5321 M
-127 -35 V
.8858 g 3168 5286 M
-127 -58 V
.8748 g 3041 5228 M
-127 -90 V
.8655 g 2914 5138 M
-127 -50 V
.8744 g 2787 5088 M
-127 -9 V
.8856 g 2660 5079 M
-127 -41 V
.8841 g 2533 5038 M
-127 -64 V
.8791 g 2406 4974 M
-127 -57 V
.8826 g 2279 4917 M
-127 -27 V
stroke
.8955 g 2152 4890 M
-127 -14 V
.8873 g 2025 4876 M
1898 4754 L
.787 g 1898 4754 M
1771 4329 L
.7867 g 1771 4329 M
-127 325 V
.8723 g 4276 5663 M
4149 5428 L
.8661 g 4149 5428 M
-127 108 V
.909 g 4022 5536 M
-127 -16 V
.91 g 3895 5520 M
-127 -79 V
.8995 g 3768 5441 M
-126 -67 V
.8976 g 3642 5374 M
-127 -40 V
.9045 g 3515 5334 M
-127 -28 V
.912 g 3388 5306 M
-127 -38 V
.9139 g 3261 5268 M
-127 -53 V
.9133 g 3134 5215 M
-127 -48 V
.9145 g 3007 5167 M
-127 -45 V
.9129 g 2880 5122 M
-127 -62 V
.9053 g 2753 5060 M
-127 -71 V
.8981 g 2626 4989 M
-127 -59 V
.9003 g 2499 4930 M
-127 -31 V
.9121 g 2372 4899 M
-127 -16 V
.9115 g 2245 4883 M
-127 -85 V
.86 g 2118 4798 M
1991 4555 L
.869 g 1991 4555 M
-127 184 V
.8611 g 4496 5588 M
4369 5396 L
.8584 g 4369 5396 M
-127 81 V
.8955 g 4242 5477 M
-127 -15 V
.8983 g 4115 5462 M
-127 -72 V
.8901 g 3988 5390 M
-127 -64 V
.8881 g 3861 5326 M
-127 -43 V
.8923 g 3734 5283 M
-126 -37 V
.8952 g 3608 5246 M
-127 -49 V
.8927 g 3481 5197 M
-127 -62 V
.8901 g 3354 5135 M
-127 -49 V
.8928 g 3227 5086 M
-127 -37 V
.8954 g 3100 5049 M
-127 -50 V
.8924 g 2973 4999 M
-127 -63 V
.888 g 2846 4936 M
-127 -56 V
.8901 g 2719 4880 M
-127 -34 V
.8991 g 2592 4846 M
-127 -25 V
.8961 g 2465 4821 M
-127 -87 V
.8527 g 2338 4734 M
2211 4529 L
.8559 g 2211 4529 M
-127 120 V
.8511 g 4716 5532 M
4589 5349 L
.85 g 4589 5349 M
-127 79 V
.8871 g 4462 5428 M
-127 -12 V
.8911 g 4335 5416 M
-127 -69 V
.8837 g 4208 5347 M
-127 -63 V
.8815 g 4081 5284 M
-127 -46 V
.8844 g 3954 5238 M
-127 -40 V
.8852 g 3827 5198 M
-127 -55 V
.8805 g 3700 5143 M
-126 -66 V
.8767 g 3574 5077 M
-127 -50 V
.8803 g 3447 5027 M
-127 -33 V
stroke
.8851 g 3320 4994 M
-127 -44 V
.8842 g 3193 4950 M
-127 -59 V
.8811 g 3066 4891 M
-127 -54 V
.8833 g 2939 4837 M
-127 -35 V
.8913 g 2812 4802 M
-127 -29 V
.8868 g 2685 4773 M
-127 -90 V
.8432 g 2558 4683 M
2431 4480 L
.8441 g 2431 4480 M
-127 108 V
.8509 g 4936 5513 M
4809 5310 L
.8491 g 4809 5310 M
-127 96 V
.8905 g 4682 5406 M
-127 -10 V
.8943 g 4555 5396 M
-127 -72 V
.886 g 4428 5324 M
-127 -64 V
.8838 g 4301 5260 M
-127 -45 V
.8874 g 4174 5215 M
-127 -38 V
.8892 g 4047 5177 M
-127 -53 V
.8847 g 3920 5124 M
-127 -66 V
.8809 g 3793 5058 M
-127 -50 V
.8847 g 3666 5008 M
-126 -32 V
.8892 g 3540 4976 M
-127 -47 V
.8873 g 3413 4929 M
-127 -61 V
.8835 g 3286 4868 M
-127 -55 V
.8858 g 3159 4813 M
-127 -33 V
.8949 g 3032 4780 M
-127 -26 V
.8905 g 2905 4754 M
-127 -93 V
.8412 g 2778 4661 M
2651 4435 L
.843 g 2651 4435 M
-127 136 V
.8481 g 5156 5508 M
5029 5246 L
.844 g 5029 5246 M
-127 145 V
.8978 g 4902 5391 M
-127 -4 V
.9013 g 4775 5387 M
-127 -79 V
.8906 g 4648 5308 M
-127 -68 V
.8881 g 4521 5240 M
-127 -42 V
.8938 g 4394 5198 M
-127 -32 V
.8983 g 4267 5166 M
-127 -47 V
.8952 g 4140 5119 M
-127 -66 V
.8915 g 4013 5053 M
-127 -50 V
.8954 g 3886 5003 M
-127 -32 V
.8987 g 3759 4971 M
-127 -52 V
.894 g 3632 4919 M
-127 -68 V
.8881 g 3505 4851 M
-126 -57 V
.8908 g 3379 4794 M
-127 -30 V
.9027 g 3252 4764 M
-127 -16 V
.8988 g 3125 4748 M
2998 4648 L
.8312 g 2998 4648 M
2871 4347 L
.8367 g 2871 4347 M
-127 226 V
.8199 g 5376 5481 M
5249 5090 L
.8141 g 5249 5090 M
-127 266 V
.8984 g 5122 5356 M
-127 11 V
.9034 g 4995 5367 M
-127 -88 V
.8896 g 4868 5279 M
-127 -73 V
.8865 g 4741 5206 M
-127 -40 V
.8936 g 4614 5166 M
-127 -27 V
stroke
.9 g 4487 5139 M
-127 -44 V
.8945 g 4360 5095 M
-127 -79 V
.8878 g 4233 5016 M
-127 -50 V
.8949 g 4106 4966 M
-127 -17 V
.9007 g 3979 4949 M
-127 -56 V
.8939 g 3852 4893 M
-127 -74 V
.8863 g 3725 4819 M
-127 -59 V
.8898 g 3598 4760 M
-127 -24 V
.9055 g 3471 4736 M
-126 -5 V
.8996 g 3345 4731 M
3218 4611 L
.7765 g 3218 4611 M
3091 4083 L
.7858 g 3091 4083 M
-127 470 V
.7584 g 5596 5404 M
5469 4836 L
.7569 g 5469 4836 M
-127 462 V
.8906 g 5342 5298 M
-127 35 V
.8997 g 5215 5333 M
-127 -93 V
.8838 g 5088 5240 M
-127 -77 V
.8796 g 4961 5163 M
-127 -41 V
.8864 g 4834 5122 M
-127 -28 V
.8896 g 4707 5094 M
-127 -57 V
.8631 g 4580 5037 M
4453 4877 L
.8363 g 4453 4877 M
-127 -58 V
.8611 g 4326 4819 M
-127 69 V
.8896 g 4199 4888 M
-127 -41 V
.8862 g 4072 4847 M
-127 -73 V
.8788 g 3945 4774 M
-127 -59 V
.8834 g 3818 4715 M
-127 -20 V
.9017 g 3691 4695 M
-127 3 V
.8893 g 3564 4698 M
3437 4541 L
.6258 g 3437 4541 M
3311 3424 L
.6103 g 3311 3424 M
-127 949 V
.7623 g 5815 5376 M
5688 4824 L
.7607 g 5688 4824 M
-126 446 V
.8906 g 5562 5270 M
-127 34 V
.8996 g 5435 5304 M
-127 -93 V
.8839 g 5308 5211 M
-127 -76 V
.8797 g 5181 5135 M
-127 -41 V
.8864 g 5054 5094 M
-127 -29 V
.8896 g 4927 5065 M
-127 -56 V
.8647 g 4800 5009 M
4673 4856 L
.8399 g 4673 4856 M
-127 -57 V
.863 g 4546 4799 M
-127 61 V
.8896 g 4419 4860 M
-127 -42 V
.8862 g 4292 4818 M
-127 -73 V
.8789 g 4165 4745 M
-127 -58 V
.8834 g 4038 4687 M
-127 -20 V
.9016 g 3911 4667 M
-127 2 V
.8894 g 3784 4669 M
3657 4514 L
.6403 g 3657 4514 M
3530 3459 L
.628 g 3530 3459 M
-127 901 V
.8238 g 6035 5394 M
5908 5023 L
.8183 g 5908 5023 M
-127 247 V
.8981 g 5781 5270 M
-127 10 V
stroke
.903 g 5654 5280 M
-126 -87 V
.8896 g 5528 5193 M
-127 -72 V
.8865 g 5401 5121 M
-127 -41 V
.8934 g 5274 5080 M
-127 -27 V
.8994 g 5147 5053 M
-127 -45 V
.8942 g 5020 5008 M
-127 -78 V
.8879 g 4893 4930 M
-127 -49 V
.8946 g 4766 4881 M
-127 -20 V
.9001 g 4639 4861 M
-127 -54 V
.8937 g 4512 4807 M
-127 -73 V
.8863 g 4385 4734 M
-127 -60 V
.8897 g 4258 4674 M
-127 -24 V
.905 g 4131 4650 M
-127 -7 V
.8993 g 4004 4643 M
3877 4525 L
.7855 g 3877 4525 M
3750 4037 L
.794 g 3750 4037 M
-127 427 V
.8506 g 6255 5364 M
6128 5115 L
.8468 g 6128 5115 M
-127 133 V
.8975 g 6001 5248 M
-127 -6 V
.9009 g 5874 5242 M
-127 -78 V
.8905 g 5747 5164 M
-127 -67 V
.8882 g 5620 5097 M
-126 -42 V
.8935 g 5494 5055 M
-127 -33 V
.8978 g 5367 5022 M
-127 -47 V
.8948 g 5240 4975 M
-127 -66 V
.8912 g 5113 4909 M
-127 -49 V
.895 g 4986 4860 M
-127 -33 V
.8982 g 4859 4827 M
-127 -52 V
.8938 g 4732 4775 M
-127 -67 V
.8881 g 4605 4708 M
-127 -57 V
.8907 g 4478 4651 M
-127 -30 V
.9022 g 4351 4621 M
-127 -18 V
.8984 g 4224 4603 M
-127 -98 V
.8356 g 4097 4505 M
3970 4224 L
.8406 g 3970 4224 M
-127 204 V
.8534 g 6475 5314 M
6348 5121 L
.8517 g 6348 5121 M
-127 86 V
.8905 g 6221 5207 M
-127 -12 V
.8941 g 6094 5195 M
-127 -71 V
.8861 g 5967 5124 M
-127 -64 V
.884 g 5840 5060 M
-127 -44 V
.8875 g 5713 5016 M
-127 -39 V
.8892 g 5586 4977 M
-127 -53 V
.8851 g 5459 4924 M
-126 -65 V
.8816 g 5333 4859 M
-127 -50 V
.885 g 5206 4809 M
-127 -33 V
.8892 g 5079 4776 M
-127 -47 V
.8874 g 4952 4729 M
-127 -60 V
.8837 g 4825 4669 M
-127 -55 V
.886 g 4698 4614 M
-127 -34 V
.8946 g 4571 4580 M
-127 -27 V
.8905 g 4444 4553 M
-127 -91 V
.8448 g 4317 4462 M
4190 4250 L
stroke
.8466 g 4190 4250 M
-127 121 V
.854 g 6695 5276 M
6568 5103 L
.8529 g 6568 5103 M
-127 70 V
.8873 g 6441 5173 M
-127 -15 V
.8909 g 6314 5158 M
-127 -68 V
.8839 g 6187 5090 M
-127 -63 V
.8819 g 6060 5027 M
-127 -45 V
.8847 g 5933 4982 M
-127 -41 V
.8855 g 5806 4941 M
-127 -54 V
.8812 g 5679 4887 M
-127 -65 V
.8778 g 5552 4822 M
-127 -50 V
.8811 g 5425 4772 M
-126 -34 V
.8854 g 5299 4738 M
-127 -45 V
.8845 g 5172 4693 M
-127 -58 V
.8816 g 5045 4635 M
-127 -54 V
.8836 g 4918 4581 M
-127 -36 V
.8912 g 4791 4545 M
-127 -30 V
.887 g 4664 4515 M
-127 -88 V
.8471 g 4537 4427 M
4410 4238 L
.848 g 4410 4238 M
-127 94 V
.8637 g 6915 5272 M
6788 5094 L
.8613 g 6788 5094 M
-127 69 V
.895 g 6661 5163 M
-127 -18 V
.8976 g 6534 5145 M
-127 -70 V
.89 g 6407 5075 M
-127 -63 V
.8881 g 6280 5012 M
-127 -44 V
.892 g 6153 4968 M
-127 -38 V
.8947 g 6026 4930 M
-127 -49 V
.8923 g 5899 4881 M
-127 -60 V
.8899 g 5772 4821 M
-127 -50 V
.8924 g 5645 4771 M
-127 -38 V
.8948 g 5518 4733 M
-127 -50 V
.8921 g 5391 4683 M
-126 -62 V
.8881 g 5265 4621 M
-127 -55 V
.8901 g 5138 4566 M
-127 -35 V
.8984 g 5011 4531 M
-127 -27 V
.8956 g 4884 4504 M
-127 -84 V
.8566 g 4757 4420 M
4630 4231 L
.8594 g 4630 4231 M
-127 102 V
.8743 g 7135 5283 M
7008 5073 L
.8692 g 7008 5073 M
-127 88 V
.9071 g 6881 5161 M
-127 -18 V
.9081 g 6754 5143 M
-127 -76 V
.8986 g 6627 5067 M
-127 -66 V
.8969 g 6500 5001 M
-127 -41 V
.903 g 6373 4960 M
-127 -31 V
.9092 g 6246 4929 M
-127 -40 V
.9103 g 6119 4889 M
-127 -54 V
.9094 g 5992 4835 M
-127 -49 V
.9108 g 5865 4786 M
-127 -44 V
.9099 g 5738 4742 M
-127 -59 V
.9036 g 5611 4683 M
-127 -68 V
.8973 g 5484 4615 M
-127 -59 V
stroke
.8993 g 5357 4556 M
-126 -32 V
.9099 g 5231 4524 M
-127 -19 V
.9091 g 5104 4505 M
-127 -83 V
.8647 g 4977 4422 M
4850 4208 L
.8718 g 4850 4208 M
-127 146 V
.8309 g 7355 5187 M
7228 4919 L
.8294 g 7228 4919 M
-127 162 V
.8884 g 7101 5081 M
-127 2 V
.894 g 6974 5083 M
-127 -77 V
.8837 g 6847 5006 M
-127 -68 V
.8808 g 6720 4938 M
-127 -43 V
.885 g 6593 4895 M
-127 -37 V
.8864 g 6466 4858 M
-127 -56 V
.8784 g 6339 4802 M
-127 -79 V
.8717 g 6212 4723 M
-127 -50 V
.8782 g 6085 4673 M
-127 -20 V
.8862 g 5958 4653 M
-127 -43 V
.8847 g 5831 4610 M
-127 -63 V
.8803 g 5704 4547 M
-127 -56 V
.8833 g 5577 4491 M
-127 -30 V
.8946 g 5450 4461 M
-127 -19 V
.8879 g 5323 4442 M
5196 4333 L
.8123 g 5196 4333 M
5070 4006 L
.8132 g 5070 4006 M
-127 232 V
.6576 g 7574 4795 M
7448 4481 L
.6901 g 7448 4481 M
-127 360 V
.8102 g 7321 4841 M
-127 76 V
.8366 g 7194 4917 M
-127 -58 V
.8305 g 7067 4859 M
-127 -68 V
.8238 g 6940 4791 M
-127 -61 V
.8135 g 6813 4730 M
-127 -84 V
.7788 g 6686 4646 M
6559 4476 L
.7006 g 6559 4476 M
6432 4199 L
.6458 g 6432 4199 M
-127 -66 V
.6929 g 6305 4133 M
-127 176 V
.7719 g 6178 4309 M
-127 77 V
.8084 g 6051 4386 M
-127 -13 V
.8188 g 5924 4373 M
-127 -39 V
.8251 g 5797 4334 M
-127 -32 V
.8299 g 5670 4302 M
-127 -46 V
.7929 g 5543 4256 M
5416 4038 L
.6069 g 5416 4038 M
5289 3328 L
.5253 g 5289 3328 M
-127 247 V
.8029 g 7794 5150 M
7667 4717 L
.7984 g 7667 4717 M
-127 313 V
.8951 g 7540 5030 M
-126 19 V
.9015 g 7414 5049 M
-127 -89 V
.8872 g 7287 4960 M
-127 -74 V
.8836 g 7160 4886 M
-127 -41 V
.8905 g 7033 4845 M
-127 -28 V
.8956 g 6906 4817 M
-127 -48 V
.8855 g 6779 4769 M
-127 -96 V
.8749 g 6652 4673 M
-127 -50 V
stroke
.8855 g 6525 4623 M
-127 -1 V
.8961 g 6398 4622 M
-127 -51 V
.8906 g 6271 4571 M
-127 -73 V
.8832 g 6144 4498 M
-127 -59 V
.8871 g 6017 4439 M
-127 -23 V
.9035 g 5890 4416 M
-127 -3 V
.8955 g 5763 4413 M
5636 4282 L
.7447 g 5636 4282 M
5509 3641 L
.7505 g 5509 3641 M
-127 568 V
.7505 g 3617 5693 M
220 -646 V
.7447 g 3837 5047 M
219 563 V
.8955 g 4056 5610 M
220 53 V
.9035 g 4276 5663 M
220 -75 V
.8871 g 4496 5588 M
220 -56 V
.8832 g 4716 5532 M
220 -19 V
.8906 g 4936 5513 M
220 -5 V
.8961 g 5156 5508 M
220 -27 V
.8855 g 5376 5481 M
220 -77 V
.8749 g 5596 5404 M
219 -28 V
.8855 g 5815 5376 M
220 18 V
.8956 g 6035 5394 M
220 -30 V
.8905 g 6255 5364 M
220 -50 V
.8836 g 6475 5314 M
220 -38 V
.8872 g 6695 5276 M
220 -4 V
.9015 g 6915 5272 M
220 11 V
.8951 g 7135 5283 M
220 -96 V
.7984 g 7355 5187 M
219 -392 V
.8029 g 7574 4795 M
220 355 V
.5253 g 3490 4981 M
220 -325 V
.6069 g 3710 4656 M
219 632 V
.7929 g 3929 5288 M
220 140 V
.8299 g 4149 5428 M
220 -32 V
.8251 g 4369 5396 M
220 -47 V
.8188 g 4589 5349 M
220 -39 V
.8084 g 4809 5310 M
220 -64 V
.7719 g 5029 5246 M
220 -156 V
.6928 g 5249 5090 M
220 -254 V
.6458 g 5469 4836 M
219 -12 V
.7006 g 5688 4824 M
220 199 V
.7788 g 5908 5023 M
220 92 V
.8135 g 6128 5115 M
220 6 V
.8238 g 6348 5121 M
220 -18 V
.8305 g 6568 5103 M
220 -9 V
.8365 g 6788 5094 M
220 -21 V
.8102 g 7008 5073 M
220 -154 V
.6901 g 7228 4919 M
220 -438 V
.6576 g 7448 4481 M
219 236 V
.8132 g 3363 5566 M
220 -310 V
.8123 g 3583 5256 M
220 248 V
.8879 g 3803 5504 M
219 32 V
.8946 g 4022 5536 M
220 -59 V
.8833 g 4242 5477 M
220 -49 V
.8803 g 4462 5428 M
220 -22 V
stroke
.8847 g 4682 5406 M
220 -15 V
.8862 g 4902 5391 M
220 -35 V
.8782 g 5122 5356 M
220 -58 V
.8717 g 5342 5298 M
220 -28 V
.8784 g 5562 5270 M
219 0 V
.8864 g 5781 5270 M
220 -22 V
.885 g 6001 5248 M
220 -41 V
.8808 g 6221 5207 M
220 -34 V
.8837 g 6441 5173 M
220 -10 V
.894 g 6661 5163 M
220 -2 V
.8884 g 6881 5161 M
220 -80 V
.8294 g 7101 5081 M
220 -240 V
.8309 g 7321 4841 M
219 189 V
.8718 g 3236 5604 M
220 -225 V
.8647 g 3456 5379 M
220 136 V
.9091 g 3676 5515 M
219 5 V
.9099 g 3895 5520 M
220 -58 V
.8993 g 4115 5462 M
220 -46 V
.8973 g 4335 5416 M
220 -20 V
.9036 g 4555 5396 M
220 -9 V
.9099 g 4775 5387 M
220 -20 V
.9108 g 4995 5367 M
220 -34 V
.9094 g 5215 5333 M
220 -29 V
.9103 g 5435 5304 M
219 -24 V
.9092 g 5654 5280 M
220 -38 V
.903 g 5874 5242 M
220 -47 V
.8969 g 6094 5195 M
220 -37 V
.8986 g 6314 5158 M
220 -13 V
.9081 g 6534 5145 M
220 -2 V
.9071 g 6754 5143 M
220 -60 V
.8692 g 6974 5083 M
220 -166 V
.8743 g 7194 4917 M
220 132 V
.8594 g 3109 5505 M
220 -180 V
.8566 g 3329 5325 M
220 110 V
.8956 g 3549 5435 M
219 6 V
.8984 g 3768 5441 M
220 -51 V
.8901 g 3988 5390 M
220 -43 V
.8881 g 4208 5347 M
220 -23 V
.8921 g 4428 5324 M
220 -16 V
.8948 g 4648 5308 M
220 -29 V
.8924 g 4868 5279 M
220 -39 V
.8899 g 5088 5240 M
220 -29 V
.8923 g 5308 5211 M
220 -18 V
.8947 g 5528 5193 M
219 -29 V
.892 g 5747 5164 M
220 -40 V
.8881 g 5967 5124 M
220 -34 V
.89 g 6187 5090 M
220 -15 V
.8976 g 6407 5075 M
220 -8 V
.895 g 6627 5067 M
220 -61 V
.8613 g 6847 5006 M
220 -147 V
.8637 g 7067 4859 M
220 101 V
.848 g 2982 5426 M
220 -172 V
.8471 g 3202 5254 M
220 111 V
stroke
.887 g 3422 5365 M
220 9 V
.8912 g 3642 5374 M
219 -48 V
.8836 g 3861 5326 M
220 -42 V
.8815 g 4081 5284 M
220 -24 V
.8845 g 4301 5260 M
220 -20 V
.8854 g 4521 5240 M
220 -34 V
.8811 g 4741 5206 M
220 -43 V
.8778 g 4961 5163 M
220 -28 V
.8812 g 5181 5135 M
220 -14 V
.8855 g 5401 5121 M
219 -24 V
.8847 g 5620 5097 M
220 -37 V
.8819 g 5840 5060 M
220 -33 V
.8839 g 6060 5027 M
220 -15 V
.8909 g 6280 5012 M
220 -11 V
.8872 g 6500 5001 M
220 -63 V
.8529 g 6720 4938 M
220 -147 V
.854 g 6940 4791 M
220 95 V
.8466 g 2855 5387 M
220 -200 V
.8448 g 3075 5187 M
220 134 V
.8905 g 3295 5321 M
220 13 V
.8946 g 3515 5334 M
219 -51 V
.886 g 3734 5283 M
220 -45 V
.8837 g 3954 5238 M
220 -23 V
.8874 g 4174 5215 M
220 -17 V
.8892 g 4394 5198 M
220 -32 V
.885 g 4614 5166 M
220 -44 V
.8816 g 4834 5122 M
220 -28 V
.8851 g 5054 5094 M
220 -14 V
.8892 g 5274 5080 M
220 -25 V
.8875 g 5494 5055 M
219 -39 V
.884 g 5713 5016 M
220 -34 V
.8861 g 5933 4982 M
220 -14 V
.8941 g 6153 4968 M
220 -8 V
.8905 g 6373 4960 M
220 -65 V
.8517 g 6593 4895 M
220 -165 V
.8534 g 6813 4730 M
220 115 V
.8406 g 2728 5366 M
220 -283 V
.8356 g 2948 5083 M
220 203 V
.8984 g 3168 5286 M
220 20 V
.9022 g 3388 5306 M
220 -60 V
.8907 g 3608 5246 M
219 -48 V
.8881 g 3827 5198 M
220 -21 V
.8938 g 4047 5177 M
220 -11 V
.8982 g 4267 5166 M
220 -27 V
.895 g 4487 5139 M
220 -45 V
.8913 g 4707 5094 M
220 -29 V
.8948 g 4927 5065 M
220 -12 V
.8978 g 5147 5053 M
220 -31 V
.8935 g 5367 5022 M
219 -45 V
.8882 g 5586 4977 M
220 -36 V
.8905 g 5806 4941 M
220 -11 V
.9009 g 6026 4930 M
220 -1 V
.8975 g 6246 4929 M
220 -71 V
stroke
.8468 g 6466 4858 M
220 -212 V
.8506 g 6686 4646 M
220 171 V
.794 g 2601 5323 M
220 -505 V
.7855 g 2821 4818 M
220 410 V
.8993 g 3041 5228 M
220 40 V
.905 g 3261 5268 M
220 -71 V
.8897 g 3481 5197 M
219 -54 V
.8863 g 3700 5143 M
220 -19 V
.8937 g 3920 5124 M
220 -5 V
.9001 g 4140 5119 M
220 -24 V
.8946 g 4360 5095 M
220 -58 V
.8879 g 4580 5037 M
220 -28 V
.8942 g 4800 5009 M
220 -1 V
.8994 g 5020 5008 M
220 -33 V
.8934 g 5240 4975 M
219 -51 V
.8865 g 5459 4924 M
220 -37 V
.8896 g 5679 4887 M
220 -6 V
.903 g 5899 4881 M
220 8 V
.8981 g 6119 4889 M
220 -87 V
.8183 g 6339 4802 M
220 -326 V
.8238 g 6559 4476 M
220 293 V
.6281 g 2474 5141 M
220 -979 V
.6403 g 2694 4162 M
220 976 V
.8894 g 2914 5138 M
220 77 V
.9016 g 3134 5215 M
220 -80 V
.8834 g 3354 5135 M
220 -58 V
.8789 g 3574 5077 M
219 -19 V
.8862 g 3793 5058 M
220 -5 V
.8896 g 4013 5053 M
220 -37 V
.863 g 4233 5016 M
220 -139 V
.8399 g 4453 4877 M
220 -21 V
.8647 g 4673 4856 M
220 74 V
.8896 g 4893 4930 M
220 -21 V
.8864 g 5113 4909 M
220 -50 V
.8797 g 5333 4859 M
219 -37 V
.8839 g 5552 4822 M
220 -1 V
.8996 g 5772 4821 M
220 14 V
.8906 g 5992 4835 M
220 -112 V
.7607 g 6212 4723 M
220 -524 V
.7623 g 6432 4199 M
220 474 V
.6103 g 2347 5076 M
2567 4049 L
.6258 g 2567 4049 M
220 1039 V
.8893 g 2787 5088 M
220 79 V
.9017 g 3007 5167 M
220 -81 V
.8834 g 3227 5086 M
220 -59 V
.8788 g 3447 5027 M
219 -19 V
.8862 g 3666 5008 M
220 -5 V
.8896 g 3886 5003 M
220 -37 V
.8611 g 4106 4966 M
220 -147 V
.8363 g 4326 4819 M
220 -20 V
.863 g 4546 4799 M
220 82 V
.8896 g 4766 4881 M
220 -21 V
.8864 g 4986 4860 M
220 -51 V
stroke
.8796 g 5206 4809 M
219 -37 V
.8838 g 5425 4772 M
220 -1 V
.8997 g 5645 4771 M
220 15 V
.8905 g 5865 4786 M
220 -113 V
.7569 g 6085 4673 M
220 -540 V
.7584 g 6305 4133 M
220 490 V
.7858 g 2220 5178 M
220 -548 V
.7765 g 2440 4630 M
220 449 V
.8996 g 2660 5079 M
220 43 V
.9055 g 2880 5122 M
220 -73 V
.8898 g 3100 5049 M
220 -55 V
.8863 g 3320 4994 M
220 -18 V
.8939 g 3540 4976 M
219 -5 V
.9007 g 3759 4971 M
220 -22 V
.8949 g 3979 4949 M
220 -61 V
.8878 g 4199 4888 M
220 -28 V
.8945 g 4419 4860 M
220 1 V
.9 g 4639 4861 M
220 -34 V
.8936 g 4859 4827 M
220 -51 V
.8865 g 5079 4776 M
220 -38 V
.8896 g 5299 4738 M
219 -5 V
.9034 g 5518 4733 M
220 9 V
.8984 g 5738 4742 M
220 -89 V
.8141 g 5958 4653 M
220 -344 V
.8199 g 6178 4309 M
220 313 V
.8367 g 2093 5120 M
220 -304 V
.8312 g 2313 4816 M
220 222 V
.8988 g 2533 5038 M
220 22 V
.9027 g 2753 5060 M
220 -61 V
.8908 g 2973 4999 M
220 -49 V
.8881 g 3193 4950 M
220 -21 V
.894 g 3413 4929 M
219 -10 V
.8987 g 3632 4919 M
220 -26 V
.8954 g 3852 4893 M
220 -46 V
.8915 g 4072 4847 M
220 -29 V
.8952 g 4292 4818 M
220 -11 V
.8983 g 4512 4807 M
220 -32 V
.8938 g 4732 4775 M
220 -46 V
.8881 g 4952 4729 M
220 -36 V
.8906 g 5172 4693 M
219 -10 V
.9013 g 5391 4683 M
220 0 V
.8978 g 5611 4683 M
220 -73 V
.844 g 5831 4610 M
220 -224 V
.8481 g 6051 4386 M
220 185 V
.843 g 1966 5039 M
220 -213 V
.8412 g 2186 4826 M
220 148 V
.8905 g 2406 4974 M
220 15 V
.8949 g 2626 4989 M
220 -53 V
.8858 g 2846 4936 M
220 -45 V
.8835 g 3066 4891 M
220 -23 V
.8873 g 3286 4868 M
219 -17 V
.8892 g 3505 4851 M
220 -32 V
.8847 g 3725 4819 M
220 -45 V
stroke
.8809 g 3945 4774 M
220 -29 V
.8847 g 4165 4745 M
220 -11 V
.8892 g 4385 4734 M
220 -26 V
.8874 g 4605 4708 M
220 -39 V
.8838 g 4825 4669 M
220 -34 V
.886 g 5045 4635 M
220 -14 V
.8943 g 5265 4621 M
219 -6 V
.8905 g 5484 4615 M
220 -68 V
.8491 g 5704 4547 M
220 -174 V
.8509 g 5924 4373 M
220 125 V
.8441 g 1839 4978 M
220 -185 V
.8432 g 2059 4793 M
220 124 V
.8868 g 2279 4917 M
220 13 V
.8913 g 2499 4930 M
220 -50 V
.8833 g 2719 4880 M
220 -43 V
.8811 g 2939 4837 M
220 -24 V
.8842 g 3159 4813 M
220 -19 V
.8851 g 3379 4794 M
219 -34 V
.8803 g 3598 4760 M
220 -45 V
.8767 g 3818 4715 M
220 -28 V
.8805 g 4038 4687 M
220 -13 V
.8852 g 4258 4674 M
220 -23 V
.8844 g 4478 4651 M
220 -37 V
.8815 g 4698 4614 M
220 -33 V
.8837 g 4918 4581 M
220 -15 V
.8911 g 5138 4566 M
219 -10 V
.8871 g 5357 4556 M
220 -65 V
.85 g 5577 4491 M
220 -157 V
.8511 g 5797 4334 M
220 105 V
.8559 g 1712 4961 M
220 -198 V
.8527 g 1932 4763 M
220 127 V
.8961 g 2152 4890 M
220 9 V
.8991 g 2372 4899 M
220 -53 V
.8901 g 2592 4846 M
220 -44 V
.888 g 2812 4802 M
220 -22 V
.8924 g 3032 4780 M
220 -16 V
.8954 g 3252 4764 M
219 -28 V
.8928 g 3471 4736 M
220 -41 V
.8901 g 3691 4695 M
220 -28 V
.8927 g 3911 4667 M
220 -17 V
.8952 g 4131 4650 M
220 -29 V
.8923 g 4351 4621 M
220 -41 V
.8881 g 4571 4580 M
220 -35 V
.8901 g 4791 4545 M
220 -14 V
.8983 g 5011 4531 M
220 -7 V
.8955 g 5231 4524 M
219 -63 V
.8585 g 5450 4461 M
220 -159 V
.8611 g 5670 4302 M
220 114 V
.869 g 1585 4973 M
220 -262 V
.86 g 1805 4711 M
220 165 V
.9115 g 2025 4876 M
220 7 V
.9121 g 2245 4883 M
220 -62 V
.9003 g 2465 4821 M
220 -48 V
stroke
.8981 g 2685 4773 M
220 -19 V
.9053 g 2905 4754 M
220 -6 V
.9129 g 3125 4748 M
220 -17 V
.9145 g 3345 4731 M
219 -33 V
.9133 g 3564 4698 M
220 -29 V
.9139 g 3784 4669 M
220 -26 V
.912 g 4004 4643 M
220 -40 V
.9045 g 4224 4603 M
220 -50 V
.8976 g 4444 4553 M
220 -38 V
.8995 g 4664 4515 M
220 -11 V
.91 g 4884 4504 M
220 1 V
.909 g 5104 4505 M
219 -63 V
.8661 g 5323 4442 M
220 -186 V
.8723 g 5543 4256 M
220 157 V
.7867 g 1459 4810 M
219 -403 V
.787 g 1678 4407 M
220 347 V
.8873 g 1898 4754 M
220 44 V
.8955 g 2118 4798 M
220 -64 V
.8826 g 2338 4734 M
220 -51 V
.8791 g 2558 4683 M
220 -22 V
.8841 g 2778 4661 M
220 -13 V
.8856 g 2998 4648 M
220 -37 V
.8744 g 3218 4611 M
219 -70 V
.8655 g 3437 4541 M
220 -27 V
.8748 g 3657 4514 M
220 11 V
.8858 g 3877 4525 M
220 -20 V
.8844 g 4097 4505 M
220 -43 V
.8798 g 4317 4462 M
220 -35 V
.8831 g 4537 4427 M
220 -7 V
.8947 g 4757 4420 M
220 2 V
.888 g 4977 4422 M
219 -89 V
.8147 g 5196 4333 M
220 -295 V
.8161 g 5416 4038 M
220 244 V
.0809 g 1332 2993 M
219 -14 V
.3934 g 1551 2979 M
220 1350 V
.7597 g 1771 4329 M
220 226 V
.8172 g 1991 4555 M
220 -26 V
.8134 g 2211 4529 M
220 -49 V
.8053 g 2431 4480 M
220 -45 V
.7883 g 2651 4435 M
220 -88 V
.7221 g 2871 4347 M
220 -264 V
.5279 g 3091 4083 M
220 -659 V
.4007 g 3311 3424 M
219 35 V
.551 g 3530 3459 M
220 578 V
.7354 g 3750 4037 M
220 187 V
.7959 g 3970 4224 M
220 26 V
.812 g 4190 4250 M
220 -12 V
.8206 g 4410 4238 M
220 -7 V
.8266 g 4630 4231 M
220 -23 V
.789 g 4850 4208 M
220 -202 V
.6045 g 5070 4006 M
219 -678 V
.5355 g 5289 3328 M
220 313 V
.4833 g 1205 4752 M
1425 2915 L
stroke
.4742 g 1425 2915 M
219 1739 V
.8961 g 1644 4654 M
220 85 V
.9077 g 1864 4739 M
220 -90 V
.8867 g 2084 4649 M
220 -61 V
.8819 g 2304 4588 M
220 -17 V
.8915 g 2524 4571 M
220 2 V
.9004 g 2744 4573 M
220 -20 V
.8682 g 2964 4553 M
220 -180 V
.8377 g 3184 4373 M
219 -13 V
.871 g 3403 4360 M
220 104 V
.8992 g 3623 4464 M
220 -36 V
.8912 g 3843 4428 M
220 -57 V
.8825 g 4063 4371 M
220 -39 V
.8868 g 4283 4332 M
220 1 V
.9046 g 4503 4333 M
220 21 V
.896 g 4723 4354 M
220 -116 V
.734 g 4943 4238 M
219 -663 V
.7403 g 5162 3575 M
220 634 V
1.000 UL
LT0
4832 1779 M
1.000 UL
LT0
.8889 g 4832 1779 M
-76 5 V
1.000 UL
LT0
.8889 g 4756 1784 M
-319 -19 V
1.000 UL
LT0
.8889 g 4437 1765 M
-54 -13 V
1.000 UL
LT0
.8889 g 4383 1752 M
-221 29 V
1.000 UL
LT0
.8889 g 4162 1781 M
21 17 V
1.000 UL
LT0
.8889 g 4183 1798 M
-86 72 V
1.000 UL
LT0
.8889 g 4097 1870 M
-56 12 V
1.000 UL
LT0
.8889 g 4041 1882 M
128 50 V
1.000 UL
LT0
.8889 g 4169 1932 M
75 -5 V
1.000 UL
LT0
.8889 g 4244 1927 M
319 19 V
1.000 UL
LT0
.8889 g 4563 1946 M
55 13 V
1.000 UL
LT0
.8889 g 4618 1959 M
219 -29 V
1.000 UL
LT0
.8889 g 4837 1930 M
-20 -17 V
1.000 UL
LT0
.8889 g 4817 1913 M
86 -72 V
1.000 UL
LT0
.8889 g 4903 1841 M
55 -12 V
1.000 UL
LT0
.8889 g 4958 1829 M
-126 -50 V
182 -155 R
1.000 UL
LT0
.8889 g 5014 1624 M
-88 -2 V
1.000 UL
LT0
.8889 g 4926 1622 M
-277 -17 V
1.000 UL
LT0
.8889 g 4649 1605 M
-80 -8 V
1.000 UL
LT0
.8889 g 4569 1597 M
-122 34 V
1.000 UL
LT0
.8889 g 4447 1631 M
-56 10 V
1.000 UL
LT0
.8889 g 4391 1641 M
-129 64 V
1.000 UL
LT0
.8889 g 4262 1705 M
-220 29 V
1.000 UL
LT0
.8889 g 4042 1734 M
-311 -7 V
1.000 UL
LT0
.8889 g 3731 1727 M
-65 6 V
1.000 UL
LT0
.8889 g 3666 1733 M
-195 7 V
1.000 UL
LT0
.8889 g 3471 1740 M
-9 19 V
1.000 UL
LT0
.8889 g 3462 1759 M
-74 63 V
1.000 UL
LT0
.8889 g 3388 1822 M
-36 18 V
1.000 UL
LT0
.8889 g 3352 1840 M
154 28 V
1.000 UL
LT0
.8889 g 3506 1868 M
42 12 V
1.000 UL
LT0
.8889 g 3548 1880 M
286 29 V
1.000 UL
LT0
.8889 g 3834 1909 M
127 50 V
1.000 UL
LT0
.8889 g 3961 1959 M
-32 70 V
1.000 UL
LT0
.8889 g 3929 2029 M
27 15 V
1.000 UL
LT0
.8889 g 3956 2044 M
31 43 V
1.000 UL
LT0
.8889 g 3987 2087 M
87 2 V
1.000 UL
LT0
.8889 g 4074 2089 M
277 17 V
1.000 UL
LT0
.8889 g 4351 2106 M
80 8 V
1.000 UL
LT0
.8889 g 4431 2114 M
125 -35 V
1.000 UL
LT0
.8889 g 4556 2079 M
54 -9 V
1.000 UL
LT0
.8889 g 4610 2070 M
128 -64 V
1.000 UL
LT0
.8889 g 4738 2006 M
220 -29 V
1.000 UL
LT0
.8889 g 4958 1977 M
311 7 V
1.000 UL
LT0
.8889 g 5269 1984 M
64 -6 V
1.000 UL
LT0
.8889 g 5333 1978 M
197 -7 V
1.000 UL
LT0
.8889 g 5530 1971 M
8 -19 V
1.000 UL
LT0
.8889 g 5538 1952 M
74 -63 V
1.000 UL
LT0
.8889 g 5612 1889 M
37 -18 V
1.000 UL
LT0
.8889 g 5649 1871 M
-155 -28 V
1.000 UL
LT0
.8889 g 5494 1843 M
-42 -12 V
1.000 UL
LT0
.8889 g 5452 1831 M
-286 -29 V
1.000 UL
LT0
.8889 g 5166 1802 M
-127 -50 V
1.000 UL
LT0
.8889 g 5039 1752 M
32 -70 V
1.000 UL
LT0
.8889 g 5071 1682 M
-26 -14 V
1.000 UL
LT0
.8889 g 5045 1668 M
-31 -44 V
178 -156 R
1.000 UL
LT0
.8889 g 5192 1468 M
-95 -9 V
1.000 UL
LT0
.8889 g 5097 1459 M
-235 -14 V
1.000 UL
LT0
.8889 g 4862 1445 M
-102 -3 V
1.000 UL
LT0
.8889 g 4760 1442 M
-144 35 V
1.000 UL
LT0
.8889 g 4616 1477 M
-35 10 V
1.000 UL
LT0
.8889 g 4581 1487 M
-139 60 V
1.000 UL
LT0
.8889 g 4442 1547 M
-237 22 V
1.000 UL
LT0
.8889 g 4205 1569 M
-282 4 V
1.000 UL
LT0
.8889 g 3923 1573 M
-220 29 V
1.000 UL
LT0
.8889 g 3703 1602 M
-157 53 V
1.000 UL
LT0
.8889 g 3546 1655 M
-203 35 V
1.000 UL
LT0
.8889 g 3343 1690 M
-300 -3 V
1.000 UL
LT0
.8889 g 3043 1687 M
-55 2 V
1.000 UL
LT0
.8889 g 2988 1689 M
-206 11 V
1.000 UL
LT0
.8889 g 2782 1700 M
-40 21 V
1.000 UL
LT0
.8889 g 2742 1721 M
-63 53 V
1.000 UL
LT0
.8889 g 2679 1774 M
-12 23 V
1.000 UL
LT0
.8889 g 2667 1797 M
154 32 V
1.000 UL
LT0
.8889 g 2821 1829 M
43 8 V
1.000 UL
LT0
.8889 g 2864 1837 M
266 32 V
1.000 UL
LT0
.8889 g 3130 1869 M
98 53 V
1.000 UL
LT0
.8889 g 3228 1922 M
19 64 V
1.000 UL
LT0
.8889 g 3247 1986 M
127 49 V
1.000 UL
LT0
.8889 g 3374 2035 M
234 36 V
1.000 UL
LT0
.8889 g 3608 2071 M
156 45 V
1.000 UL
LT0
.8889 g 3764 2116 M
-11 68 V
1.000 UL
LT0
.8889 g 3753 2184 M
9 12 V
1.000 UL
LT0
.8889 g 3762 2196 M
47 47 V
1.000 UL
LT0
.8889 g 3809 2243 M
95 9 V
1.000 UL
LT0
.8889 g 3904 2252 M
234 14 V
1.000 UL
LT0
.8889 g 4138 2266 M
103 3 V
1.000 UL
LT0
.8889 g 4241 2269 M
144 -35 V
1.000 UL
LT0
.8889 g 4385 2234 M
34 -10 V
1.000 UL
LT0
.8889 g 4419 2224 M
139 -60 V
1.000 UL
LT0
.8889 g 4558 2164 M
237 -22 V
1.000 UL
LT0
.8889 g 4795 2142 M
282 -4 V
1.000 UL
LT0
.8889 g 5077 2138 M
220 -29 V
1.000 UL
LT0
.8889 g 5297 2109 M
158 -52 V
1.000 UL
LT0
.8889 g 5455 2057 M
203 -35 V
1.000 UL
LT0
.8889 g 5658 2022 M
299 2 V
1.000 UL
LT0
.8889 g 5957 2024 M
55 -2 V
1.000 UL
LT0
.8889 g 6012 2022 M
207 -11 V
1.000 UL
LT0
.8889 g 6219 2011 M
39 -21 V
1.000 UL
LT0
.8889 g 6258 1990 M
63 -53 V
1.000 UL
LT0
.8889 g 6321 1937 M
13 -23 V
1.000 UL
LT0
.8889 g 6334 1914 M
-155 -32 V
1.000 UL
LT0
.8889 g 6179 1882 M
-43 -8 V
1.000 UL
LT0
.8889 g 6136 1874 M
-265 -32 V
1.000 UL
LT0
.8889 g 5871 1842 M
-97 -53 V
1.000 UL
LT0
.8889 g 5774 1789 M
-20 -64 V
1.000 UL
LT0
.8889 g 5754 1725 M
-127 -49 V
1.000 UL
LT0
.8889 g 5627 1676 M
-234 -36 V
1.000 UL
LT0
.8889 g 5393 1640 M
-157 -45 V
1.000 UL
LT0
.8889 g 5236 1595 M
11 -68 V
1.000 UL
LT0
.8889 g 5247 1527 M
-8 -12 V
1.000 UL
LT0
.8889 g 5239 1515 M
-47 -47 V
170 -154 R
1.000 UL
LT0
.8889 g 5362 1314 M
-98 -18 V
1.000 UL
LT0
.8889 g 5264 1296 M
-184 -11 V
1.000 UL
LT0
.8889 g 5080 1285 M
-125 5 V
1.000 UL
LT0
.8889 g 4955 1290 M
-180 34 V
1.000 UL
LT0
.8889 g 4775 1324 M
-9 6 V
1.000 UL
LT0
.8889 g 4766 1330 M
-151 56 V
1.000 UL
LT0
.8889 g 4615 1386 M
-244 19 V
1.000 UL
LT0
.8889 g 4371 1405 M
-265 11 V
1.000 UL
LT0
.8889 g 4106 1416 M
-207 33 V
1.000 UL
LT0
.8889 g 3899 1449 M
-179 45 V
1.000 UL
LT0
.8889 g 3720 1494 M
-219 29 V
1.000 UL
LT0
.8889 g 3501 1523 M
-262 12 V
1.000 UL
LT0
.8889 g 3239 1535 M
-233 24 V
1.000 UL
LT0
.8889 g 3006 1559 M
-174 46 V
1.000 UL
LT0
.8889 g 2832 1605 M
-195 38 V
1.000 UL
LT0
.8889 g 2637 1643 M
-289 2 V
1.000 UL
LT0
.8889 g 2348 1645 M
-26 -1 V
1.000 UL
LT0
.8889 g 2322 1644 M
-224 18 V
1.000 UL
LT0
.8889 g 2098 1662 M
-78 21 V
1.000 UL
LT0
.8889 g 2020 1683 M
-51 43 V
1.000 UL
LT0
.8889 g 1969 1726 M
20 27 V
1.000 UL
LT0
.8889 g 1989 1753 M
154 41 V
1.000 UL
LT0
.8889 g 2143 1794 M
26 1 V
1.000 UL
LT0
.8889 g 2169 1795 M
247 35 V
1.000 UL
LT0
.8889 g 2416 1830 M
83 55 V
1.000 UL
LT0
.8889 g 2499 1885 M
48 59 V
1.000 UL
LT0
.8889 g 2547 1944 M
150 47 V
1.000 UL
LT0
.8889 g 2697 1991 M
199 40 V
1.000 UL
LT0
.8889 g 2896 2031 M
126 50 V
1.000 UL
LT0
.8889 g 3022 2081 M
55 59 V
1.000 UL
LT0
.8889 g 3077 2140 M
105 52 V
1.000 UL
LT0
.8889 g 3182 2192 M
205 39 V
1.000 UL
LT0
.8889 g 3387 2231 M
170 44 V
1.000 UL
LT0
.8889 g 3557 2275 M
9 65 V
1.000 UL
LT0
.8889 g 3566 2340 M
-6 6 V
1.000 UL
LT0
.8889 g 3560 2346 M
79 51 V
1.000 UL
LT0
.8889 g 3639 2397 M
97 18 V
1.000 UL
LT0
.8889 g 3736 2415 M
185 11 V
1.000 UL
LT0
.8889 g 3921 2426 M
125 -4 V
1.000 UL
LT0
.8889 g 4046 2422 M
180 -35 V
1.000 UL
LT0
.8889 g 4226 2387 M
8 -6 V
1.000 UL
LT0
.8889 g 4234 2381 M
152 -55 V
1.000 UL
LT0
.8889 g 4386 2326 M
244 -19 V
1.000 UL
LT0
.8889 g 4630 2307 M
265 -11 V
1.000 UL
LT0
.8889 g 4895 2296 M
208 -34 V
1.000 UL
LT0
.8889 g 5103 2262 M
181 -43 V
1.000 UL
LT0
.8889 g 5284 2219 M
220 -29 V
1.000 UL
LT0
.8889 g 5504 2190 M
258 -13 V
1.000 UL
LT0
.8889 g 5762 2177 M
232 -24 V
1.000 UL
LT0
.8889 g 5994 2153 M
176 -46 V
1.000 UL
LT0
.8889 g 6170 2107 M
194 -39 V
1.000 UL
LT0
.8889 g 6364 2068 M
288 -2 V
1.000 UL
LT0
.8889 g 6652 2066 M
27 1 V
1.000 UL
LT0
.8889 g 6679 2067 M
225 -17 V
1.000 UL
LT0
.8889 g 6904 2050 M
82 -23 V
1.000 UL
LT0
.8889 g 6986 2027 M
49 -40 V
1.000 UL
LT0
.8889 g 7035 1987 M
-22 -29 V
1.000 UL
LT0
.8889 g 7013 1958 M
-156 -40 V
1.000 UL
LT0
.8889 g 6857 1918 M
-26 -3 V
1.000 UL
LT0
.8889 g 6831 1915 M
-244 -34 V
1.000 UL
LT0
.8889 g 6587 1881 M
-83 -55 V
1.000 UL
LT0
.8889 g 6504 1826 M
-51 -59 V
1.000 UL
LT0
.8889 g 6453 1767 M
-147 -47 V
1.000 UL
LT0
.8889 g 6306 1720 M
-194 -41 V
1.000 UL
LT0
.8889 g 6112 1679 M
-127 -50 V
1.000 UL
LT0
.8889 g 5985 1629 M
-60 -58 V
1.000 UL
LT0
.8889 g 5925 1571 M
-106 -52 V
1.000 UL
LT0
.8889 g 5819 1519 M
-205 -40 V
1.000 UL
LT0
.8889 g 5614 1479 M
-170 -43 V
1.000 UL
LT0
.8889 g 5444 1436 M
-9 -65 V
1.000 UL
LT0
.8889 g 5435 1371 M
5 -6 V
1.000 UL
LT0
.8889 g 5440 1365 M
-78 -51 V
3066 2383 M
1.000 UL
LT0
.8889 g 3066 2383 M
59 15 V
1.000 UL
LT0
.8889 g 3125 2398 M
179 42 V
1.000 UL
LT0
.8889 g 3304 2440 M
19 43 V
2577 2192 M
1.000 UL
LT0
.8889 g 2577 2192 M
37 8 V
1.000 UL
LT0
.8889 g 2614 2200 M
132 49 V
1.000 UL
LT0
.8889 g 2746 2249 M
70 36 V
2007 1969 M
1.000 UL
LT0
.8889 g 2007 1969 M
104 32 V
1.000 UL
LT0
.8889 g 2111 2001 M
123 50 V
1.000 UL
LT0
.8889 g 2234 2051 M
12 12 V
1505 1774 M
1.000 UL
LT0
.8889 g 1505 1774 M
150 22 V
1.000 UL
LT0
.8889 g 1655 1796 M
73 57 V
1.000 UL
LT0
.8889 g 1728 1853 M
30 19 V
2815 601 R
1.000 UL
LT0
.8889 g 4573 2473 M
-84 7 V
1.000 UL
LT0
.8889 g 4489 2480 M
-250 17 V
1.000 UL
LT0
.8889 g 4239 2497 M
-111 34 V
2162 1532 M
1.000 UL
LT0
.8889 g 2162 1532 M
-68 14 V
1.000 UL
LT0
.8889 g 2094 1546 M
-189 40 V
1.000 UL
LT0
.8889 g 1905 1586 M
-181 3 V
3727 770 R
1.000 UL
LT0
.8889 g 5451 2359 M
-82 7 V
1.000 UL
LT0
.8889 g 5369 2366 M
-222 28 V
1.000 UL
LT0
.8889 g 5147 2394 M
-137 22 V
3008 1422 M
1.000 UL
LT0
.8889 g 3008 1422 M
-36 9 V
1.000 UL
LT0
.8889 g 2972 1431 M
-217 29 V
1.000 UL
LT0
.8889 g 2755 1460 M
-161 16 V
3808 759 R
1.000 UL
LT0
.8889 g 6402 2235 M
-156 16 V
1.000 UL
LT0
.8889 g 6246 2251 M
-217 30 V
1.000 UL
LT0
.8889 g 6029 2281 M
-68 12 V
3995 1294 M
1.000 UL
LT0
.8889 g 3995 1294 M
-141 23 V
1.000 UL
LT0
.8889 g 3854 1317 M
-223 28 V
1.000 UL
LT0
.8889 g 3631 1345 M
-51 3 V
3709 772 R
1.000 UL
LT0
.8889 g 7289 2120 M
-192 5 V
1.000 UL
LT0
.8889 g 7097 2125 M
-190 41 V
1.000 UL
LT0
.8889 g 6907 2166 M
-68 13 V
4872 1180 M
1.000 UL
LT0
.8889 g 4872 1180 M
-110 34 V
1.000 UL
LT0
.8889 g 4762 1214 M
-251 17 V
1.000 UL
LT0
.8889 g 4511 1231 M
-83 7 V
2815 601 R
1.000 UL
LT0
.8889 g 7243 1839 M
29 19 V
1.000 UL
LT0
.8889 g 7272 1858 M
76 56 V
1.000 UL
LT0
.8889 g 7348 1914 M
155 27 V
6736 1641 M
1.000 UL
LT0
.8889 g 6736 1641 M
32 19 V
1.000 UL
LT0
.8889 g 6768 1660 M
122 50 V
1.000 UL
LT0
.8889 g 6890 1710 M
100 31 V
6187 1427 M
1.000 UL
LT0
.8889 g 6187 1427 M
68 35 V
1.000 UL
LT0
.8889 g 6255 1462 M
132 49 V
1.000 UL
LT0
.8889 g 6387 1511 M
55 16 V
5677 1228 M
1.000 UL
LT0
.8889 g 5677 1228 M
20 43 V
1.000 UL
LT0
.8889 g 5697 1271 M
179 42 V
1.000 UL
LT0
.8889 g 5876 1313 M
58 16 V
5382 1113 M
-808 700 R
1.000 UL
LT0
.8444 g 4574 1813 M
-44 -3 V
1.000 UL
LT0
.8444 g 4530 1810 M
-227 26 V
1.000 UL
LT0
.8444 g 4303 1836 M
-17 14 V
1.000 UL
LT0
.8444 g 4286 1850 M
140 48 V
1.000 UL
LT0
.8444 g 4426 1898 M
44 3 V
1.000 UL
LT0
.8444 g 4470 1901 M
211 -32 V
1.000 UL
LT0
.8444 g 4681 1869 M
6 -5 V
1.000 UL
LT0
.8444 g 4687 1864 M
-113 -51 V
678 -551 R
1.000 UL
LT0
.8444 g 5252 1262 M
-86 -4 V
1.000 UL
LT0
.8444 g 5166 1258 M
-288 2 V
1.000 UL
LT0
.8444 g 4878 1260 M
-209 32 V
1.000 UL
LT0
.8444 g 4669 1292 M
-200 37 V
1.000 UL
LT0
.8444 g 4469 1329 M
-215 30 V
1.000 UL
LT0
.8444 g 4254 1359 M
-209 33 V
1.000 UL
LT0
.8444 g 4045 1392 M
-192 39 V
1.000 UL
LT0
.8444 g 3853 1431 M
-201 36 V
1.000 UL
LT0
.8444 g 3652 1467 M
-219 29 V
1.000 UL
LT0
.8444 g 3433 1496 M
-238 22 V
1.000 UL
LT0
.8444 g 3195 1518 M
-245 19 V
1.000 UL
LT0
.8444 g 2950 1537 M
-229 24 V
1.000 UL
LT0
.8444 g 2721 1561 M
-223 28 V
1.000 UL
LT0
.8444 g 2498 1589 M
-237 22 V
1.000 UL
LT0
.8444 g 2261 1611 M
-228 25 V
1.000 UL
LT0
.8444 g 2033 1636 M
-154 55 V
1.000 UL
LT0
.8444 g 1879 1691 M
-15 12 V
1.000 UL
LT0
.8444 g 1864 1703 M
13 65 V
1.000 UL
LT0
.8444 g 1877 1768 M
140 47 V
1.000 UL
LT0
.8444 g 2017 1815 M
157 46 V
1.000 UL
LT0
.8444 g 2174 1861 M
132 49 V
1.000 UL
LT0
.8444 g 2306 1910 M
144 47 V
1.000 UL
LT0
.8444 g 2450 1957 M
171 44 V
1.000 UL
LT0
.8444 g 2621 2001 M
157 45 V
1.000 UL
LT0
.8444 g 2778 2046 M
126 50 V
1.000 UL
LT0
.8444 g 2904 2096 M
94 54 V
1.000 UL
LT0
.8444 g 2998 2150 M
80 56 V
1.000 UL
LT0
.8444 g 3078 2206 M
107 52 V
1.000 UL
LT0
.8444 g 3185 2258 M
118 50 V
1.000 UL
LT0
.8444 g 3303 2308 M
94 54 V
1.000 UL
LT0
.8444 g 3397 2362 M
109 52 V
1.000 UL
LT0
.8444 g 3506 2414 M
244 34 V
1.000 UL
LT0
.8444 g 3750 2448 M
85 6 V
1.000 UL
LT0
.8444 g 3835 2454 M
291 -1 V
1.000 UL
LT0
.8444 g 4126 2453 M
211 -32 V
1.000 UL
LT0
.8444 g 4337 2421 M
201 -36 V
1.000 UL
LT0
.8444 g 4538 2385 M
217 -30 V
1.000 UL
LT0
.8444 g 4755 2355 M
210 -32 V
1.000 UL
LT0
.8444 g 4965 2323 M
193 -39 V
1.000 UL
LT0
.8444 g 5158 2284 M
199 -37 V
1.000 UL
LT0
.8444 g 5357 2247 M
220 -28 V
1.000 UL
LT0
.8444 g 5577 2219 M
243 -20 V
1.000 UL
LT0
.8444 g 5820 2199 M
248 -17 V
1.000 UL
LT0
.8444 g 6068 2182 M
232 -24 V
1.000 UL
LT0
.8444 g 6300 2158 M
225 -27 V
1.000 UL
LT0
.8444 g 6525 2131 M
240 -21 V
1.000 UL
LT0
.8444 g 6765 2110 M
230 -24 V
1.000 UL
LT0
.8444 g 6995 2086 M
149 -57 V
1.000 UL
LT0
.8444 g 7144 2029 M
32 -26 V
1.000 UL
LT0
.8444 g 7176 2003 M
-4 -66 V
1.000 UL
LT0
.8444 g 7172 1937 M
-145 -47 V
1.000 UL
LT0
.8444 g 7027 1890 M
-162 -45 V
1.000 UL
LT0
.8444 g 6865 1845 M
-136 -48 V
1.000 UL
LT0
.8444 g 6729 1797 M
-147 -47 V
1.000 UL
LT0
.8444 g 6582 1750 M
-176 -43 V
1.000 UL
LT0
.8444 g 6406 1707 M
-167 -45 V
1.000 UL
LT0
.8444 g 6239 1662 M
-128 -49 V
1.000 UL
LT0
.8444 g 6111 1613 M
-90 -54 V
1.000 UL
LT0
.8444 g 6021 1559 M
-81 -56 V
1.000 UL
LT0
.8444 g 5940 1503 M
-110 -52 V
1.000 UL
LT0
.8444 g 5830 1451 M
-122 -50 V
1.000 UL
LT0
.8444 g 5708 1401 M
-95 -53 V
1.000 UL
LT0
.8444 g 5613 1348 M
-112 -52 V
1.000 UL
LT0
.8444 g 5501 1296 M
-249 -34 V
2482 2155 M
1.000 UL
LT0
.8444 g 2482 2155 M
178 39 V
1.000 UL
LT0
.8444 g 2660 2194 M
172 44 V
1.000 UL
LT0
.8444 g 2832 2238 M
140 47 V
1.000 UL
LT0
.8444 g 2972 2285 M
133 49 V
1.000 UL
LT0
.8444 g 3105 2334 M
163 45 V
1.000 UL
LT0
.8444 g 3268 2379 M
147 47 V
1.000 UL
LT0
.8444 g 3415 2426 M
4 65 V
1.000 UL
LT0
.8444 g 3419 2491 M
-41 13 V
1455 1754 M
1.000 UL
LT0
.8444 g 1455 1754 M
39 -3 V
1.000 UL
LT0
.8444 g 1494 1751 M
254 33 V
1.000 UL
LT0
.8444 g 1748 1784 M
108 52 V
1.000 UL
LT0
.8444 g 1856 1836 M
93 54 V
1.000 UL
LT0
.8444 g 1949 1890 M
125 50 V
1.000 UL
LT0
.8444 g 2074 1940 M
116 51 V
1.000 UL
LT0
.8444 g 2190 1991 M
86 55 V
1.000 UL
LT0
.8444 g 2276 2046 M
53 49 V
1324 498 R
1.000 UL
LT0
.8444 g 3653 2593 M
-54 -3 V
1218 1655 M
1.000 UL
LT0
.8444 g 1218 1655 M
-5 4 V
3151 1404 M
1.000 UL
LT0
.8444 g 3151 1404 M
-155 36 V
1.000 UL
LT0
.8444 g 2996 1440 M
-196 38 V
1.000 UL
LT0
.8444 g 2800 1478 M
-214 31 V
1.000 UL
LT0
.8444 g 2586 1509 M
-218 29 V
1.000 UL
LT0
.8444 g 2368 1538 M
-200 37 V
1.000 UL
LT0
.8444 g 2168 1575 M
-209 32 V
1.000 UL
LT0
.8444 g 1959 1607 M
-294 0 V
1.000 UL
LT0
.8444 g 1665 1607 M
-27 -7 V
5764 505 R
1.000 UL
LT0
.8444 g 7402 2105 M
-93 -11 V
1.000 UL
LT0
.8444 g 7309 2094 M
-290 1 V
1.000 UL
LT0
.8444 g 7019 2095 M
-210 33 V
1.000 UL
LT0
.8444 g 6809 2128 M
-199 36 V
1.000 UL
LT0
.8444 g 6610 2164 M
-216 30 V
1.000 UL
LT0
.8444 g 6394 2194 M
-211 32 V
1.000 UL
LT0
.8444 g 6183 2226 M
-193 39 V
1.000 UL
LT0
.8444 g 5990 2265 M
-192 40 V
1.000 UL
LT0
.8444 g 5798 2305 M
-219 29 V
1.000 UL
LT0
.8444 g 5579 2334 M
-246 18 V
1.000 UL
LT0
.8444 g 5333 2352 M
-245 19 V
1.000 UL
LT0
.8444 g 5088 2371 M
-227 26 V
1.000 UL
LT0
.8444 g 4861 2397 M
-222 27 V
1.000 UL
LT0
.8444 g 4639 2424 M
-238 22 V
1.000 UL
LT0
.8444 g 4401 2446 M
-230 25 V
1.000 UL
LT0
.8444 g 4171 2471 M
-148 56 V
1.000 UL
LT0
.8444 g 4023 2527 M
7 17 V
4967 1167 M
1.000 UL
LT0
.8444 g 4967 1167 M
8 16 V
1.000 UL
LT0
.8444 g 4975 1183 M
-149 56 V
1.000 UL
LT0
.8444 g 4826 1239 M
-232 24 V
1.000 UL
LT0
.8444 g 4594 1263 M
-240 21 V
1.000 UL
LT0
.8444 g 4354 1284 M
-223 27 V
1.000 UL
LT0
.8444 g 4131 1311 M
-228 26 V
1.000 UL
LT0
.8444 g 3903 1337 M
-245 18 V
1.000 UL
LT0
.8444 g 3658 1355 M
-242 14 V
4346 673 R
1.000 UL
LT0
.8444 g 7762 2042 M
-25 20 V
5621 1206 M
1.000 UL
LT0
.8444 g 5621 1206 M
-44 14 V
1.000 UL
LT0
.8444 g 5577 1220 M
3 66 V
1.000 UL
LT0
.8444 g 5580 1286 M
143 47 V
1.000 UL
LT0
.8444 g 5723 1333 M
160 46 V
1.000 UL
LT0
.8444 g 5883 1379 M
130 49 V
1.000 UL
LT0
.8444 g 6013 1428 M
140 47 V
1.000 UL
LT0
.8444 g 6153 1475 M
170 44 V
1.000 UL
LT0
.8444 g 6323 1519 M
173 44 V
1.000 UL
LT0
.8444 g 6496 1563 M
126 50 V
1.000 UL
LT0
.8444 g 6622 1613 M
78 55 V
1.000 UL
LT0
.8444 g 6700 1668 M
81 56 V
1.000 UL
LT0
.8444 g 6781 1724 M
111 52 V
1.000 UL
LT0
.8444 g 6892 1776 M
120 50 V
1.000 UL
LT0
.8444 g 7012 1826 M
91 54 V
1.000 UL
LT0
.8444 g 7103 1880 M
109 52 V
1.000 UL
LT0
.8444 g 7212 1932 M
249 34 V
1.000 UL
LT0
.8444 g 7461 1966 M
107 0 V
5403 1121 M
1.000 UL
LT0
.8444 g 5403 1121 M
-54 -3 V
2363 1968 M
1.000 UL
LT0
.8 g 2363 1968 M
-168 -40 V
1.000 UL
LT0
.8 g 2195 1928 M
75 53 V
1.000 UL
LT0
.8 g 2270 1981 M
48 59 V
1.000 UL
LT0
.8 g 2318 2040 M
47 60 V
1.000 UL
LT0
.8 g 2365 2100 M
131 49 V
1.000 UL
LT0
.8 g 2496 2149 M
210 39 V
1.000 UL
LT0
.8 g 2706 2188 M
211 38 V
1.000 UL
LT0
.8 g 2917 2226 M
116 29 V
1.000 UL
LT0
.8 g 3033 2255 M
-49 -37 V
1.000 UL
LT0
.8 g 2984 2218 M
-36 -62 V
1.000 UL
LT0
.8 g 2948 2156 M
-65 -57 V
1.000 UL
LT0
.8 g 2883 2099 M
-125 -50 V
1.000 UL
LT0
.8 g 2758 2049 M
-183 -42 V
1.000 UL
LT0
.8 g 2575 2007 M
-212 -39 V
3742 240 R
1.000 UL
LT0
.8 g 6105 2208 M
-243 8 V
1.000 UL
LT0
.8 g 5862 2216 M
-259 13 V
1.000 UL
LT0
.8 g 5603 2229 M
-222 28 V
1.000 UL
LT0
.8 g 5381 2257 M
-183 43 V
1.000 UL
LT0
.8 g 5198 2300 M
-168 48 V
1.000 UL
LT0
.8 g 5030 2348 M
266 -10 V
1.000 UL
LT0
.8 g 5296 2338 M
259 -14 V
1.000 UL
LT0
.8 g 5555 2324 M
218 -29 V
1.000 UL
LT0
.8 g 5773 2295 M
178 -45 V
1.000 UL
LT0
.8 g 5951 2250 M
154 -42 V
4117 1344 M
1.000 UL
LT0
.8 g 4117 1344 M
-164 12 V
1.000 UL
LT0
.8 g 3953 1356 M
-269 10 V
1.000 UL
LT0
.8 g 3684 1366 M
-267 10 V
1.000 UL
LT0
.8 g 3417 1376 M
-223 27 V
1.000 UL
LT0
.8 g 3194 1403 M
-174 47 V
1.000 UL
LT0
.8 g 3020 1450 M
-174 46 V
1.000 UL
LT0
.8 g 2846 1496 M
-181 37 V
1.000 UL
LT0
.8 g 2665 1533 M
235 -16 V
1.000 UL
LT0
.8 g 2900 1517 M
269 -9 V
1.000 UL
LT0
.8 g 3169 1508 M
252 -16 V
1.000 UL
LT0
.8 g 3421 1492 M
219 -29 V
1.000 UL
LT0
.8 g 3640 1463 M
184 -43 V
1.000 UL
LT0
.8 g 3824 1420 M
167 -49 V
1.000 UL
LT0
.8 g 3991 1371 M
126 -27 V
2142 184 R
1.000 UL
LT0
.8 g 6259 1528 M
-207 -39 V
1.000 UL
LT0
.8 g 6052 1489 M
38 61 V
1.000 UL
LT0
.8 g 6090 1550 M
64 57 V
1.000 UL
LT0
.8 g 6154 1607 M
129 50 V
1.000 UL
LT0
.8 g 6283 1657 M
196 40 V
1.000 UL
LT0
.8 g 6479 1697 M
193 34 V
1.000 UL
LT0
.8 g 6672 1731 M
-40 -54 V
1.000 UL
LT0
.8 g 6632 1677 M
-53 -59 V
1.000 UL
LT0
.8 g 6579 1618 M
-125 -50 V
1.000 UL
LT0
.8 g 6454 1568 M
-195 -40 V
3688 2588 M
1.000 UL
LT0
.8 g 3688 2588 M
-108 -5 V
1230 1654 M
1.000 UL
LT0
.8 g 1230 1654 M
-10 8 V
2773 887 R
1.000 UL
LT0
.8 g 3993 2549 M
-16 -40 V
1.000 UL
LT0
.8 g 3977 2509 M
84 -35 V
1.000 UL
LT0
.8 g 4061 2474 M
-178 -2 V
1.000 UL
LT0
.8 g 3883 2472 M
-211 -13 V
1.000 UL
LT0
.8 g 3672 2459 M
-170 -21 V
1.000 UL
LT0
.8 g 3502 2438 M
-5 43 V
1.000 UL
LT0
.8 g 3497 2481 M
-99 31 V
1626 1602 M
1.000 UL
LT0
.8 g 1626 1602 M
73 18 V
1.000 UL
LT0
.8 g 1699 1620 M
261 5 V
1.000 UL
LT0
.8 g 1960 1625 M
-114 53 V
1.000 UL
LT0
.8 g 1846 1678 M
-40 33 V
1.000 UL
LT0
.8 g 1806 1711 M
-18 58 V
1.000 UL
LT0
.8 g 1788 1769 M
-236 -25 V
1.000 UL
LT0
.8 g 1552 1744 M
-104 7 V
6281 278 R
1.000 UL
LT0
.8 g 7729 2029 M
-48 40 V
-78 -89 R
1.000 UL
LT0
.8 g 7603 1980 M
-242 -1 V
1.000 UL
LT0
.8 g 7361 1979 M
-81 -11 V
1.000 UL
LT0
.8 g 7280 1968 M
-1 21 V
1.000 UL
LT0
.8 g 7279 1989 M
-75 64 V
1.000 UL
LT0
.8 g 7204 2053 M
-46 18 V
1.000 UL
LT0
.8 g 7158 2071 M
93 0 V
1.000 UL
LT0
.8 g 7251 2071 M
211 27 V
5599 1198 M
1.000 UL
LT0
.8 g 5599 1198 M
-102 33 V
1.000 UL
LT0
.8 g 5497 1231 M
-5 40 V
1.000 UL
LT0
.8 g 5492 1271 M
-158 -19 V
1.000 UL
LT0
.8 g 5334 1252 M
-214 -12 V
1.000 UL
LT0
.8 g 5120 1240 M
-192 -1 V
1.000 UL
LT0
.8 g 4928 1239 M
91 -38 V
1.000 UL
LT0
.8 g 5019 1201 M
-17 -38 V
421 -34 R
1.000 UL
LT0
.8 g 5423 1129 M
-106 -7 V
2530 2013 M
1.000 UL
LT0
.7556 g 2530 2013 M
-193 -29 V
1.000 UL
LT0
.7556 g 2337 1984 M
23 51 V
1.000 UL
LT0
.7556 g 2360 2035 M
27 62 V
1.000 UL
LT0
.7556 g 2387 2097 M
132 49 V
1.000 UL
LT0
.7556 g 2519 2146 M
233 36 V
1.000 UL
LT0
.7556 g 2752 2182 M
160 26 V
1.000 UL
LT0
.7556 g 2912 2208 M
-14 -45 V
1.000 UL
LT0
.7556 g 2898 2163 M
-37 -61 V
1.000 UL
LT0
.7556 g 2861 2102 M
-123 -50 V
1.000 UL
LT0
.7556 g 2738 2052 M
-208 -39 V
3394 219 R
1.000 UL
LT0
.7556 g 5924 2232 M
-19 0 V
1.000 UL
LT0
.7556 g 5905 2232 M
-277 7 V
1.000 UL
LT0
.7556 g 5628 2239 M
-222 27 V
1.000 UL
LT0
.7556 g 5406 2266 M
-168 49 V
1.000 UL
LT0
.7556 g 5238 2315 M
-36 10 V
1.000 UL
LT0
.7556 g 5202 2325 M
57 -2 V
1.000 UL
LT0
.7556 g 5259 2323 M
272 -8 V
1.000 UL
LT0
.7556 g 5531 2315 M
217 -30 V
1.000 UL
LT0
.7556 g 5748 2285 M
164 -50 V
1.000 UL
LT0
.7556 g 5912 2235 M
12 -3 V
3907 1371 M
1.000 UL
LT0
.7556 g 3907 1371 M
-196 5 V
1.000 UL
LT0
.7556 g 3711 1376 M
-281 5 V
1.000 UL
LT0
.7556 g 3430 1381 M
-223 27 V
1.000 UL
LT0
.7556 g 3207 1408 M
-162 51 V
1.000 UL
LT0
.7556 g 3045 1459 M
-133 42 V
1.000 UL
LT0
.7556 g 2912 1501 M
231 -4 V
1.000 UL
LT0
.7556 g 3143 1497 M
266 -10 V
1.000 UL
LT0
.7556 g 3409 1487 M
218 -29 V
1.000 UL
LT0
.7556 g 3627 1458 M
168 -49 V
1.000 UL
LT0
.7556 g 3795 1409 M
112 -38 V
2288 165 R
1.000 UL
LT0
.7556 g 6195 1536 M
-44 -8 V
1.000 UL
LT0
.7556 g 6151 1528 M
8 13 V
1.000 UL
LT0
.7556 g 6159 1541 M
37 61 V
1.000 UL
LT0
.7556 g 6196 1602 M
131 49 V
1.000 UL
LT0
.7556 g 6327 1651 M
226 37 V
1.000 UL
LT0
.7556 g 6553 1688 M
15 2 V
1.000 UL
LT0
.7556 g 6568 1690 M
-3 -4 V
1.000 UL
LT0
.7556 g 6565 1686 M
-30 -62 V
1.000 UL
LT0
.7556 g 6535 1624 M
-123 -50 V
1.000 UL
LT0
.7556 g 6412 1574 M
-217 -38 V
3724 2584 M
1.000 UL
LT0
.7556 g 3724 2584 M
-163 -9 V
1242 1652 M
1.000 UL
LT0
.7556 g 1242 1652 M
-15 13 V
2729 889 R
1.000 UL
LT0
.7556 g 3956 2554 M
-25 -63 V
1.000 UL
LT0
.7556 g 3931 2491 M
1 0 V
1.000 UL
LT0
.7556 g 3932 2491 M
-2 0 V
1.000 UL
LT0
.7556 g 3930 2491 M
-337 -22 V
1.000 UL
LT0
.7556 g 3593 2469 M
-18 -2 V
1.000 UL
LT0
.7556 g 3575 2467 M
-1 4 V
1.000 UL
LT0
.7556 g 3574 2471 M
-156 49 V
1613 1604 M
1.000 UL
LT0
.7556 g 1613 1604 M
119 29 V
1.000 UL
LT0
.7556 g 1732 1633 M
142 3 V
1.000 UL
LT0
.7556 g 1874 1636 M
-62 29 V
1.000 UL
LT0
.7556 g 1812 1665 M
-64 53 V
1.000 UL
LT0
.7556 g 1748 1718 M
-10 32 V
1.000 UL
LT0
.7556 g 1738 1750 M
-128 -14 V
1.000 UL
LT0
.7556 g 1610 1736 M
-169 13 V
6255 267 R
1.000 UL
LT0
.7556 g 7696 2016 M
-72 61 V
13 -84 R
1.000 UL
LT0
.7556 g 7637 1993 M
-298 -2 V
1.000 UL
LT0
.7556 g 7339 1991 M
-80 67 V
1.000 UL
LT0
.7556 g 7259 2058 M
263 32 V
5578 1190 M
1.000 UL
LT0
.7556 g 5578 1190 M
-161 51 V
1.000 UL
LT0
.7556 g 5417 1241 M
1.000 UL
LT0
.7556 g 5417 1241 M
-2 0 V
1.000 UL
LT0
.7556 g 5415 1241 M
-340 -19 V
1.000 UL
LT0
.7556 g 5075 1222 M
-21 0 V
1.000 UL
LT0
.7556 g 5054 1222 M
10 -4 V
1.000 UL
LT0
.7556 g 5064 1218 M
-28 -59 V
408 -22 R
1.000 UL
LT0
.7556 g 5444 1137 M
-160 -11 V
2484 2019 M
1.000 UL
LT0
.7111 g 2484 2019 M
-93 -14 V
1.000 UL
LT0
.7111 g 2391 2005 M
11 24 V
1.000 UL
LT0
.7111 g 2402 2029 M
7 66 V
1.000 UL
LT0
.7111 g 2409 2095 M
133 48 V
1.000 UL
LT0
.7111 g 2542 2143 M
255 33 V
1.000 UL
LT0
.7111 g 2797 2176 M
56 9 V
1.000 UL
LT0
.7111 g 2853 2185 M
-4 -16 V
1.000 UL
LT0
.7111 g 2849 2169 M
-10 -64 V
1.000 UL
LT0
.7111 g 2839 2105 M
-122 -51 V
1.000 UL
LT0
.7111 g 2717 2054 M
-233 -35 V
3337 226 R
1.000 UL
LT0
.7111 g 5821 2245 M
-168 3 V
1.000 UL
LT0
.7111 g 5653 2248 M
-223 28 V
1.000 UL
LT0
.7111 g 5430 2276 M
-111 34 V
1.000 UL
LT0
.7111 g 5319 2310 M
187 -5 V
1.000 UL
LT0
.7111 g 5506 2305 M
217 -29 V
1.000 UL
LT0
.7111 g 5723 2276 M
98 -31 V
3806 1385 M
1.000 UL
LT0
.7111 g 3806 1385 M
-69 1 V
1.000 UL
LT0
.7111 g 3737 1386 M
-294 0 V
1.000 UL
LT0
.7111 g 3443 1386 M
-224 27 V
1.000 UL
LT0
.7111 g 3219 1413 M
-150 56 V
1.000 UL
LT0
.7111 g 3069 1469 M
-64 20 V
1.000 UL
LT0
.7111 g 3005 1489 M
111 -2 V
1.000 UL
LT0
.7111 g 3116 1487 M
282 -5 V
1.000 UL
LT0
.7111 g 3398 1482 M
217 -29 V
1.000 UL
LT0
.7111 g 3615 1453 M
152 -55 V
1.000 UL
LT0
.7111 g 3767 1398 M
39 -13 V
3851 621 R
1.000 UL
LT0
.7111 g 7657 2006 M
-287 -3 V
1.000 UL
LT0
.7111 g 7370 2003 M
-57 48 V
1.000 UL
LT0
.7111 g 7313 2051 M
255 30 V
1.000 UL
LT0
.7111 g 7568 2081 M
89 -75 V
6370 1579 M
1.000 UL
LT0
.7111 g 6370 1579 M
-151 -25 V
1.000 UL
LT0
.7111 g 6219 1554 M
20 42 V
1.000 UL
LT0
.7111 g 6239 1596 M
132 49 V
1.000 UL
LT0
.7111 g 6371 1645 M
137 22 V
1.000 UL
LT0
.7111 g 6508 1667 M
-16 -38 V
1.000 UL
LT0
.7111 g 6492 1629 M
-122 -50 V
3759 2579 M
1.000 UL
LT0
.7111 g 3759 2579 M
-217 -11 V
1254 1650 M
1.000 UL
LT0
.7111 g 1254 1650 M
-21 18 V
2687 890 R
1.000 UL
LT0
.7111 g 3920 2558 M
-22 -63 V
1.000 UL
LT0
.7111 g 3898 2495 M
-297 -18 V
1.000 UL
LT0
.7111 g 3601 2477 M
-164 50 V
1601 1605 M
1.000 UL
LT0
.7111 g 1601 1605 M
165 42 V
1.000 UL
LT0
.7111 g 1766 1647 M
22 0 V
1.000 UL
LT0
.7111 g 1788 1647 M
-9 4 V
1.000 UL
LT0
.7111 g 1779 1651 M
-89 75 V
1.000 UL
LT0
.7111 g 1690 1726 M
-1 5 V
1.000 UL
LT0
.7111 g 1689 1731 M
-21 -2 V
1.000 UL
LT0
.7111 g 1668 1729 M
-234 17 V
5557 1181 M
1.000 UL
LT0
.7111 g 5557 1181 M
-159 53 V
1.000 UL
LT0
.7111 g 5398 1234 M
-299 -18 V
1.000 UL
LT0
.7111 g 5099 1216 M
-29 -62 V
394 -9 R
1.000 UL
LT0
.7111 g 5464 1145 M
-213 -14 V
2697 2057 M
1.000 UL
LT0
.6667 g 2697 2057 M
-255 -32 V
1.000 UL
LT0
.6667 g 2442 2025 M
-12 67 V
1.000 UL
LT0
.6667 g 2430 2092 M
135 48 V
1.000 UL
LT0
.6667 g 2565 2140 M
247 29 V
1.000 UL
LT0
.6667 g 2812 2169 M
6 -62 V
1.000 UL
LT0
.6667 g 2818 2107 M
-121 -50 V
3028 200 R
1.000 UL
LT0
.6667 g 5725 2257 M
-46 1 V
1.000 UL
LT0
.6667 g 5679 2258 M
-224 28 V
1.000 UL
LT0
.6667 g 5455 2286 M
-40 12 V
1.000 UL
LT0
.6667 g 5415 2298 M
67 -2 V
1.000 UL
LT0
.6667 g 5482 2296 M
216 -30 V
1.000 UL
LT0
.6667 g 5698 2266 M
27 -9 V
3735 1394 M
1.000 UL
LT0
.6667 g 3735 1394 M
-279 -3 V
1.000 UL
LT0
.6667 g 3456 1391 M
-224 27 V
1.000 UL
LT0
.6667 g 3232 1418 M
-138 59 V
1.000 UL
LT0
.6667 g 3094 1477 M
292 1 V
1.000 UL
LT0
.6667 g 3386 1478 M
216 -30 V
1.000 UL
LT0
.6667 g 3602 1448 M
133 -54 V
3839 623 R
1.000 UL
LT0
.6667 g 7574 2017 M
-174 -2 V
1.000 UL
LT0
.6667 g 7400 2015 M
-34 29 V
1.000 UL
LT0
.6667 g 7366 2044 M
155 18 V
1.000 UL
LT0
.6667 g 7521 2062 M
53 -45 V
6328 1585 M
1.000 UL
LT0
.6667 g 6328 1585 M
-54 -9 V
1.000 UL
LT0
.6667 g 6274 1576 M
8 15 V
1.000 UL
LT0
.6667 g 6282 1591 M
133 48 V
1.000 UL
LT0
.6667 g 6415 1639 M
38 7 V
1.000 UL
LT0
.6667 g 6453 1646 M
-4 -11 V
1.000 UL
LT0
.6667 g 6449 1635 M
-121 -50 V
3794 2575 M
1.000 UL
LT0
.6667 g 3794 2575 M
-271 -14 V
1266 1649 M
1.000 UL
LT0
.6667 g 1266 1649 M
-26 21 V
2643 893 R
1.000 UL
LT0
.6667 g 3883 2563 M
-18 -64 V
1.000 UL
LT0
.6667 g 3865 2499 M
-245 -15 V
1.000 UL
LT0
.6667 g 3620 2484 M
-163 51 V
1589 1607 M
1.000 UL
LT0
.6667 g 1589 1607 M
171 44 V
1.000 UL
LT0
.6667 g 1760 1651 M
-88 73 V
1.000 UL
LT0
.6667 g 1672 1724 M
-245 19 V
5535 1173 M
1.000 UL
LT0
.6667 g 5535 1173 M
-156 53 V
1.000 UL
LT0
.6667 g 5379 1226 M
-246 -14 V
1.000 UL
LT0
.6667 g 5133 1212 M
-28 -62 V
379 3 R
1.000 UL
LT0
.6667 g 5484 1153 M
-266 -18 V
2676 2060 M
1.000 UL
LT0
.6222 g 2676 2060 M
-214 -27 V
1.000 UL
LT0
.6222 g 2462 2033 M
-10 56 V
1.000 UL
LT0
.6222 g 2452 2089 M
136 48 V
1.000 UL
LT0
.6222 g 2588 2137 M
204 24 V
1.000 UL
LT0
.6222 g 2792 2161 M
4 -51 V
1.000 UL
LT0
.6222 g 2796 2110 M
-120 -50 V
3699 1399 M
1.000 UL
LT0
.6222 g 3699 1399 M
-229 -3 V
1.000 UL
LT0
.6222 g 3470 1396 M
-225 27 V
1.000 UL
LT0
.6222 g 3245 1423 M
-117 50 V
1.000 UL
LT0
.6222 g 3128 1473 M
246 0 V
1.000 UL
LT0
.6222 g 3374 1473 M
216 -30 V
1.000 UL
LT0
.6222 g 3590 1443 M
109 -44 V
3793 629 R
1.000 UL
LT0
.6222 g 7492 2028 M
-61 -1 V
1.000 UL
LT0
.6222 g 7431 2027 M
-12 10 V
1.000 UL
LT0
.6222 g 7419 2037 M
54 6 V
1.000 UL
LT0
.6222 g 7473 2043 M
19 -15 V
3830 2570 M
1.000 UL
LT0
.6222 g 3830 2570 M
-326 -17 V
1278 1647 M
1.000 UL
LT0
.6222 g 1278 1647 M
-31 26 V
2599 895 R
1.000 UL
LT0
.6222 g 3846 2568 M
-14 -64 V
1.000 UL
LT0
.6222 g 3832 2504 M
-193 -12 V
1.000 UL
LT0
.6222 g 3639 2492 M
-162 51 V
1576 1608 M
1.000 UL
LT0
.6222 g 1576 1608 M
168 45 V
1.000 UL
LT0
.6222 g 1744 1653 M
-81 68 V
1.000 UL
LT0
.6222 g 1663 1721 M
-243 19 V
5514 1165 M
1.000 UL
LT0
.6222 g 5514 1165 M
-155 54 V
1.000 UL
LT0
.6222 g 5359 1219 M
-193 -11 V
1.000 UL
LT0
.6222 g 5166 1208 M
-27 -63 V
366 16 R
1.000 UL
LT0
.6222 g 5505 1161 M
-320 -22 V
3799 2508 M
1.000 UL
LT0
.5778 g 3799 2508 M
-140 -9 V
1.000 UL
LT0
.5778 g 3659 2499 M
-145 46 V
1.000 UL
LT0
.5778 g 3514 2545 M
295 13 V
1.000 UL
LT0
.5778 g 3809 2558 M
-10 -50 V
2656 2062 M
1.000 UL
LT0
.5778 g 2656 2062 M
-174 -22 V
1.000 UL
LT0
.5778 g 2482 2040 M
-8 46 V
1.000 UL
LT0
.5778 g 2474 2086 M
137 48 V
1.000 UL
LT0
.5778 g 2611 2134 M
160 19 V
1.000 UL
LT0
.5778 g 2771 2153 M
3 -40 V
1.000 UL
LT0
.5778 g 2774 2113 M
-118 -51 V
3663 1403 M
1.000 UL
LT0
.5778 g 3663 1403 M
-180 -2 V
1.000 UL
LT0
.5778 g 3483 1401 M
-226 27 V
1.000 UL
LT0
.5778 g 3257 1428 M
-94 40 V
1.000 UL
LT0
.5778 g 3163 1468 M
199 1 V
1.000 UL
LT0
.5778 g 3362 1469 M
215 -31 V
1.000 UL
LT0
.5778 g 3577 1438 M
86 -35 V
5460 1169 M
1.000 UL
LT0
.5778 g 5460 1169 M
-284 -22 V
1.000 UL
LT0
.5778 g 5176 1147 M
24 56 V
1.000 UL
LT0
.5778 g 5200 1203 M
140 8 V
1.000 UL
LT0
.5778 g 5340 1211 M
120 -42 V
1290 1646 M
1.000 UL
LT0
.5778 g 1290 1646 M
-36 30 V
310 -66 R
1.000 UL
LT0
.5778 g 1564 1610 M
164 45 V
1.000 UL
LT0
.5778 g 1728 1655 M
-74 62 V
1.000 UL
LT0
.5778 g 1654 1717 M
-241 20 V
2353 775 R
1.000 UL
LT0
.5333 g 3766 2512 M
-88 -5 V
1.000 UL
LT0
.5333 g 3678 2507 M
-91 29 V
1.000 UL
LT0
.5333 g 3587 2536 M
185 8 V
1.000 UL
LT0
.5333 g 3772 2544 M
-6 -32 V
2636 2065 M
1.000 UL
LT0
.5333 g 2636 2065 M
-134 -17 V
1.000 UL
LT0
.5333 g 2502 2048 M
-6 35 V
1.000 UL
LT0
.5333 g 2496 2083 M
138 48 V
1.000 UL
LT0
.5333 g 2634 2131 M
116 14 V
1.000 UL
LT0
.5333 g 2750 2145 M
3 -29 V
1.000 UL
LT0
.5333 g 2753 2116 M
-117 -51 V
991 -657 R
1.000 UL
LT0
.5333 g 3627 1408 M
-131 -1 V
1.000 UL
LT0
.5333 g 3496 1407 M
-226 26 V
1.000 UL
LT0
.5333 g 3270 1433 M
-73 31 V
1.000 UL
LT0
.5333 g 3197 1464 M
153 0 V
1.000 UL
LT0
.5333 g 3350 1464 M
215 -31 V
1.000 UL
LT0
.5333 g 3565 1433 M
62 -25 V
5396 1178 M
1.000 UL
LT0
.5333 g 5396 1178 M
-178 -14 V
1.000 UL
LT0
.5333 g 5218 1164 M
15 35 V
1.000 UL
LT0
.5333 g 5233 1199 M
88 5 V
1.000 UL
LT0
.5333 g 5321 1204 M
75 -26 V
1302 1644 M
1.000 UL
LT0
.5333 g 1302 1644 M
-41 34 V
291 -66 R
1.000 UL
LT0
.5333 g 1552 1612 M
160 45 V
1.000 UL
LT0
.5333 g 1712 1657 M
-67 57 V
1.000 UL
LT0
.5333 g 1645 1714 M
-239 21 V
2327 782 R
1.000 UL
LT0
.4889 g 3733 2517 M
-36 -3 V
1.000 UL
LT0
.4889 g 3697 2514 M
-36 12 V
1.000 UL
LT0
.4889 g 3661 2526 M
74 3 V
1.000 UL
LT0
.4889 g 3735 2529 M
-2 -12 V
2615 2068 M
1.000 UL
LT0
.4889 g 2615 2068 M
-93 -12 V
1.000 UL
LT0
.4889 g 2522 2056 M
-4 24 V
1.000 UL
LT0
.4889 g 2518 2080 M
139 48 V
1.000 UL
LT0
.4889 g 2657 2128 M
72 9 V
1.000 UL
LT0
.4889 g 2729 2137 M
2 -18 V
1.000 UL
LT0
.4889 g 2731 2119 M
-116 -51 V
976 -655 R
1.000 UL
LT0
.4889 g 3591 1413 M
-82 -1 V
1.000 UL
LT0
.4889 g 3509 1412 M
-227 26 V
1.000 UL
LT0
.4889 g 3282 1438 M
-50 21 V
1.000 UL
LT0
.4889 g 3232 1459 M
107 0 V
1.000 UL
LT0
.4889 g 3339 1459 M
213 -31 V
1.000 UL
LT0
.4889 g 3552 1428 M
39 -15 V
5333 1186 M
1.000 UL
LT0
.4889 g 5333 1186 M
-72 -6 V
1.000 UL
LT0
.4889 g 5261 1180 M
6 15 V
1.000 UL
LT0
.4889 g 5267 1195 M
35 2 V
1.000 UL
LT0
.4889 g 5302 1197 M
31 -11 V
1314 1643 M
1.000 UL
LT0
.4889 g 1314 1643 M
-46 38 V
272 -68 R
1.000 UL
LT0
.4889 g 1540 1613 M
156 46 V
1.000 UL
LT0
.4889 g 1696 1659 M
-60 51 V
1.000 UL
LT0
.4889 g 1636 1710 M
-238 22 V
1197 338 R
1.000 UL
LT0
.4444 g 2595 2070 M
-53 -6 V
1.000 UL
LT0
.4444 g 2542 2064 M
-2 14 V
1.000 UL
LT0
.4444 g 2540 2078 M
140 47 V
1.000 UL
LT0
.4444 g 2680 2125 M
29 4 V
1.000 UL
LT0
.4444 g 2709 2129 M
0 -8 V
1.000 UL
LT0
.4444 g 2709 2121 M
-114 -51 V
960 -653 R
1.000 UL
LT0
.4444 g 3555 1417 M
-32 0 V
1.000 UL
LT0
.4444 g 3523 1417 M
-228 25 V
1.000 UL
LT0
.4444 g 3295 1442 M
-29 13 V
1.000 UL
LT0
.4444 g 3266 1455 M
61 0 V
1.000 UL
LT0
.4444 g 3327 1455 M
213 -31 V
1.000 UL
LT0
.4444 g 3540 1424 M
15 -7 V
1326 1641 M
1.000 UL
LT0
.4444 g 1326 1641 M
-51 43 V
252 -69 R
1.000 UL
LT0
.4444 g 1527 1615 M
154 46 V
1.000 UL
LT0
.4444 g 1681 1661 M
-55 45 V
1.000 UL
LT0
.4444 g 1626 1706 M
-235 23 V
1183 344 R
1.000 UL
LT0
.4 g 2574 2073 M
-12 -2 V
1.000 UL
LT0
.4 g 2562 2071 M
-1 4 V
1.000 UL
LT0
.4 g 2561 2075 M
67 22 V
1.000 UL
LT0
.4 g 2628 2097 M
-54 -24 V
842 -638 R
1.000 UL
LT0
.4 g 3416 1435 M
-108 12 V
1.000 UL
LT0
.4 g 3308 1447 M
-7 3 V
1.000 UL
LT0
.4 g 3301 1450 M
14 0 V
1.000 UL
LT0
.4 g 3315 1450 M
101 -15 V
1338 1639 M
1.000 UL
LT0
.4 g 1338 1639 M
-56 48 V
233 -71 R
1.000 UL
LT0
.4 g 1515 1616 M
150 47 V
1.000 UL
LT0
.4 g 1665 1663 M
-48 40 V
1.000 UL
LT0
.4 g 1617 1703 M
-233 23 V
-34 -88 R
1.000 UL
LT0
.3556 g 1350 1638 M
-61 51 V
214 -71 R
1.000 UL
LT0
.3556 g 1503 1618 M
146 47 V
1.000 UL
LT0
.3556 g 1649 1665 M
-41 34 V
1.000 UL
LT0
.3556 g 1608 1699 M
-231 25 V
-15 -88 R
1.000 UL
LT0
.3111 g 1362 1636 M
-66 56 V
194 -72 R
1.000 UL
LT0
.3111 g 1490 1620 M
143 47 V
1.000 UL
LT0
.3111 g 1633 1667 M
-34 29 V
1.000 UL
LT0
.3111 g 1599 1696 M
-229 25 V
4 -86 R
1.000 UL
LT0
.2667 g 1374 1635 M
-71 60 V
175 -74 R
1.000 UL
LT0
.2667 g 1478 1621 M
139 48 V
1.000 UL
LT0
.2667 g 1617 1669 M
-27 23 V
1.000 UL
LT0
.2667 g 1590 1692 M
-227 26 V
23 -85 R
1.000 UL
LT0
.2222 g 1386 1633 M
-76 64 V
156 -74 R
1.000 UL
LT0
.2222 g 1466 1623 M
136 48 V
1.000 UL
LT0
.2222 g 1602 1671 M
-21 18 V
1.000 UL
LT0
.2222 g 1581 1689 M
-225 26 V
42 -83 R
1.000 UL
LT0
.1778 g 1398 1632 M
-81 68 V
136 -75 R
1.000 UL
LT0
.1778 g 1453 1625 M
133 48 V
1.000 UL
LT0
.1778 g 1586 1673 M
-14 12 V
1.000 UL
LT0
.1778 g 1572 1685 M
-223 27 V
61 -82 R
1.000 UL
LT0
.1333 g 1410 1630 M
-86 73 V
117 -77 R
1.000 UL
LT0
.1333 g 1441 1626 M
129 49 V
1.000 UL
LT0
.1333 g 1570 1675 M
-7 7 V
1.000 UL
LT0
.1333 g 1563 1682 M
-222 28 V
82 -82 R
1.000 UL
LT0
.0889 g 1423 1628 M
-92 78 V
98 -78 R
1.000 UL
LT0
.0889 g 1429 1628 M
125 49 V
1.000 UL
LT0
.0889 g 1554 1677 M
-1 1 V
1.000 UL
LT0
.0889 g 1553 1678 M
-219 29 V
1.000 UL
LTb
7794 2054 M
5382 1113 L
1.000 UL
LTb
1206 1657 M
5382 1113 L
1.000 UL
LTb
5382 1113 M
0 3096 V
LTb
2692 1150 M
[ [(Helvetica) 180.0 0.0 true true 0 (x)]
] -60.0 MCshow
LTb
7633 1448 M
[ [(Helvetica) 180.0 0.0 true true 0 (y)]
] -60.0 MCshow
LTb
1205 5836 M
[ [(Helvetica) 180.0 0.0 true true 0 (Erreur)]
] -60.0 MCshow
1.000 UP
grestore % colour palette end
stroke
grestore
end
showpage
%%Trailer
%%DocumentFonts: Times-Roman Helvetica
