%!PS-Adobe-2.0 EPSF-2.0
%%Title: result_rbf_bdd_sin_1d.eps
%%Creator: gnuplot 4.0 patchlevel 0
%%CreationDate: Fri Sep  5 16:29:27 2008
%%DocumentFonts: (atend)
%%BoundingBox: 50 50 500 402
%%Orientation: Portrait
%%EndComments
/gnudict 256 dict def
gnudict begin
/Color true def
/Solid false def
/gnulinewidth 5.000 def
/userlinewidth gnulinewidth def
/vshift -60 def
/dl {10.0 mul} def
/hpt_ 31.5 def
/vpt_ 31.5 def
/hpt hpt_ def
/vpt vpt_ def
/Rounded false def
/M {moveto} bind def
/L {lineto} bind def
/R {rmoveto} bind def
/V {rlineto} bind def
/N {newpath moveto} bind def
/C {setrgbcolor} bind def
/f {rlineto fill} bind def
/vpt2 vpt 2 mul def
/hpt2 hpt 2 mul def
/Lshow { currentpoint stroke M
  0 vshift R show } def
/Rshow { currentpoint stroke M
  dup stringwidth pop neg vshift R show } def
/Cshow { currentpoint stroke M
  dup stringwidth pop -2 div vshift R show } def
/UP { dup vpt_ mul /vpt exch def hpt_ mul /hpt exch def
  /hpt2 hpt 2 mul def /vpt2 vpt 2 mul def } def
/DL { Color {setrgbcolor Solid {pop []} if 0 setdash }
 {pop pop pop 0 setgray Solid {pop []} if 0 setdash} ifelse } def
/BL { stroke userlinewidth 2 mul setlinewidth
      Rounded { 1 setlinejoin 1 setlinecap } if } def
/AL { stroke userlinewidth 2 div setlinewidth
      Rounded { 1 setlinejoin 1 setlinecap } if } def
/UL { dup gnulinewidth mul /userlinewidth exch def
      dup 1 lt {pop 1} if 10 mul /udl exch def } def
/PL { stroke userlinewidth setlinewidth
      Rounded { 1 setlinejoin 1 setlinecap } if } def
/LTw { PL [] 1 setgray } def
/LTb { BL [] 0 0 0 DL } def
/LTa { AL [1 udl mul 2 udl mul] 0 setdash 0 0 0 setrgbcolor } def
/LT0 { PL [] 1 0 0 DL } def
/LT1 { PL [4 dl 2 dl] 0 1 0 DL } def
/LT2 { PL [2 dl 3 dl] 0 0 1 DL } def
/LT3 { PL [1 dl 1.5 dl] 1 0 1 DL } def
/LT4 { PL [5 dl 2 dl 1 dl 2 dl] 0 1 1 DL } def
/LT5 { PL [4 dl 3 dl 1 dl 3 dl] 1 1 0 DL } def
/LT6 { PL [2 dl 2 dl 2 dl 4 dl] 0 0 0 DL } def
/LT7 { PL [2 dl 2 dl 2 dl 2 dl 2 dl 4 dl] 1 0.3 0 DL } def
/LT8 { PL [2 dl 2 dl 2 dl 2 dl 2 dl 2 dl 2 dl 4 dl] 0.5 0.5 0.5 DL } def
/Pnt { stroke [] 0 setdash
   gsave 1 setlinecap M 0 0 V stroke grestore } def
/Dia { stroke [] 0 setdash 2 copy vpt add M
  hpt neg vpt neg V hpt vpt neg V
  hpt vpt V hpt neg vpt V closepath stroke
  Pnt } def
/Pls { stroke [] 0 setdash vpt sub M 0 vpt2 V
  currentpoint stroke M
  hpt neg vpt neg R hpt2 0 V stroke
  } def
/Box { stroke [] 0 setdash 2 copy exch hpt sub exch vpt add M
  0 vpt2 neg V hpt2 0 V 0 vpt2 V
  hpt2 neg 0 V closepath stroke
  Pnt } def
/Crs { stroke [] 0 setdash exch hpt sub exch vpt add M
  hpt2 vpt2 neg V currentpoint stroke M
  hpt2 neg 0 R hpt2 vpt2 V stroke } def
/TriU { stroke [] 0 setdash 2 copy vpt 1.12 mul add M
  hpt neg vpt -1.62 mul V
  hpt 2 mul 0 V
  hpt neg vpt 1.62 mul V closepath stroke
  Pnt  } def
/Star { 2 copy Pls Crs } def
/BoxF { stroke [] 0 setdash exch hpt sub exch vpt add M
  0 vpt2 neg V  hpt2 0 V  0 vpt2 V
  hpt2 neg 0 V  closepath fill } def
/TriUF { stroke [] 0 setdash vpt 1.12 mul add M
  hpt neg vpt -1.62 mul V
  hpt 2 mul 0 V
  hpt neg vpt 1.62 mul V closepath fill } def
/TriD { stroke [] 0 setdash 2 copy vpt 1.12 mul sub M
  hpt neg vpt 1.62 mul V
  hpt 2 mul 0 V
  hpt neg vpt -1.62 mul V closepath stroke
  Pnt  } def
/TriDF { stroke [] 0 setdash vpt 1.12 mul sub M
  hpt neg vpt 1.62 mul V
  hpt 2 mul 0 V
  hpt neg vpt -1.62 mul V closepath fill} def
/DiaF { stroke [] 0 setdash vpt add M
  hpt neg vpt neg V hpt vpt neg V
  hpt vpt V hpt neg vpt V closepath fill } def
/Pent { stroke [] 0 setdash 2 copy gsave
  translate 0 hpt M 4 {72 rotate 0 hpt L} repeat
  closepath stroke grestore Pnt } def
/PentF { stroke [] 0 setdash gsave
  translate 0 hpt M 4 {72 rotate 0 hpt L} repeat
  closepath fill grestore } def
/Circle { stroke [] 0 setdash 2 copy
  hpt 0 360 arc stroke Pnt } def
/CircleF { stroke [] 0 setdash hpt 0 360 arc fill } def
/C0 { BL [] 0 setdash 2 copy moveto vpt 90 450  arc } bind def
/C1 { BL [] 0 setdash 2 copy        moveto
       2 copy  vpt 0 90 arc closepath fill
               vpt 0 360 arc closepath } bind def
/C2 { BL [] 0 setdash 2 copy moveto
       2 copy  vpt 90 180 arc closepath fill
               vpt 0 360 arc closepath } bind def
/C3 { BL [] 0 setdash 2 copy moveto
       2 copy  vpt 0 180 arc closepath fill
               vpt 0 360 arc closepath } bind def
/C4 { BL [] 0 setdash 2 copy moveto
       2 copy  vpt 180 270 arc closepath fill
               vpt 0 360 arc closepath } bind def
/C5 { BL [] 0 setdash 2 copy moveto
       2 copy  vpt 0 90 arc
       2 copy moveto
       2 copy  vpt 180 270 arc closepath fill
               vpt 0 360 arc } bind def
/C6 { BL [] 0 setdash 2 copy moveto
      2 copy  vpt 90 270 arc closepath fill
              vpt 0 360 arc closepath } bind def
/C7 { BL [] 0 setdash 2 copy moveto
      2 copy  vpt 0 270 arc closepath fill
              vpt 0 360 arc closepath } bind def
/C8 { BL [] 0 setdash 2 copy moveto
      2 copy vpt 270 360 arc closepath fill
              vpt 0 360 arc closepath } bind def
/C9 { BL [] 0 setdash 2 copy moveto
      2 copy  vpt 270 450 arc closepath fill
              vpt 0 360 arc closepath } bind def
/C10 { BL [] 0 setdash 2 copy 2 copy moveto vpt 270 360 arc closepath fill
       2 copy moveto
       2 copy vpt 90 180 arc closepath fill
               vpt 0 360 arc closepath } bind def
/C11 { BL [] 0 setdash 2 copy moveto
       2 copy  vpt 0 180 arc closepath fill
       2 copy moveto
       2 copy  vpt 270 360 arc closepath fill
               vpt 0 360 arc closepath } bind def
/C12 { BL [] 0 setdash 2 copy moveto
       2 copy  vpt 180 360 arc closepath fill
               vpt 0 360 arc closepath } bind def
/C13 { BL [] 0 setdash  2 copy moveto
       2 copy  vpt 0 90 arc closepath fill
       2 copy moveto
       2 copy  vpt 180 360 arc closepath fill
               vpt 0 360 arc closepath } bind def
/C14 { BL [] 0 setdash 2 copy moveto
       2 copy  vpt 90 360 arc closepath fill
               vpt 0 360 arc } bind def
/C15 { BL [] 0 setdash 2 copy vpt 0 360 arc closepath fill
               vpt 0 360 arc closepath } bind def
/Rec   { newpath 4 2 roll moveto 1 index 0 rlineto 0 exch rlineto
       neg 0 rlineto closepath } bind def
/Square { dup Rec } bind def
/Bsquare { vpt sub exch vpt sub exch vpt2 Square } bind def
/S0 { BL [] 0 setdash 2 copy moveto 0 vpt rlineto BL Bsquare } bind def
/S1 { BL [] 0 setdash 2 copy vpt Square fill Bsquare } bind def
/S2 { BL [] 0 setdash 2 copy exch vpt sub exch vpt Square fill Bsquare } bind def
/S3 { BL [] 0 setdash 2 copy exch vpt sub exch vpt2 vpt Rec fill Bsquare } bind def
/S4 { BL [] 0 setdash 2 copy exch vpt sub exch vpt sub vpt Square fill Bsquare } bind def
/S5 { BL [] 0 setdash 2 copy 2 copy vpt Square fill
       exch vpt sub exch vpt sub vpt Square fill Bsquare } bind def
/S6 { BL [] 0 setdash 2 copy exch vpt sub exch vpt sub vpt vpt2 Rec fill Bsquare } bind def
/S7 { BL [] 0 setdash 2 copy exch vpt sub exch vpt sub vpt vpt2 Rec fill
       2 copy vpt Square fill
       Bsquare } bind def
/S8 { BL [] 0 setdash 2 copy vpt sub vpt Square fill Bsquare } bind def
/S9 { BL [] 0 setdash 2 copy vpt sub vpt vpt2 Rec fill Bsquare } bind def
/S10 { BL [] 0 setdash 2 copy vpt sub vpt Square fill 2 copy exch vpt sub exch vpt Square fill
       Bsquare } bind def
/S11 { BL [] 0 setdash 2 copy vpt sub vpt Square fill 2 copy exch vpt sub exch vpt2 vpt Rec fill
       Bsquare } bind def
/S12 { BL [] 0 setdash 2 copy exch vpt sub exch vpt sub vpt2 vpt Rec fill Bsquare } bind def
/S13 { BL [] 0 setdash 2 copy exch vpt sub exch vpt sub vpt2 vpt Rec fill
       2 copy vpt Square fill Bsquare } bind def
/S14 { BL [] 0 setdash 2 copy exch vpt sub exch vpt sub vpt2 vpt Rec fill
       2 copy exch vpt sub exch vpt Square fill Bsquare } bind def
/S15 { BL [] 0 setdash 2 copy Bsquare fill Bsquare } bind def
/D0 { gsave translate 45 rotate 0 0 S0 stroke grestore } bind def
/D1 { gsave translate 45 rotate 0 0 S1 stroke grestore } bind def
/D2 { gsave translate 45 rotate 0 0 S2 stroke grestore } bind def
/D3 { gsave translate 45 rotate 0 0 S3 stroke grestore } bind def
/D4 { gsave translate 45 rotate 0 0 S4 stroke grestore } bind def
/D5 { gsave translate 45 rotate 0 0 S5 stroke grestore } bind def
/D6 { gsave translate 45 rotate 0 0 S6 stroke grestore } bind def
/D7 { gsave translate 45 rotate 0 0 S7 stroke grestore } bind def
/D8 { gsave translate 45 rotate 0 0 S8 stroke grestore } bind def
/D9 { gsave translate 45 rotate 0 0 S9 stroke grestore } bind def
/D10 { gsave translate 45 rotate 0 0 S10 stroke grestore } bind def
/D11 { gsave translate 45 rotate 0 0 S11 stroke grestore } bind def
/D12 { gsave translate 45 rotate 0 0 S12 stroke grestore } bind def
/D13 { gsave translate 45 rotate 0 0 S13 stroke grestore } bind def
/D14 { gsave translate 45 rotate 0 0 S14 stroke grestore } bind def
/D15 { gsave translate 45 rotate 0 0 S15 stroke grestore } bind def
/DiaE { stroke [] 0 setdash vpt add M
  hpt neg vpt neg V hpt vpt neg V
  hpt vpt V hpt neg vpt V closepath stroke } def
/BoxE { stroke [] 0 setdash exch hpt sub exch vpt add M
  0 vpt2 neg V hpt2 0 V 0 vpt2 V
  hpt2 neg 0 V closepath stroke } def
/TriUE { stroke [] 0 setdash vpt 1.12 mul add M
  hpt neg vpt -1.62 mul V
  hpt 2 mul 0 V
  hpt neg vpt 1.62 mul V closepath stroke } def
/TriDE { stroke [] 0 setdash vpt 1.12 mul sub M
  hpt neg vpt 1.62 mul V
  hpt 2 mul 0 V
  hpt neg vpt -1.62 mul V closepath stroke } def
/PentE { stroke [] 0 setdash gsave
  translate 0 hpt M 4 {72 rotate 0 hpt L} repeat
  closepath stroke grestore } def
/CircE { stroke [] 0 setdash 
  hpt 0 360 arc stroke } def
/Opaque { gsave closepath 1 setgray fill grestore 0 setgray closepath } def
/DiaW { stroke [] 0 setdash vpt add M
  hpt neg vpt neg V hpt vpt neg V
  hpt vpt V hpt neg vpt V Opaque stroke } def
/BoxW { stroke [] 0 setdash exch hpt sub exch vpt add M
  0 vpt2 neg V hpt2 0 V 0 vpt2 V
  hpt2 neg 0 V Opaque stroke } def
/TriUW { stroke [] 0 setdash vpt 1.12 mul add M
  hpt neg vpt -1.62 mul V
  hpt 2 mul 0 V
  hpt neg vpt 1.62 mul V Opaque stroke } def
/TriDW { stroke [] 0 setdash vpt 1.12 mul sub M
  hpt neg vpt 1.62 mul V
  hpt 2 mul 0 V
  hpt neg vpt -1.62 mul V Opaque stroke } def
/PentW { stroke [] 0 setdash gsave
  translate 0 hpt M 4 {72 rotate 0 hpt L} repeat
  Opaque stroke grestore } def
/CircW { stroke [] 0 setdash 
  hpt 0 360 arc Opaque stroke } def
/BoxFill { gsave Rec 1 setgray fill grestore } def
/BoxColFill {
  gsave Rec
  /Fillden exch def
  currentrgbcolor
  /ColB exch def /ColG exch def /ColR exch def
  /ColR ColR Fillden mul Fillden sub 1 add def
  /ColG ColG Fillden mul Fillden sub 1 add def
  /ColB ColB Fillden mul Fillden sub 1 add def
  ColR ColG ColB setrgbcolor
  fill grestore } def
%
% PostScript Level 1 Pattern Fill routine
% Usage: x y w h s a XX PatternFill
%	x,y = lower left corner of box to be filled
%	w,h = width and height of box
%	  a = angle in degrees between lines and x-axis
%	 XX = 0/1 for no/yes cross-hatch
%
/PatternFill { gsave /PFa [ 9 2 roll ] def
    PFa 0 get PFa 2 get 2 div add PFa 1 get PFa 3 get 2 div add translate
    PFa 2 get -2 div PFa 3 get -2 div PFa 2 get PFa 3 get Rec
    gsave 1 setgray fill grestore clip
    currentlinewidth 0.5 mul setlinewidth
    /PFs PFa 2 get dup mul PFa 3 get dup mul add sqrt def
    0 0 M PFa 5 get rotate PFs -2 div dup translate
	0 1 PFs PFa 4 get div 1 add floor cvi
	{ PFa 4 get mul 0 M 0 PFs V } for
    0 PFa 6 get ne {
	0 1 PFs PFa 4 get div 1 add floor cvi
	{ PFa 4 get mul 0 2 1 roll M PFs 0 V } for
    } if
    stroke grestore } def
%
/Symbol-Oblique /Symbol findfont [1 0 .167 1 0 0] makefont
dup length dict begin {1 index /FID eq {pop pop} {def} ifelse} forall
currentdict end definefont pop
/MFshow {
   { dup 5 get 3 ge
     { 5 get 3 eq {gsave} {grestore} ifelse }
     {dup dup 0 get findfont exch 1 get scalefont setfont
     [ currentpoint ] exch dup 2 get 0 exch R dup 5 get 2 ne {dup dup 6
     get exch 4 get {show} {stringwidth pop 0 R} ifelse }if dup 5 get 0 eq
     {dup 3 get {2 get neg 0 exch R pop} {pop aload pop M} ifelse} {dup 5
     get 1 eq {dup 2 get exch dup 3 get exch 6 get stringwidth pop -2 div
     dup 0 R} {dup 6 get stringwidth pop -2 div 0 R 6 get
     show 2 index {aload pop M neg 3 -1 roll neg R pop pop} {pop pop pop
     pop aload pop M} ifelse }ifelse }ifelse }
     ifelse }
   forall} bind def
/MFwidth {0 exch {dup 3 get{dup dup 0 get findfont exch 1 get scalefont
     setfont 6 get stringwidth pop add} {pop} ifelse} forall} bind def
/MLshow { currentpoint stroke M
  0 exch R MFshow } bind def
/MRshow { currentpoint stroke M
  exch dup MFwidth neg 3 -1 roll R MFshow } def
/MCshow { currentpoint stroke M
  exch dup MFwidth -2 div 3 -1 roll R MFshow } def
end
%%EndProlog
gnudict begin
gsave
50 50 translate
0.050 0.050 scale
0 setgray
newpath
(Helvetica) findfont 180 scalefont setfont
1.000 UL
LTb
918 540 M
63 0 V
7713 0 R
-63 0 V
stroke
810 540 M
[ [(Helvetica) 180.0 0.0 true true 0 (-1.5)]
] -60.0 MRshow
1.000 UL
LTb
918 1590 M
63 0 V
7713 0 R
-63 0 V
stroke
810 1590 M
[ [(Helvetica) 180.0 0.0 true true 0 (-1)]
] -60.0 MRshow
1.000 UL
LTb
918 2640 M
63 0 V
7713 0 R
-63 0 V
stroke
810 2640 M
[ [(Helvetica) 180.0 0.0 true true 0 (-0.5)]
] -60.0 MRshow
1.000 UL
LTb
918 3690 M
63 0 V
7713 0 R
-63 0 V
stroke
810 3690 M
[ [(Helvetica) 180.0 0.0 true true 0 ( 0)]
] -60.0 MRshow
1.000 UL
LTb
918 4740 M
63 0 V
7713 0 R
-63 0 V
stroke
810 4740 M
[ [(Helvetica) 180.0 0.0 true true 0 ( 0.5)]
] -60.0 MRshow
1.000 UL
LTb
918 5790 M
63 0 V
7713 0 R
-63 0 V
stroke
810 5790 M
[ [(Helvetica) 180.0 0.0 true true 0 ( 1)]
] -60.0 MRshow
1.000 UL
LTb
918 6840 M
63 0 V
7713 0 R
-63 0 V
stroke
810 6840 M
[ [(Helvetica) 180.0 0.0 true true 0 ( 1.5)]
] -60.0 MRshow
1.000 UL
LTb
918 540 M
0 63 V
0 6237 R
0 -63 V
stroke
918 360 M
[ [(Helvetica) 180.0 0.0 true true 0 ( 0)]
] -60.0 MCshow
1.000 UL
LTb
1696 540 M
0 63 V
0 6237 R
0 -63 V
stroke
1696 360 M
[ [(Helvetica) 180.0 0.0 true true 0 ( 0.2)]
] -60.0 MCshow
1.000 UL
LTb
2473 540 M
0 63 V
0 6237 R
0 -63 V
stroke
2473 360 M
[ [(Helvetica) 180.0 0.0 true true 0 ( 0.4)]
] -60.0 MCshow
1.000 UL
LTb
3251 540 M
0 63 V
0 6237 R
0 -63 V
stroke
3251 360 M
[ [(Helvetica) 180.0 0.0 true true 0 ( 0.6)]
] -60.0 MCshow
1.000 UL
LTb
4028 540 M
0 63 V
0 6237 R
0 -63 V
stroke
4028 360 M
[ [(Helvetica) 180.0 0.0 true true 0 ( 0.8)]
] -60.0 MCshow
1.000 UL
LTb
4806 540 M
0 63 V
0 6237 R
0 -63 V
stroke
4806 360 M
[ [(Helvetica) 180.0 0.0 true true 0 ( 1)]
] -60.0 MCshow
1.000 UL
LTb
5584 540 M
0 63 V
0 6237 R
0 -63 V
stroke
5584 360 M
[ [(Helvetica) 180.0 0.0 true true 0 ( 1.2)]
] -60.0 MCshow
1.000 UL
LTb
6361 540 M
0 63 V
0 6237 R
0 -63 V
stroke
6361 360 M
[ [(Helvetica) 180.0 0.0 true true 0 ( 1.4)]
] -60.0 MCshow
1.000 UL
LTb
7139 540 M
0 63 V
0 6237 R
0 -63 V
stroke
7139 360 M
[ [(Helvetica) 180.0 0.0 true true 0 ( 1.6)]
] -60.0 MCshow
1.000 UL
LTb
7916 540 M
0 63 V
0 6237 R
0 -63 V
stroke
7916 360 M
[ [(Helvetica) 180.0 0.0 true true 0 ( 1.8)]
] -60.0 MCshow
1.000 UL
LTb
8694 540 M
0 63 V
0 6237 R
0 -63 V
stroke
8694 360 M
[ [(Helvetica) 180.0 0.0 true true 0 ( 2)]
] -60.0 MCshow
1.000 UL
LTb
1.000 UL
LTb
918 540 M
7776 0 V
0 6300 V
-7776 0 V
918 540 L
LTb
180 3690 M
currentpoint gsave translate 90 rotate 0 0 moveto
[ [(Helvetica) 180.0 0.0 true true 0 (f\(x\))]
] -60.0 MCshow
grestore
LTb
4806 90 M
[ [(Helvetica) 180.0 0.0 true true 0 (x)]
] -60.0 MCshow
LTb
4806 6210 M
[ [(Times-Roman) 300.0 0.0 true true 0 (Evaluation de f\(x\) par rbf)]
] -100.0 MCshow
1.000 UP
1.000 UL
LT0
LTb
7875 6687 M
[ [(Helvetica) 180.0 0.0 true true 0 (fonction exacte)]
] -60.0 MRshow
LT0
7983 6687 M
495 0 V
918 3690 M
79 266 V
78 261 V
79 253 V
78 241 V
79 224 V
78 204 V
79 181 V
78 154 V
79 126 V
78 95 V
79 63 V
79 30 V
78 -5 V
79 -38 V
78 -70 V
79 -103 V
78 -134 V
79 -161 V
78 -187 V
79 -209 V
78 -229 V
79 -244 V
79 -255 V
78 -263 V
79 -267 V
78 -265 V
79 -260 V
78 -250 V
79 -237 V
78 -219 V
79 -199 V
78 -174 V
79 -148 V
79 -118 V
78 -87 V
79 -55 V
78 -21 V
79 13 V
78 46 V
79 79 V
78 111 V
79 140 V
78 168 V
79 193 V
79 215 V
78 232 V
79 248 V
78 258 V
79 264 V
78 266 V
79 264 V
78 258 V
79 248 V
78 232 V
79 215 V
79 193 V
78 168 V
79 140 V
78 111 V
79 79 V
78 46 V
79 13 V
78 -21 V
79 -55 V
78 -87 V
79 -118 V
79 -148 V
78 -174 V
79 -199 V
78 -219 V
79 -237 V
78 -250 V
79 -260 V
78 -265 V
79 -267 V
78 -263 V
79 -255 V
79 -244 V
78 -229 V
79 -209 V
78 -187 V
79 -161 V
78 -134 V
79 -103 V
78 -70 V
79 -38 V
78 -5 V
79 30 V
79 63 V
78 95 V
79 126 V
78 154 V
79 181 V
78 204 V
79 224 V
78 241 V
79 253 V
78 261 V
79 266 V
1.000 UP
1.000 UL
LTb
LTb
7875 6507 M
[ [(Helvetica) 180.0 0.0 true true 0 (valeur predite)]
] -60.0 MRshow
LTb
918 3690 Pls
997 3952 Pls
1075 4212 Pls
1154 4464 Pls
1232 4705 Pls
1311 4930 Pls
1389 5135 Pls
1468 5316 Pls
1546 5472 Pls
1625 5599 Pls
1703 5695 Pls
1782 5758 Pls
1861 5788 Pls
1939 5784 Pls
2018 5746 Pls
2096 5676 Pls
2175 5573 Pls
2253 5439 Pls
2332 5278 Pls
2410 5091 Pls
2489 4881 Pls
2567 4652 Pls
2646 4408 Pls
2725 4153 Pls
2803 3889 Pls
2882 3623 Pls
2960 3358 Pls
3039 3098 Pls
3117 2848 Pls
3196 2611 Pls
3274 2392 Pls
3353 2193 Pls
3431 2019 Pls
3510 1871 Pls
3589 1753 Pls
3667 1666 Pls
3746 1611 Pls
3824 1590 Pls
3903 1603 Pls
3981 1649 Pls
4060 1728 Pls
4138 1839 Pls
4217 1979 Pls
4295 2147 Pls
4374 2340 Pls
4453 2555 Pls
4531 2787 Pls
4610 3035 Pls
4688 3293 Pls
4767 3557 Pls
4845 3823 Pls
4924 4087 Pls
5002 4345 Pls
5081 4593 Pls
5159 4825 Pls
5238 5040 Pls
5317 5233 Pls
5395 5401 Pls
5474 5541 Pls
5552 5652 Pls
5631 5731 Pls
5709 5777 Pls
5788 5790 Pls
5866 5769 Pls
5945 5714 Pls
6023 5627 Pls
6102 5509 Pls
6181 5361 Pls
6259 5187 Pls
6338 4988 Pls
6416 4769 Pls
6495 4532 Pls
6573 4282 Pls
6652 4022 Pls
6730 3757 Pls
6809 3491 Pls
6887 3227 Pls
6966 2972 Pls
7045 2728 Pls
7123 2499 Pls
7202 2289 Pls
7280 2102 Pls
7359 1941 Pls
7437 1807 Pls
7516 1704 Pls
7594 1633 Pls
7673 1596 Pls
7751 1592 Pls
7830 1622 Pls
7909 1685 Pls
7987 1781 Pls
8066 1908 Pls
8144 2064 Pls
8223 2246 Pls
8301 2451 Pls
8380 2675 Pls
8458 2916 Pls
8537 3168 Pls
8615 3428 Pls
8694 3690 Pls
8230 6507 Pls
1.000 UL
LTb
918 540 M
7776 0 V
0 6300 V
-7776 0 V
918 540 L
1.000 UP
stroke
grestore
end
showpage
%%Trailer
%%DocumentFonts: Times-Roman Helvetica
