%!PS-Adobe-2.0 EPSF-2.0
%%Title: erreur_rbf_rast_2d.eps
%%Creator: gnuplot 4.0 patchlevel 0
%%CreationDate: Fri Sep  5 17:46:52 2008
%%DocumentFonts: (atend)
%%BoundingBox: 50 50 500 402
%%Orientation: Portrait
%%EndComments
/gnudict 256 dict def
gnudict begin
/Color true def
/Solid false def
/gnulinewidth 5.000 def
/userlinewidth gnulinewidth def
/vshift -60 def
/dl {10.0 mul} def
/hpt_ 31.5 def
/vpt_ 31.5 def
/hpt hpt_ def
/vpt vpt_ def
/Rounded false def
/M {moveto} bind def
/L {lineto} bind def
/R {rmoveto} bind def
/V {rlineto} bind def
/N {newpath moveto} bind def
/C {setrgbcolor} bind def
/f {rlineto fill} bind def
/vpt2 vpt 2 mul def
/hpt2 hpt 2 mul def
/Lshow { currentpoint stroke M
  0 vshift R show } def
/Rshow { currentpoint stroke M
  dup stringwidth pop neg vshift R show } def
/Cshow { currentpoint stroke M
  dup stringwidth pop -2 div vshift R show } def
/UP { dup vpt_ mul /vpt exch def hpt_ mul /hpt exch def
  /hpt2 hpt 2 mul def /vpt2 vpt 2 mul def } def
/DL { Color {setrgbcolor Solid {pop []} if 0 setdash }
 {pop pop pop 0 setgray Solid {pop []} if 0 setdash} ifelse } def
/BL { stroke userlinewidth 2 mul setlinewidth
      Rounded { 1 setlinejoin 1 setlinecap } if } def
/AL { stroke userlinewidth 2 div setlinewidth
      Rounded { 1 setlinejoin 1 setlinecap } if } def
/UL { dup gnulinewidth mul /userlinewidth exch def
      dup 1 lt {pop 1} if 10 mul /udl exch def } def
/PL { stroke userlinewidth setlinewidth
      Rounded { 1 setlinejoin 1 setlinecap } if } def
/LTw { PL [] 1 setgray } def
/LTb { BL [] 0 0 0 DL } def
/LTa { AL [1 udl mul 2 udl mul] 0 setdash 0 0 0 setrgbcolor } def
/LT0 { PL [] 1 0 0 DL } def
/LT1 { PL [4 dl 2 dl] 0 1 0 DL } def
/LT2 { PL [2 dl 3 dl] 0 0 1 DL } def
/LT3 { PL [1 dl 1.5 dl] 1 0 1 DL } def
/LT4 { PL [5 dl 2 dl 1 dl 2 dl] 0 1 1 DL } def
/LT5 { PL [4 dl 3 dl 1 dl 3 dl] 1 1 0 DL } def
/LT6 { PL [2 dl 2 dl 2 dl 4 dl] 0 0 0 DL } def
/LT7 { PL [2 dl 2 dl 2 dl 2 dl 2 dl 4 dl] 1 0.3 0 DL } def
/LT8 { PL [2 dl 2 dl 2 dl 2 dl 2 dl 2 dl 2 dl 4 dl] 0.5 0.5 0.5 DL } def
/Pnt { stroke [] 0 setdash
   gsave 1 setlinecap M 0 0 V stroke grestore } def
/Dia { stroke [] 0 setdash 2 copy vpt add M
  hpt neg vpt neg V hpt vpt neg V
  hpt vpt V hpt neg vpt V closepath stroke
  Pnt } def
/Pls { stroke [] 0 setdash vpt sub M 0 vpt2 V
  currentpoint stroke M
  hpt neg vpt neg R hpt2 0 V stroke
  } def
/Box { stroke [] 0 setdash 2 copy exch hpt sub exch vpt add M
  0 vpt2 neg V hpt2 0 V 0 vpt2 V
  hpt2 neg 0 V closepath stroke
  Pnt } def
/Crs { stroke [] 0 setdash exch hpt sub exch vpt add M
  hpt2 vpt2 neg V currentpoint stroke M
  hpt2 neg 0 R hpt2 vpt2 V stroke } def
/TriU { stroke [] 0 setdash 2 copy vpt 1.12 mul add M
  hpt neg vpt -1.62 mul V
  hpt 2 mul 0 V
  hpt neg vpt 1.62 mul V closepath stroke
  Pnt  } def
/Star { 2 copy Pls Crs } def
/BoxF { stroke [] 0 setdash exch hpt sub exch vpt add M
  0 vpt2 neg V  hpt2 0 V  0 vpt2 V
  hpt2 neg 0 V  closepath fill } def
/TriUF { stroke [] 0 setdash vpt 1.12 mul add M
  hpt neg vpt -1.62 mul V
  hpt 2 mul 0 V
  hpt neg vpt 1.62 mul V closepath fill } def
/TriD { stroke [] 0 setdash 2 copy vpt 1.12 mul sub M
  hpt neg vpt 1.62 mul V
  hpt 2 mul 0 V
  hpt neg vpt -1.62 mul V closepath stroke
  Pnt  } def
/TriDF { stroke [] 0 setdash vpt 1.12 mul sub M
  hpt neg vpt 1.62 mul V
  hpt 2 mul 0 V
  hpt neg vpt -1.62 mul V closepath fill} def
/DiaF { stroke [] 0 setdash vpt add M
  hpt neg vpt neg V hpt vpt neg V
  hpt vpt V hpt neg vpt V closepath fill } def
/Pent { stroke [] 0 setdash 2 copy gsave
  translate 0 hpt M 4 {72 rotate 0 hpt L} repeat
  closepath stroke grestore Pnt } def
/PentF { stroke [] 0 setdash gsave
  translate 0 hpt M 4 {72 rotate 0 hpt L} repeat
  closepath fill grestore } def
/Circle { stroke [] 0 setdash 2 copy
  hpt 0 360 arc stroke Pnt } def
/CircleF { stroke [] 0 setdash hpt 0 360 arc fill } def
/C0 { BL [] 0 setdash 2 copy moveto vpt 90 450  arc } bind def
/C1 { BL [] 0 setdash 2 copy        moveto
       2 copy  vpt 0 90 arc closepath fill
               vpt 0 360 arc closepath } bind def
/C2 { BL [] 0 setdash 2 copy moveto
       2 copy  vpt 90 180 arc closepath fill
               vpt 0 360 arc closepath } bind def
/C3 { BL [] 0 setdash 2 copy moveto
       2 copy  vpt 0 180 arc closepath fill
               vpt 0 360 arc closepath } bind def
/C4 { BL [] 0 setdash 2 copy moveto
       2 copy  vpt 180 270 arc closepath fill
               vpt 0 360 arc closepath } bind def
/C5 { BL [] 0 setdash 2 copy moveto
       2 copy  vpt 0 90 arc
       2 copy moveto
       2 copy  vpt 180 270 arc closepath fill
               vpt 0 360 arc } bind def
/C6 { BL [] 0 setdash 2 copy moveto
      2 copy  vpt 90 270 arc closepath fill
              vpt 0 360 arc closepath } bind def
/C7 { BL [] 0 setdash 2 copy moveto
      2 copy  vpt 0 270 arc closepath fill
              vpt 0 360 arc closepath } bind def
/C8 { BL [] 0 setdash 2 copy moveto
      2 copy vpt 270 360 arc closepath fill
              vpt 0 360 arc closepath } bind def
/C9 { BL [] 0 setdash 2 copy moveto
      2 copy  vpt 270 450 arc closepath fill
              vpt 0 360 arc closepath } bind def
/C10 { BL [] 0 setdash 2 copy 2 copy moveto vpt 270 360 arc closepath fill
       2 copy moveto
       2 copy vpt 90 180 arc closepath fill
               vpt 0 360 arc closepath } bind def
/C11 { BL [] 0 setdash 2 copy moveto
       2 copy  vpt 0 180 arc closepath fill
       2 copy moveto
       2 copy  vpt 270 360 arc closepath fill
               vpt 0 360 arc closepath } bind def
/C12 { BL [] 0 setdash 2 copy moveto
       2 copy  vpt 180 360 arc closepath fill
               vpt 0 360 arc closepath } bind def
/C13 { BL [] 0 setdash  2 copy moveto
       2 copy  vpt 0 90 arc closepath fill
       2 copy moveto
       2 copy  vpt 180 360 arc closepath fill
               vpt 0 360 arc closepath } bind def
/C14 { BL [] 0 setdash 2 copy moveto
       2 copy  vpt 90 360 arc closepath fill
               vpt 0 360 arc } bind def
/C15 { BL [] 0 setdash 2 copy vpt 0 360 arc closepath fill
               vpt 0 360 arc closepath } bind def
/Rec   { newpath 4 2 roll moveto 1 index 0 rlineto 0 exch rlineto
       neg 0 rlineto closepath } bind def
/Square { dup Rec } bind def
/Bsquare { vpt sub exch vpt sub exch vpt2 Square } bind def
/S0 { BL [] 0 setdash 2 copy moveto 0 vpt rlineto BL Bsquare } bind def
/S1 { BL [] 0 setdash 2 copy vpt Square fill Bsquare } bind def
/S2 { BL [] 0 setdash 2 copy exch vpt sub exch vpt Square fill Bsquare } bind def
/S3 { BL [] 0 setdash 2 copy exch vpt sub exch vpt2 vpt Rec fill Bsquare } bind def
/S4 { BL [] 0 setdash 2 copy exch vpt sub exch vpt sub vpt Square fill Bsquare } bind def
/S5 { BL [] 0 setdash 2 copy 2 copy vpt Square fill
       exch vpt sub exch vpt sub vpt Square fill Bsquare } bind def
/S6 { BL [] 0 setdash 2 copy exch vpt sub exch vpt sub vpt vpt2 Rec fill Bsquare } bind def
/S7 { BL [] 0 setdash 2 copy exch vpt sub exch vpt sub vpt vpt2 Rec fill
       2 copy vpt Square fill
       Bsquare } bind def
/S8 { BL [] 0 setdash 2 copy vpt sub vpt Square fill Bsquare } bind def
/S9 { BL [] 0 setdash 2 copy vpt sub vpt vpt2 Rec fill Bsquare } bind def
/S10 { BL [] 0 setdash 2 copy vpt sub vpt Square fill 2 copy exch vpt sub exch vpt Square fill
       Bsquare } bind def
/S11 { BL [] 0 setdash 2 copy vpt sub vpt Square fill 2 copy exch vpt sub exch vpt2 vpt Rec fill
       Bsquare } bind def
/S12 { BL [] 0 setdash 2 copy exch vpt sub exch vpt sub vpt2 vpt Rec fill Bsquare } bind def
/S13 { BL [] 0 setdash 2 copy exch vpt sub exch vpt sub vpt2 vpt Rec fill
       2 copy vpt Square fill Bsquare } bind def
/S14 { BL [] 0 setdash 2 copy exch vpt sub exch vpt sub vpt2 vpt Rec fill
       2 copy exch vpt sub exch vpt Square fill Bsquare } bind def
/S15 { BL [] 0 setdash 2 copy Bsquare fill Bsquare } bind def
/D0 { gsave translate 45 rotate 0 0 S0 stroke grestore } bind def
/D1 { gsave translate 45 rotate 0 0 S1 stroke grestore } bind def
/D2 { gsave translate 45 rotate 0 0 S2 stroke grestore } bind def
/D3 { gsave translate 45 rotate 0 0 S3 stroke grestore } bind def
/D4 { gsave translate 45 rotate 0 0 S4 stroke grestore } bind def
/D5 { gsave translate 45 rotate 0 0 S5 stroke grestore } bind def
/D6 { gsave translate 45 rotate 0 0 S6 stroke grestore } bind def
/D7 { gsave translate 45 rotate 0 0 S7 stroke grestore } bind def
/D8 { gsave translate 45 rotate 0 0 S8 stroke grestore } bind def
/D9 { gsave translate 45 rotate 0 0 S9 stroke grestore } bind def
/D10 { gsave translate 45 rotate 0 0 S10 stroke grestore } bind def
/D11 { gsave translate 45 rotate 0 0 S11 stroke grestore } bind def
/D12 { gsave translate 45 rotate 0 0 S12 stroke grestore } bind def
/D13 { gsave translate 45 rotate 0 0 S13 stroke grestore } bind def
/D14 { gsave translate 45 rotate 0 0 S14 stroke grestore } bind def
/D15 { gsave translate 45 rotate 0 0 S15 stroke grestore } bind def
/DiaE { stroke [] 0 setdash vpt add M
  hpt neg vpt neg V hpt vpt neg V
  hpt vpt V hpt neg vpt V closepath stroke } def
/BoxE { stroke [] 0 setdash exch hpt sub exch vpt add M
  0 vpt2 neg V hpt2 0 V 0 vpt2 V
  hpt2 neg 0 V closepath stroke } def
/TriUE { stroke [] 0 setdash vpt 1.12 mul add M
  hpt neg vpt -1.62 mul V
  hpt 2 mul 0 V
  hpt neg vpt 1.62 mul V closepath stroke } def
/TriDE { stroke [] 0 setdash vpt 1.12 mul sub M
  hpt neg vpt 1.62 mul V
  hpt 2 mul 0 V
  hpt neg vpt -1.62 mul V closepath stroke } def
/PentE { stroke [] 0 setdash gsave
  translate 0 hpt M 4 {72 rotate 0 hpt L} repeat
  closepath stroke grestore } def
/CircE { stroke [] 0 setdash 
  hpt 0 360 arc stroke } def
/Opaque { gsave closepath 1 setgray fill grestore 0 setgray closepath } def
/DiaW { stroke [] 0 setdash vpt add M
  hpt neg vpt neg V hpt vpt neg V
  hpt vpt V hpt neg vpt V Opaque stroke } def
/BoxW { stroke [] 0 setdash exch hpt sub exch vpt add M
  0 vpt2 neg V hpt2 0 V 0 vpt2 V
  hpt2 neg 0 V Opaque stroke } def
/TriUW { stroke [] 0 setdash vpt 1.12 mul add M
  hpt neg vpt -1.62 mul V
  hpt 2 mul 0 V
  hpt neg vpt 1.62 mul V Opaque stroke } def
/TriDW { stroke [] 0 setdash vpt 1.12 mul sub M
  hpt neg vpt 1.62 mul V
  hpt 2 mul 0 V
  hpt neg vpt -1.62 mul V Opaque stroke } def
/PentW { stroke [] 0 setdash gsave
  translate 0 hpt M 4 {72 rotate 0 hpt L} repeat
  Opaque stroke grestore } def
/CircW { stroke [] 0 setdash 
  hpt 0 360 arc Opaque stroke } def
/BoxFill { gsave Rec 1 setgray fill grestore } def
/BoxColFill {
  gsave Rec
  /Fillden exch def
  currentrgbcolor
  /ColB exch def /ColG exch def /ColR exch def
  /ColR ColR Fillden mul Fillden sub 1 add def
  /ColG ColG Fillden mul Fillden sub 1 add def
  /ColB ColB Fillden mul Fillden sub 1 add def
  ColR ColG ColB setrgbcolor
  fill grestore } def
%
% PostScript Level 1 Pattern Fill routine
% Usage: x y w h s a XX PatternFill
%	x,y = lower left corner of box to be filled
%	w,h = width and height of box
%	  a = angle in degrees between lines and x-axis
%	 XX = 0/1 for no/yes cross-hatch
%
/PatternFill { gsave /PFa [ 9 2 roll ] def
    PFa 0 get PFa 2 get 2 div add PFa 1 get PFa 3 get 2 div add translate
    PFa 2 get -2 div PFa 3 get -2 div PFa 2 get PFa 3 get Rec
    gsave 1 setgray fill grestore clip
    currentlinewidth 0.5 mul setlinewidth
    /PFs PFa 2 get dup mul PFa 3 get dup mul add sqrt def
    0 0 M PFa 5 get rotate PFs -2 div dup translate
	0 1 PFs PFa 4 get div 1 add floor cvi
	{ PFa 4 get mul 0 M 0 PFs V } for
    0 PFa 6 get ne {
	0 1 PFs PFa 4 get div 1 add floor cvi
	{ PFa 4 get mul 0 2 1 roll M PFs 0 V } for
    } if
    stroke grestore } def
%
/Symbol-Oblique /Symbol findfont [1 0 .167 1 0 0] makefont
dup length dict begin {1 index /FID eq {pop pop} {def} ifelse} forall
currentdict end definefont pop
/MFshow {
   { dup 5 get 3 ge
     { 5 get 3 eq {gsave} {grestore} ifelse }
     {dup dup 0 get findfont exch 1 get scalefont setfont
     [ currentpoint ] exch dup 2 get 0 exch R dup 5 get 2 ne {dup dup 6
     get exch 4 get {show} {stringwidth pop 0 R} ifelse }if dup 5 get 0 eq
     {dup 3 get {2 get neg 0 exch R pop} {pop aload pop M} ifelse} {dup 5
     get 1 eq {dup 2 get exch dup 3 get exch 6 get stringwidth pop -2 div
     dup 0 R} {dup 6 get stringwidth pop -2 div 0 R 6 get
     show 2 index {aload pop M neg 3 -1 roll neg R pop pop} {pop pop pop
     pop aload pop M} ifelse }ifelse }ifelse }
     ifelse }
   forall} bind def
/MFwidth {0 exch {dup 3 get{dup dup 0 get findfont exch 1 get scalefont
     setfont 6 get stringwidth pop add} {pop} ifelse} forall} bind def
/MLshow { currentpoint stroke M
  0 exch R MFshow } bind def
/MRshow { currentpoint stroke M
  exch dup MFwidth neg 3 -1 roll R MFshow } def
/MCshow { currentpoint stroke M
  exch dup MFwidth -2 div 3 -1 roll R MFshow } def
end
%%EndProlog
gnudict begin
gsave
50 50 translate
0.050 0.050 scale
0 setgray
newpath
(Helvetica) findfont 180 scalefont setfont
1.000 UL
LTb
gsave %% colour palette begin
/maxcolors 0 def
/HSV2RGB {  exch dup 0.0 eq {pop exch pop dup dup} % achromatic gray
  { /HSVs exch def /HSVv exch def 6.0 mul dup floor dup 3 1 roll sub
     /HSVf exch def /HSVi exch cvi def /HSVp HSVv 1.0 HSVs sub mul def
	 /HSVq HSVv 1.0 HSVs HSVf mul sub mul def 
	 /HSVt HSVv 1.0 HSVs 1.0 HSVf sub mul sub mul def
	 /HSVi HSVi 6 mod def 0 HSVi eq {HSVv HSVt HSVp}
	 {1 HSVi eq {HSVq HSVv HSVp}{2 HSVi eq {HSVp HSVv HSVt}
	 {3 HSVi eq {HSVp HSVq HSVv}{4 HSVi eq {HSVt HSVp HSVv}
	 {HSVv HSVp HSVq} ifelse} ifelse} ifelse} ifelse} ifelse
  } ifelse} def
/Constrain {
  dup 0 lt {0 exch pop}{dup 1 gt {1 exch pop} if} ifelse} def
/YIQ2RGB {
  3 copy -1.702 mul exch -1.105 mul add add Constrain 4 1 roll
  3 copy -0.647 mul exch -0.272 mul add add Constrain 5 1 roll
  0.621 mul exch -0.956 mul add add Constrain 3 1 roll } def
/CMY2RGB {  1 exch sub exch 1 exch sub 3 2 roll 1 exch sub 3 1 roll exch } def
/XYZ2RGB {  3 copy -0.9017 mul exch -0.1187 mul add exch 0.0585 mul exch add
  Constrain 4 1 roll 3 copy -0.0279 mul exch 1.999 mul add exch
  -0.9844 mul add Constrain 5 1 roll -0.2891 mul exch -0.5338 mul add
  exch 1.91 mul exch add Constrain 3 1 roll} def
/SelectSpace {ColorSpace (HSV) eq {HSV2RGB}{ColorSpace (XYZ) eq {
  XYZ2RGB}{ColorSpace (CMY) eq {CMY2RGB}{ColorSpace (YIQ) eq {YIQ2RGB}
  if} ifelse} ifelse} ifelse} def
/InterpolatedColor true def
/grayindex {/gidx 0 def
  {GrayA gidx get grayv ge {exit} if /gidx gidx 1 add def} loop} def
/dgdx {grayv GrayA gidx get sub GrayA gidx 1 sub get
  GrayA gidx get sub div} def 
/redvalue {RedA gidx get RedA gidx 1 sub get
  RedA gidx get sub dgdxval mul add} def
/greenvalue {GreenA gidx get GreenA gidx 1 sub get
  GreenA gidx get sub dgdxval mul add} def
/bluevalue {BlueA gidx get BlueA gidx 1 sub get
  BlueA gidx get sub dgdxval mul add} def
/interpolate {
  grayindex grayv GrayA gidx get sub abs 1e-5 le
    {RedA gidx get GreenA gidx get BlueA gidx get}
    {/dgdxval dgdx def redvalue greenvalue bluevalue} ifelse} def
/GrayA [0 1 ] def
/RedA [0 1 ] def
/GreenA [1 1 ] def
/BlueA [1 1 ] def
/maxcolorsLast {maxcolors 1 sub maxcolors div} def
/pm3dround {maxcolors 0 gt {dup maxcolorsLast ge {pop 1}
{maxcolors mul floor maxcolors div} ifelse} if} def
/pm3dGamma 1.0 1.5 div def
/ColorSpace (HSV) def
Color true and { % COLOUR vs. GRAY map
  InterpolatedColor { %% Interpolation vs. RGB-Formula
    /g {stroke pm3dround /grayv exch def interpolate
        SelectSpace setrgbcolor} bind def
  }{
  /g {stroke pm3dround dup cF7 Constrain exch dup cF5 Constrain exch cF15 Constrain 
       SelectSpace setrgbcolor} bind def
  } ifelse
}{
  /g {stroke pm3dround pm3dGamma exp setgray} bind def
} ifelse
/h {rlineto rlineto rlineto fill} bind def
stroke gsave	%% draw gray scale smooth box
maxcolors 0 gt {/imax maxcolors def} {/imax 1024 def} ifelse
7920 3010 translate 333 2264 scale 0 setlinewidth
/ystep 1 imax div def /y0 0 def /ii 0 def
{ y0 g 0 y0 N 1 0 V 0 ystep V -1 0 f
/y0 y0 ystep add def /ii ii 1 add def
ii imax ge {exit} if } loop
grestore 0 setgray
1.000 UL
LTb
7920 3010 M
333 0 V
0 2264 V
-333 0 V
0 -2264 V
1.000 UL
LTb
1.000 UL
LTb
8253 3010 M
-63 0 V
stroke
8361 3010 M
[ [(Helvetica) 180.0 0.0 true true 0 (-3.5)]
] -60.0 MLshow
1.000 UL
LTb
7920 3010 M
63 0 V
270 283 R
-63 0 V
stroke
8361 3293 M
[ [(Helvetica) 180.0 0.0 true true 0 (-3)]
] -60.0 MLshow
1.000 UL
LTb
7920 3293 M
63 0 V
270 283 R
-63 0 V
stroke
8361 3576 M
[ [(Helvetica) 180.0 0.0 true true 0 (-2.5)]
] -60.0 MLshow
1.000 UL
LTb
7920 3576 M
63 0 V
270 283 R
-63 0 V
stroke
8361 3859 M
[ [(Helvetica) 180.0 0.0 true true 0 (-2)]
] -60.0 MLshow
1.000 UL
LTb
7920 3859 M
63 0 V
270 283 R
-63 0 V
stroke
8361 4142 M
[ [(Helvetica) 180.0 0.0 true true 0 (-1.5)]
] -60.0 MLshow
1.000 UL
LTb
7920 4142 M
63 0 V
270 283 R
-63 0 V
stroke
8361 4425 M
[ [(Helvetica) 180.0 0.0 true true 0 (-1)]
] -60.0 MLshow
1.000 UL
LTb
7920 4425 M
63 0 V
270 283 R
-63 0 V
stroke
8361 4708 M
[ [(Helvetica) 180.0 0.0 true true 0 (-0.5)]
] -60.0 MLshow
1.000 UL
LTb
7920 4708 M
63 0 V
270 283 R
-63 0 V
stroke
8361 4991 M
[ [(Helvetica) 180.0 0.0 true true 0 ( 0)]
] -60.0 MLshow
1.000 UL
LTb
7920 4991 M
63 0 V
270 283 R
-63 0 V
stroke
8361 5274 M
[ [(Helvetica) 180.0 0.0 true true 0 ( 0.5)]
] -60.0 MLshow
1.000 UL
LTb
7920 5274 M
63 0 V
1.000 UL
LTb
1206 1657 M
2412 941 V
1.000 UL
LTb
7794 2054 M
3618 2598 L
1.000 UL
LTb
1206 1657 M
0 3343 V
1.000 UL
LTb
3618 2598 M
0 3064 V
1.000 UL
LTb
7794 2054 M
0 3065 V
1.000 UL
LTb
1206 1657 M
43 17 V
1.000 UL
LTb
1132 1609 M
[ [(Helvetica) 180.0 0.0 true true 0 ( 0)]
] -60.0 MCshow
1.000 UL
LTb
1.000 UL
LTb
3618 2598 M
-44 -17 V
1.000 UL
LTb
1623 1602 M
44 17 V
1.000 UL
LTb
1549 1554 M
[ [(Helvetica) 180.0 0.0 true true 0 ( 0.2)]
] -60.0 MCshow
1.000 UL
LTb
1.000 UL
LTb
4035 2543 M
-43 -17 V
1.000 UL
LTb
2041 1548 M
43 17 V
1.000 UL
LTb
1967 1500 M
[ [(Helvetica) 180.0 0.0 true true 0 ( 0.4)]
] -60.0 MCshow
1.000 UL
LTb
1.000 UL
LTb
4453 2489 M
-43 -17 V
1.000 UL
LTb
2459 1494 M
43 17 V
1.000 UL
LTb
2385 1446 M
[ [(Helvetica) 180.0 0.0 true true 0 ( 0.6)]
] -60.0 MCshow
1.000 UL
LTb
1.000 UL
LTb
4870 2435 M
-43 -17 V
1.000 UL
LTb
2877 1439 M
43 17 V
1.000 UL
LTb
2803 1391 M
[ [(Helvetica) 180.0 0.0 true true 0 ( 0.8)]
] -60.0 MCshow
1.000 UL
LTb
1.000 UL
LTb
5288 2380 M
-43 -17 V
1.000 UL
LTb
3295 1385 M
43 17 V
1.000 UL
LTb
3220 1337 M
[ [(Helvetica) 180.0 0.0 true true 0 ( 1)]
] -60.0 MCshow
1.000 UL
LTb
1.000 UL
LTb
5705 2326 M
-43 -17 V
1.000 UL
LTb
3712 1331 M
43 17 V
1.000 UL
LTb
3638 1283 M
[ [(Helvetica) 180.0 0.0 true true 0 ( 1.2)]
] -60.0 MCshow
1.000 UL
LTb
1.000 UL
LTb
6123 2272 M
-43 -17 V
1.000 UL
LTb
4130 1276 M
43 17 V
1.000 UL
LTb
4056 1228 M
[ [(Helvetica) 180.0 0.0 true true 0 ( 1.4)]
] -60.0 MCshow
1.000 UL
LTb
1.000 UL
LTb
6541 2217 M
-43 -16 V
1.000 UL
LTb
4547 1222 M
43 17 V
1.000 UL
LTb
4474 1174 M
[ [(Helvetica) 180.0 0.0 true true 0 ( 1.6)]
] -60.0 MCshow
1.000 UL
LTb
1.000 UL
LTb
6959 2163 M
-43 -17 V
1.000 UL
LTb
4965 1168 M
43 17 V
1.000 UL
LTb
4890 1120 M
[ [(Helvetica) 180.0 0.0 true true 0 ( 1.8)]
] -60.0 MCshow
1.000 UL
LTb
1.000 UL
LTb
7377 2109 M
-44 -17 V
1.000 UL
LTb
5382 1113 M
44 17 V
1.000 UL
LTb
5308 1065 M
[ [(Helvetica) 180.0 0.0 true true 0 ( 2)]
] -60.0 MCshow
1.000 UL
LTb
1.000 UL
LTb
7794 2054 M
-43 -16 V
1.000 UL
LTb
5382 1113 M
-54 8 V
stroke
5476 1093 M
[ [(Helvetica) 180.0 0.0 true true 0 ( 0)]
] -60.0 MCshow
1.000 UL
LTb
1.000 UL
LTb
1206 1657 M
54 -7 V
1.000 UL
LTb
5985 1349 M
-54 7 V
stroke
6079 1328 M
[ [(Helvetica) 180.0 0.0 true true 0 ( 0.5)]
] -60.0 MCshow
1.000 UL
LTb
1.000 UL
LTb
1809 1892 M
54 -7 V
1.000 UL
LTb
6588 1584 M
-54 7 V
stroke
6682 1564 M
[ [(Helvetica) 180.0 0.0 true true 0 ( 1)]
] -60.0 MCshow
1.000 UL
LTb
1.000 UL
LTb
2412 2127 M
54 -7 V
1.000 UL
LTb
7191 1819 M
-54 7 V
stroke
7285 1799 M
[ [(Helvetica) 180.0 0.0 true true 0 ( 1.5)]
] -60.0 MCshow
1.000 UL
LTb
1.000 UL
LTb
3015 2362 M
54 -7 V
1.000 UL
LTb
7794 2054 M
-54 7 V
stroke
7888 2034 M
[ [(Helvetica) 180.0 0.0 true true 0 ( 2)]
] -60.0 MCshow
1.000 UL
LTb
1.000 UL
LTb
3618 2598 M
54 -7 V
1.000 UL
LTb
1206 2771 M
63 0 V
stroke
1080 2771 M
[ [(Helvetica) 180.0 0.0 true true 0 (-3.5)]
] -60.0 MRshow
1.000 UL
LTb
1.000 UL
LTb
1206 3050 M
63 0 V
stroke
1080 3050 M
[ [(Helvetica) 180.0 0.0 true true 0 (-3)]
] -60.0 MRshow
1.000 UL
LTb
1.000 UL
LTb
1206 3329 M
63 0 V
stroke
1080 3329 M
[ [(Helvetica) 180.0 0.0 true true 0 (-2.5)]
] -60.0 MRshow
1.000 UL
LTb
1.000 UL
LTb
1206 3606 M
63 0 V
stroke
1080 3606 M
[ [(Helvetica) 180.0 0.0 true true 0 (-2)]
] -60.0 MRshow
1.000 UL
LTb
1.000 UL
LTb
1206 3885 M
63 0 V
stroke
1080 3885 M
[ [(Helvetica) 180.0 0.0 true true 0 (-1.5)]
] -60.0 MRshow
1.000 UL
LTb
1.000 UL
LTb
1206 4164 M
63 0 V
stroke
1080 4164 M
[ [(Helvetica) 180.0 0.0 true true 0 (-1)]
] -60.0 MRshow
1.000 UL
LTb
1.000 UL
LTb
1206 4442 M
63 0 V
stroke
1080 4442 M
[ [(Helvetica) 180.0 0.0 true true 0 (-0.5)]
] -60.0 MRshow
1.000 UL
LTb
1.000 UL
LTb
1206 4721 M
63 0 V
stroke
1080 4721 M
[ [(Helvetica) 180.0 0.0 true true 0 ( 0)]
] -60.0 MRshow
1.000 UL
LTb
1.000 UL
LTb
1206 5000 M
63 0 V
stroke
1080 5000 M
[ [(Helvetica) 180.0 0.0 true true 0 ( 0.5)]
] -60.0 MRshow
1.000 UL
LTb
LTb
1205 5836 M
[ [(Helvetica) 180.0 0.0 true true 0 (Erreur)]
] -60.0 MCshow
LTb
4500 6172 M
[ [(Times-Roman) 300.0 0.0 true true 0 (Erreur relative \(%\))]
] -100.0 MCshow
1.000 UP
%pm3d_map_begin
.6343 g 3490 4978 N -220 620 127 379 220 -315 h
.6641 g 3363 5536 N -220 315 127 -573 220 -300 h
.8302 g 3236 5571 N -220 300 127 -116 220 -219 h
.8523 g 3109 5474 N -220 219 127 55 220 -177 h
.8408 g 2982 5396 N -220 177 127 70 220 -169 h
.8346 g 2855 5356 N -220 169 127 65 220 -194 h
.8312 g 2728 5334 N -220 194 127 102 220 -274 h
.8062 g 2601 5291 N -220 274 127 254 220 -485 h
.7046 g 2474 5113 N -220 485 127 630 220 -937 h
.6167 g 2347 5049 N -220 937 127 110 220 -983 h
.6922 g 2220 5146 N -220 983 127 -553 220 -527 h
.8004 g 2093 5088 N -220 527 127 -175 220 -294 h
.8276 g 1966 5009 N -220 294 127 -7 220 -208 h
.8311 g 1839 4948 N -220 208 127 34 220 -181 h
.8372 g 1712 4930 N -220 181 127 31 220 -194 h
.8493 g 1585 4939 N -220 194 127 51 220 -254 h
.8162 g 1459 4781 N -220 254 127 292 219 -388 h
.4397 g 1332 3044 N -219 388 127 1368 219 -19 h
.2952 g 1205 4721 N -219 19 126 60 220 -1756 h
.6704 g 3710 4663 N -219 -538 127 313 219 604 h
.7026 g 3583 5236 N -219 -604 126 -208 220 239 h
.8263 g 3456 5352 N -220 -239 127 -9 220 132 h
.8475 g 3329 5297 N -220 -132 127 80 220 107 h
.8389 g 3202 5227 N -220 -107 127 70 220 107 h
.8332 g 3075 5162 N -220 -107 127 43 220 129 h
.8279 g 2948 5060 N -220 -129 127 36 220 195 h
.7997 g 2821 4806 N -220 -195 127 57 220 392 h
.7065 g 2694 4176 N -220 -392 127 89 220 933 h
.6301 g 2567 4066 N -220 -933 127 50 220 993 h
.6952 g 2440 4619 N -220 -993 127 10 220 430 h
.7933 g 2313 4794 N -220 -430 127 41 220 214 h
.824 g 2186 4801 N -220 -214 127 65 220 142 h
.8297 g 2059 4767 N -220 -142 127 56 220 120 h
.8352 g 1932 4736 N -220 -120 127 28 220 123 h
.8434 g 1805 4685 N -220 -123 127 15 220 159 h
.812 g 1678 4393 N -220 -159 127 119 220 332 h
.5888 g 1551 3025 N -220 -332 127 411 220 1289 h
.4397 g 1425 2965 N -220 -1289 127 -311 219 1660 h
.8318 g 3929 5267 N -220 -50 127 230 220 133 h
.8281 g 3803 5475 N -220 -133 127 -104 219 29 h
.8844 g 3676 5484 N -219 -29 127 16 219 4 h
.8881 g 3549 5404 N -219 -4 127 78 219 6 h
.8773 g 3422 5334 N -219 -6 126 67 220 9 h
.8749 g 3295 5291 N -220 -9 127 40 220 12 h
.8804 g 3168 5255 N -220 -12 127 29 220 19 h
.8847 g 3041 5198 N -220 -19 127 38 220 38 h
.8803 g 2914 5109 N -220 -38 127 54 220 73 h
.8754 g 2787 5059 N -220 -73 127 49 220 74 h
.8804 g 2660 5049 N -220 -74 127 44 220 40 h
.8851 g 2533 5008 N -220 -40 127 61 220 20 h
.8807 g 2406 4943 N -220 -20 127 71 220 14 h
.8748 g 2279 4887 N -220 -14 127 59 220 11 h
.8775 g 2152 4859 N -220 -11 127 31 220 8 h
.8895 g 2025 4844 N -220 -8 127 16 220 7 h
.8853 g 1898 4725 N -220 -7 127 85 220 41 h
.812 g 1771 4314 N -220 -41 127 237 220 215 h
.8162 g 1644 4625 N -220 -215 127 -176 220 80 h
.8533 g 4149 5400 N -220 73 127 189 220 -32 h
.849 g 4022 5504 N -220 32 127 -78 220 -58 h
.888 g 3895 5488 N -220 58 127 16 220 -58 h
.8899 g 3768 5410 N -220 58 127 71 220 -51 h
.8808 g 3642 5343 N -220 51 127 64 219 -48 h
.8789 g 3515 5303 N -219 48 127 43 219 -51 h
.8843 g 3388 5274 N -219 51 126 38 220 -60 h
.8893 g 3261 5236 N -220 60 127 49 220 -71 h
.8889 g 3134 5182 N -220 71 127 61 220 -78 h
.8872 g 3007 5133 N -220 78 127 49 220 -78 h
.8892 g 2880 5089 N -220 78 127 38 220 -72 h
.8898 g 2753 5028 N -220 72 127 50 220 -61 h
.8847 g 2626 4957 N -220 61 127 62 220 -52 h
.8791 g 2499 4898 N -220 52 127 56 220 -49 h
.8812 g 2372 4867 N -220 49 127 34 220 -52 h
.8913 g 2245 4851 N -220 52 127 26 220 -62 h
.8895 g 2118 4766 N -220 62 127 86 220 -63 h
.8434 g 1991 4529 N -220 63 127 201 220 -27 h
.8493 g 1864 4705 N -220 27 127 -116 220 -87 h
.843 g 4369 5368 N -220 55 127 180 220 -46 h
.8412 g 4242 5446 N -220 46 127 -76 220 -48 h
.8774 g 4115 5430 N -220 48 127 13 220 -45 h
.8807 g 3988 5359 N -220 45 127 69 220 -43 h
.873 g 3861 5295 N -220 43 127 63 220 -42 h
.871 g 3734 5252 N -220 42 127 45 220 -44 h
.8745 g 3608 5214 N -220 44 127 41 219 -47 h
.8763 g 3481 5165 N -219 47 127 54 219 -52 h
.8728 g 3354 5104 N -219 52 126 66 220 -57 h
.8696 g 3227 5055 N -220 57 127 50 220 -58 h
.8727 g 3100 5017 N -220 58 127 33 220 -53 h
.8764 g 2973 4967 N -220 53 127 45 220 -48 h
.8744 g 2846 4905 N -220 48 127 59 220 -45 h
.8708 g 2719 4849 N -220 45 127 54 220 -43 h
.8729 g 2592 4815 N -220 43 127 35 220 -44 h
.8812 g 2465 4789 N -220 44 127 29 220 -47 h
.8775 g 2338 4703 N -220 47 127 90 220 -51 h
.8352 g 2211 4502 N -220 51 127 198 220 -48 h
.8372 g 2084 4618 N -220 48 127 -104 220 -60 h
.8381 g 4589 5322 N -220 19 127 199 220 -38 h
.8366 g 4462 5398 N -220 38 127 -92 220 -22 h
.8749 g 4335 5385 N -220 22 127 12 220 -21 h
.8787 g 4208 5316 N -220 21 127 71 220 -23 h
.871 g 4081 5253 N -220 23 127 64 220 -24 h
.8688 g 3954 5208 N -220 24 127 44 220 -23 h
.8721 g 3827 5167 N -220 23 127 39 220 -21 h
.8734 g 3700 5113 N -220 21 127 53 220 -20 h
.8689 g 3574 5047 N -220 20 127 66 219 -20 h
.8652 g 3447 4997 N -219 20 127 49 219 -19 h
.8688 g 3320 4964 N -219 19 126 33 220 -19 h
.8734 g 3193 4919 N -220 19 127 47 220 -21 h
.872 g 3066 4860 N -220 21 127 61 220 -23 h
.8685 g 2939 4806 N -220 23 127 55 220 -24 h
.8708 g 2812 4771 N -220 24 127 33 220 -22 h
.8791 g 2685 4742 N -220 22 127 26 220 -19 h
.8748 g 2558 4652 N -220 19 127 92 220 -21 h
.8297 g 2431 4454 N -220 21 127 221 220 -44 h
.8311 g 2304 4558 N -220 44 127 -130 220 -18 h
.8368 g 4809 5284 N -220 6 127 256 220 -63 h
.8339 g 4682 5376 N -220 63 127 -139 220 -16 h
.8802 g 4555 5364 N -220 16 127 5 220 -9 h
.8838 g 4428 5293 N -220 9 127 78 220 -16 h
.8744 g 4301 5229 N -220 16 127 68 220 -20 h
.8721 g 4174 5185 N -220 20 127 42 220 -18 h
.8767 g 4047 5146 N -220 18 127 33 220 -12 h
.8798 g 3920 5093 N -220 12 127 47 220 -6 h
.876 g 3793 5027 N -220 6 127 66 220 -6 h
.8723 g 3666 4978 N -220 6 127 49 220 -6 h
.8761 g 3540 4945 N -220 6 127 32 219 -5 h
.88 g 3413 4898 N -219 5 127 53 219 -11 h
.8767 g 3286 4837 N -219 11 127 67 219 -17 h
.872 g 3159 4782 N -219 17 126 57 220 -19 h
.8744 g 3032 4749 N -220 19 127 30 220 -16 h
.8847 g 2905 4723 N -220 16 127 17 220 -7 h
.8807 g 2778 4631 N -220 7 127 99 220 -14 h
.824 g 2651 4410 N -220 14 127 292 220 -85 h
.8276 g 2524 4540 N -220 85 127 -216 220 1 h
.8221 g 5029 5221 N -220 28 127 377 220 -149 h
.8173 g 4902 5360 N -220 149 127 -253 220 -35 h
.884 g 4775 5355 N -220 35 127 -10 220 -20 h
.8882 g 4648 5277 N -220 20 127 87 220 -29 h
.8762 g 4521 5209 N -220 29 127 72 220 -33 h
.8735 g 4394 5167 N -220 33 127 41 220 -32 h
.8797 g 4267 5134 N -220 32 127 27 220 -26 h
.885 g 4140 5087 N -220 26 127 44 220 -23 h
.8808 g 4013 5021 N -220 23 127 79 220 -36 h
.8757 g 3886 4972 N -220 36 127 50 220 -37 h
.8811 g 3759 4940 N -220 37 127 18 220 -23 h
.8855 g 3632 4887 N -220 23 127 55 220 -25 h
.88 g 3505 4820 N -220 25 127 73 220 -31 h
.8734 g 3379 4763 N -220 31 127 60 219 -34 h
.8764 g 3252 4733 N -219 34 127 24 219 -28 h
.8898 g 3125 4716 N -219 28 126 7 220 -18 h
.8851 g 2998 4617 N -220 18 127 118 220 -37 h
.7933 g 2871 4325 N -220 37 127 508 220 -253 h
.8004 g 2744 4541 N -220 253 127 -449 220 -20 h
.7792 g 5249 5072 N -220 75 127 547 220 -245 h
.7756 g 5122 5325 N -220 245 127 -441 220 -57 h
.8804 g 4995 5335 N -220 57 127 -32 220 -35 h
.8873 g 4868 5248 N -220 35 127 91 220 -39 h
.8729 g 4741 5176 N -220 39 127 76 220 -43 h
.8693 g 4614 5135 N -220 43 127 42 220 -44 h
.8761 g 4487 5108 N -220 44 127 28 220 -45 h
.8807 g 4360 5064 N -220 45 127 57 220 -58 h
.8652 g 4233 4985 N -220 58 127 156 220 -135 h
.849 g 4106 4935 N -220 135 127 58 220 -143 h
.8645 g 3979 4917 N -220 143 127 -65 220 -60 h
.8811 g 3852 4862 N -220 60 127 41 220 -46 h
.8761 g 3725 4789 N -220 46 127 73 220 -46 h
.8688 g 3598 4729 N -220 46 127 58 220 -44 h
.8727 g 3471 4705 N -220 44 127 21 220 -41 h
.8892 g 3345 4698 N -220 41 127 -1 219 -33 h
.8804 g 3218 4580 N -219 33 127 153 219 -68 h
.6952 g 3091 4072 N -219 68 126 1070 220 -630 h
.6922 g 2964 4521 N -220 630 127 -904 220 -175 h
.7515 g 5469 4827 N -219 28 127 532 219 -13 h
.75 g 5342 5268 N -219 13 126 -426 220 -28 h
.8765 g 5215 5300 N -220 28 127 -31 220 -29 h
.8853 g 5088 5209 N -220 29 127 91 220 -29 h
.8701 g 4961 5133 N -220 29 127 76 220 -29 h
.866 g 4834 5091 N -220 29 127 41 220 -28 h
.8725 g 4707 5063 N -220 28 127 29 220 -29 h
.8756 g 4580 5006 N -220 29 127 56 220 -28 h
.8508 g 4453 4850 N -220 28 127 150 220 -22 h
.8258 g 4326 4792 N -220 22 127 57 220 -21 h
.849 g 4199 4857 N -220 21 127 -58 220 -28 h
.8757 g 4072 4816 N -220 28 127 42 220 -29 h
.8723 g 3945 4743 N -220 29 127 72 220 -28 h
.8652 g 3818 4685 N -220 28 127 59 220 -29 h
.8696 g 3691 4664 N -220 29 127 21 220 -29 h
.8872 g 3564 4665 N -220 29 127 0 220 -30 h
.8754 g 3437 4512 N -220 30 127 151 220 -28 h
.6301 g 3311 3442 N -220 28 127 1011 219 31 h
.6167 g 3184 4346 N -219 -31 127 -859 219 -14 h
.7829 g 5688 4814 N -220 -16 127 359 220 189 h
.7794 g 5562 5240 N -220 -189 127 -237 219 0 h
.8803 g 5435 5271 N -219 0 127 -7 219 -24 h
.887 g 5308 5180 N -219 24 126 85 220 -18 h
.8729 g 5181 5104 N -220 18 127 72 220 -14 h
.8694 g 5054 5063 N -220 14 127 40 220 -13 h
.876 g 4927 5034 N -220 13 127 29 220 -13 h
.8804 g 4800 4978 N -220 13 127 45 220 -2 h
.8659 g 4673 4828 N -220 2 127 77 220 71 h
.8508 g 4546 4771 N -220 -71 127 49 220 79 h
.8652 g 4419 4829 N -220 -79 127 21 220 0 h
.8808 g 4292 4787 N -220 0 127 54 220 -12 h
.876 g 4165 4715 N -220 12 127 72 220 -12 h
.8689 g 4038 4656 N -220 12 127 59 220 -12 h
.8728 g 3911 4635 N -220 12 127 25 220 -16 h
.8889 g 3784 4635 N -220 16 127 8 220 -24 h
.8803 g 3657 4484 N -220 24 127 116 220 11 h
.7065 g 3530 3473 N -220 -11 127 470 220 552 h
.7046 g 3403 4332 N -220 -552 127 -407 220 100 h
.8251 g 5908 5003 N -220 29 127 243 220 87 h
.8206 g 5781 5240 N -220 -87 127 -127 220 -23 h
.8837 g 5654 5247 N -220 23 127 7 220 -37 h
.8877 g 5528 5162 N -220 37 127 77 219 -29 h
.8762 g 5401 5090 N -219 29 127 67 219 -24 h
.8735 g 5274 5050 N -219 24 126 42 220 -26 h
.8795 g 5147 5021 N -220 26 127 34 220 -31 h
.8845 g 5020 4976 N -220 31 127 47 220 -33 h
.8804 g 4893 4899 N -220 33 127 65 220 -21 h
.8756 g 4766 4850 N -220 21 127 49 220 -21 h
.8807 g 4639 4829 N -220 21 127 34 220 -34 h
.885 g 4512 4775 N -220 34 127 51 220 -31 h
.8798 g 4385 4703 N -220 31 127 67 220 -26 h
.8734 g 4258 4644 N -220 26 127 57 220 -24 h
.8763 g 4131 4619 N -220 24 127 31 220 -30 h
.8893 g 4004 4611 N -220 30 127 18 220 -40 h
.8847 g 3877 4495 N -220 40 127 97 220 -21 h
.7997 g 3750 4025 N -220 21 127 273 220 176 h
.8062 g 3623 4432 N -220 -176 127 -196 220 -35 h
.8392 g 6128 5090 N -220 50 127 189 220 4 h
.8365 g 6001 5217 N -220 -4 127 -82 220 -41 h
.88 g 5874 5210 N -220 41 127 13 220 -47 h
.8834 g 5747 5133 N -220 47 127 70 220 -40 h
.8745 g 5620 5066 N -220 40 127 64 220 -37 h
.8722 g 5494 5024 N -220 37 127 44 219 -39 h
.8766 g 5367 4990 N -219 39 127 39 219 -44 h
.8795 g 5240 4943 N -219 44 127 53 219 -50 h
.876 g 5113 4878 N -219 50 126 64 220 -49 h
.8725 g 4986 4829 N -220 49 127 50 220 -50 h
.8761 g 4859 4795 N -220 50 127 34 220 -50 h
.8797 g 4732 4744 N -220 50 127 47 220 -46 h
.8767 g 4605 4677 N -220 46 127 60 220 -39 h
.8721 g 4478 4620 N -220 39 127 55 220 -37 h
.8745 g 4351 4589 N -220 37 127 34 220 -40 h
.8843 g 4224 4571 N -220 40 127 28 220 -50 h
.8804 g 4097 4474 N -220 50 127 89 220 -42 h
.8279 g 3970 4201 N -220 42 127 208 220 23 h
.8312 g 3843 4397 N -220 -23 127 -117 220 -56 h
.8407 g 6348 5094 N -220 37 127 170 220 -18 h
.8393 g 6221 5176 N -220 18 127 -66 220 -34 h
.875 g 6094 5163 N -220 34 127 16 220 -37 h
.8786 g 5967 5093 N -220 37 127 67 220 -34 h
.8712 g 5840 5029 N -220 34 127 63 220 -33 h
.8691 g 5713 4985 N -220 33 127 45 220 -34 h
.8722 g 5586 4946 N -220 34 127 41 220 -36 h
.8735 g 5459 4893 N -220 36 127 54 220 -37 h
.8694 g 5333 4829 N -220 37 127 64 219 -37 h
.866 g 5206 4779 N -219 37 127 50 219 -37 h
.8693 g 5079 4745 N -219 37 126 35 220 -38 h
.8735 g 4952 4698 N -220 38 127 45 220 -36 h
.8721 g 4825 4638 N -220 36 127 58 220 -34 h
.8688 g 4698 4583 N -220 34 127 54 220 -33 h
.871 g 4571 4549 N -220 33 127 36 220 -35 h
.8789 g 4444 4521 N -220 35 127 30 220 -37 h
.8749 g 4317 4432 N -220 37 127 87 220 -35 h
.8332 g 4190 4224 N -220 35 127 185 220 -12 h
.8346 g 4063 4341 N -220 12 127 -90 220 -39 h
.8456 g 6568 5076 N -220 5 127 176 220 -11 h
.8439 g 6441 5142 N -220 11 127 -67 220 -10 h
.8772 g 6314 5126 N -220 10 127 18 220 -12 h
.8803 g 6187 5059 N -220 12 127 70 220 -15 h
.8731 g 6060 4996 N -220 15 127 63 220 -15 h
.8712 g 5933 4951 N -220 15 127 44 220 -14 h
.8745 g 5806 4910 N -220 14 127 38 220 -11 h
.8762 g 5679 4856 N -220 11 127 49 220 -6 h
.8729 g 5552 4792 N -220 6 127 61 220 -3 h
.8701 g 5425 4742 N -220 3 127 49 220 -2 h
.8729 g 5299 4707 N -220 2 127 39 219 -6 h
.8762 g 5172 4662 N -219 6 127 49 219 -10 h
.8744 g 5045 4604 N -219 10 126 62 220 -14 h
.871 g 4918 4550 N -220 14 127 55 220 -15 h
.873 g 4791 4514 N -220 15 127 35 220 -14 h
.8808 g 4664 4484 N -220 14 127 28 220 -12 h
.8773 g 4537 4397 N -220 12 127 83 220 -8 h
.8389 g 4410 4212 N -220 8 127 185 220 -8 h
.8408 g 4283 4302 N -220 8 127 -98 220 0 h
.8555 g 6788 5065 N -220 -10 127 206 220 -20 h
.8519 g 6661 5132 N -220 20 127 -85 220 -2 h
.8869 g 6534 5114 N -220 2 127 19 220 -3 h
.8888 g 6407 5044 N -220 3 127 75 220 -8 h
.8803 g 6280 4981 N -220 8 127 66 220 -11 h
.8786 g 6153 4937 N -220 11 127 41 220 -8 h
.8834 g 6026 4899 N -220 8 127 32 220 -2 h
.8877 g 5899 4850 N -220 2 127 40 220 7 h
.887 g 5772 4789 N -220 -7 127 55 220 13 h
.8853 g 5645 4740 N -220 -13 127 49 220 13 h
.8873 g 5518 4701 N -220 -13 127 43 220 9 h
.8882 g 5391 4652 N -220 -9 127 59 220 -1 h
.8838 g 5265 4590 N -220 1 127 68 219 -7 h
.8787 g 5138 4535 N -219 7 127 58 219 -10 h
.8807 g 5011 4500 N -219 10 126 32 220 -7 h
.8899 g 4884 4472 N -220 7 127 21 220 0 h
.8881 g 4757 4389 N -220 0 127 82 220 1 h
.8475 g 4630 4204 N -220 -1 127 209 220 -23 h
.8523 g 4503 4302 N -220 23 127 -140 220 19 h
.8398 g 7008 5045 N -220 95 127 260 220 -149 h
.8366 g 6881 5130 N -220 149 127 -154 220 -80 h
.8836 g 6754 5111 N -220 80 127 -1 220 -60 h
.8869 g 6627 5036 N -220 60 127 76 220 -61 h
.8772 g 6500 4970 N -220 61 127 67 220 -62 h
.875 g 6373 4929 N -220 62 127 44 220 -65 h
.88 g 6246 4897 N -220 65 127 37 220 -70 h
.8837 g 6119 4857 N -220 70 127 56 220 -86 h
.8803 g 5992 4802 N -220 86 127 78 220 -109 h
.8765 g 5865 4753 N -220 109 127 50 220 -110 h
.8804 g 5738 4710 N -220 110 127 21 220 -88 h
.884 g 5611 4651 N -220 88 127 43 220 -72 h
.8802 g 5484 4583 N -220 72 127 63 220 -67 h
.8749 g 5357 4525 N -220 67 127 55 220 -64 h
.8774 g 5231 4493 N -220 64 127 30 219 -62 h
.888 g 5104 4472 N -219 62 127 20 219 -61 h
.8844 g 4977 4390 N -219 61 127 108 219 -87 h
.8263 g 4850 4181 N -219 87 126 317 220 -195 h
.8302 g 4723 4321 N -220 195 127 -222 220 -113 h
.7356 g 7228 4896 N -219 377 126 305 220 -422 h
.7504 g 7101 5050 N -220 422 127 -344 220 -232 h
.8366 g 6974 5051 N -220 232 127 -71 220 -162 h
.8519 g 6847 4975 N -220 162 127 58 220 -144 h
.8439 g 6720 4908 N -220 144 127 68 220 -145 h
.8393 g 6593 4864 N -220 145 127 60 220 -161 h
.8365 g 6466 4827 N -220 161 127 82 220 -206 h
.8206 g 6339 4771 N -220 206 127 164 220 -314 h
.7794 g 6212 4693 N -220 314 127 268 220 -504 h
.75 g 6085 4643 N -220 504 127 65 220 -519 h
.7756 g 5958 4622 N -220 519 127 -167 220 -331 h
.8173 g 5831 4579 N -220 331 127 -71 220 -217 h
.8339 g 5704 4516 N -220 217 127 16 220 -170 h
.8366 g 5577 4461 N -220 170 127 39 220 -154 h
.8412 g 5450 4431 N -220 154 127 33 220 -157 h
.849 g 5323 4411 N -220 157 127 45 220 -182 h
.8281 g 5196 4303 N -220 182 127 212 220 -286 h
.7026 g 5070 3986 N -220 286 127 682 219 -651 h
.6641 g 4943 4208 N -219 651 127 -237 219 -636 h
.7223 g 7448 4474 N -220 -340 127 418 219 227 h
.7356 g 7321 4818 N -219 -227 127 -299 219 182 h
.8398 g 7194 4889 N -219 -182 126 -16 220 127 h
.8555 g 7067 4831 N -220 -127 127 87 220 98 h
.8456 g 6940 4763 N -220 -98 127 74 220 92 h
.8407 g 6813 4703 N -220 -92 127 41 220 111 h
.8392 g 6686 4621 N -220 -111 127 28 220 165 h
.8251 g 6559 4457 N -220 -165 127 48 220 281 h
.7829 g 6432 4189 N -220 -281 127 95 220 454 h
.7515 g 6305 4124 N -220 -454 127 50 220 469 h
.7792 g 6178 4291 N -220 -469 127 3 220 299 h
.8221 g 6051 4362 N -220 -299 127 51 220 177 h
.8368 g 5924 4346 N -220 -177 127 72 220 121 h
.8381 g 5797 4307 N -220 -121 127 59 220 101 h
.843 g 5670 4274 N -220 -101 127 23 220 111 h
.8533 g 5543 4229 N -220 -111 127 5 220 151 h
.8318 g 5416 4017 N -220 -151 127 128 220 235 h
.6704 g 5289 3335 N -220 -235 127 616 220 301 h
.6343 g 5162 3572 N -220 -301 127 -542 220 606 h
%pm3d_map_end
1.000 UL
LT0
.7326 g 3617 5662 M
3490 4978 L
.7265 g 3490 4978 M
-127 558 V
.8819 g 3363 5536 M
-127 35 V
.8902 g 3236 5571 M
-127 -97 V
.873 g 3109 5474 M
-127 -78 V
.8689 g 2982 5396 M
-127 -40 V
.8773 g 2855 5356 M
-127 -22 V
.885 g 2728 5334 M
-127 -43 V
.8577 g 2601 5291 M
2474 5113 L
.8255 g 2474 5113 M
-127 -64 V
.855 g 2347 5049 M
-127 97 V
.8861 g 2220 5146 M
-127 -58 V
.8775 g 2093 5088 M
-127 -79 V
.8683 g 1966 5009 M
-127 -61 V
.8729 g 1839 4948 M
-127 -18 V
.8931 g 1712 4930 M
-127 9 V
.8819 g 1585 4939 M
1459 4781 L
.479 g 1459 4781 M
1332 3044 L
.4877 g 1332 3044 M
1205 4721 L
.536 g 3837 5042 M
3710 4663 L
.6017 g 3710 4663 M
-127 573 V
.7785 g 3583 5236 M
-127 116 V
.8144 g 3456 5352 M
-127 -55 V
.8085 g 3329 5297 M
-127 -70 V
.8003 g 3202 5227 M
-127 -65 V
.7851 g 3075 5162 M
2948 5060 L
.7274 g 2948 5060 M
2821 4806 L
.5514 g 2821 4806 M
2694 4176 L
.4079 g 2694 4176 M
2567 4066 L
.5294 g 2567 4066 M
-127 553 V
.7148 g 2440 4619 M
-127 175 V
.7777 g 2313 4794 M
-127 7 V
.7938 g 2186 4801 M
-127 -34 V
.8016 g 2059 4767 M
-127 -31 V
.8055 g 1932 4736 M
-127 -51 V
.7506 g 1805 4685 M
1678 4393 L
.4005 g 1678 4393 M
1551 3025 L
.1027 g 1551 3025 M
-126 -60 V
.8048 g 4056 5580 M
3929 5267 L
.8034 g 3929 5267 M
-126 208 V
.8742 g 3803 5475 M
-127 9 V
.8806 g 3676 5484 M
-127 -80 V
.8693 g 3549 5404 M
-127 -70 V
.8661 g 3422 5334 M
-127 -43 V
.8706 g 3295 5291 M
-127 -36 V
.872 g 3168 5255 M
-127 -57 V
.8615 g 3041 5198 M
-127 -89 V
.8524 g 2914 5109 M
-127 -50 V
.8611 g 2787 5059 M
-127 -10 V
.8719 g 2660 5049 M
-127 -41 V
.8704 g 2533 5008 M
-127 -65 V
.8655 g 2406 4943 M
-127 -56 V
.8689 g 2279 4887 M
-127 -28 V
stroke
.8814 g 2152 4859 M
-127 -15 V
.8735 g 2025 4844 M
1898 4725 L
.777 g 1898 4725 M
1771 4314 L
.7768 g 1771 4314 M
-127 311 V
.8587 g 4276 5630 M
4149 5400 L
.8528 g 4149 5400 M
-127 104 V
.8946 g 4022 5504 M
-127 -16 V
.8957 g 3895 5488 M
-127 -78 V
.8854 g 3768 5410 M
-126 -67 V
.8836 g 3642 5343 M
-127 -40 V
.8902 g 3515 5303 M
-127 -29 V
.8974 g 3388 5274 M
-127 -38 V
.8991 g 3261 5236 M
-127 -54 V
.8983 g 3134 5182 M
-127 -49 V
.8997 g 3007 5133 M
-127 -44 V
.8983 g 2880 5089 M
-127 -61 V
.8909 g 2753 5028 M
-127 -71 V
.8841 g 2626 4957 M
-127 -59 V
.8861 g 2499 4898 M
-127 -31 V
.8977 g 2372 4867 M
-127 -16 V
.897 g 2245 4851 M
-127 -85 V
.847 g 2118 4766 M
1991 4529 L
.8556 g 1991 4529 M
-127 176 V
.8479 g 4496 5557 M
4369 5368 L
.8453 g 4369 5368 M
-127 78 V
.8815 g 4242 5446 M
-127 -16 V
.8842 g 4115 5430 M
-127 -71 V
.8761 g 3988 5359 M
-127 -64 V
.8742 g 3861 5295 M
-127 -43 V
.8783 g 3734 5252 M
-126 -38 V
.8812 g 3608 5214 M
-127 -49 V
.8787 g 3481 5165 M
-127 -61 V
.876 g 3354 5104 M
-127 -49 V
.8788 g 3227 5055 M
-127 -38 V
.8814 g 3100 5017 M
-127 -50 V
.8784 g 2973 4967 M
-127 -62 V
.8742 g 2846 4905 M
-127 -56 V
.8762 g 2719 4849 M
-127 -34 V
.885 g 2592 4815 M
-127 -26 V
.882 g 2465 4789 M
-127 -86 V
.8398 g 2338 4703 M
2211 4502 L
.8429 g 2211 4502 M
-127 116 V
.8382 g 4716 5502 M
4589 5322 L
.837 g 4589 5322 M
-127 76 V
.8733 g 4462 5398 M
-127 -13 V
.8771 g 4335 5385 M
-127 -69 V
.8698 g 4208 5316 M
-127 -63 V
.8677 g 4081 5253 M
-127 -45 V
.8706 g 3954 5208 M
-127 -41 V
.8715 g 3827 5167 M
-127 -54 V
.8668 g 3700 5113 M
-126 -66 V
.8632 g 3574 5047 M
-127 -50 V
.8667 g 3447 4997 M
-127 -33 V
stroke
.8714 g 3320 4964 M
-127 -45 V
.8704 g 3193 4919 M
-127 -59 V
.8674 g 3066 4860 M
-127 -54 V
.8695 g 2939 4806 M
-127 -35 V
.8774 g 2812 4771 M
-127 -29 V
.873 g 2685 4742 M
-127 -90 V
.8306 g 2558 4652 M
2431 4454 L
.8316 g 2431 4454 M
-127 104 V
.838 g 4936 5483 M
4809 5284 L
.8363 g 4809 5284 M
-127 92 V
.8766 g 4682 5376 M
-127 -12 V
.8803 g 4555 5364 M
-127 -71 V
.8721 g 4428 5293 M
-127 -64 V
.8699 g 4301 5229 M
-127 -44 V
.8736 g 4174 5185 M
-127 -39 V
.8753 g 4047 5146 M
-127 -53 V
.871 g 3920 5093 M
-127 -66 V
.8672 g 3793 5027 M
-127 -49 V
.8709 g 3666 4978 M
-126 -33 V
.8754 g 3540 4945 M
-127 -47 V
.8735 g 3413 4898 M
-127 -61 V
.8697 g 3286 4837 M
-127 -55 V
.872 g 3159 4782 M
-127 -33 V
.8809 g 3032 4749 M
-127 -26 V
.8766 g 2905 4723 M
-127 -92 V
.8287 g 2778 4631 M
2651 4410 L
.8306 g 2651 4410 M
-127 130 V
.8355 g 5156 5477 M
5029 5221 L
.8316 g 5029 5221 M
-127 139 V
.8837 g 4902 5360 M
-127 -5 V
.8872 g 4775 5355 M
-127 -78 V
.8767 g 4648 5277 M
-127 -68 V
.8743 g 4521 5209 M
-127 -42 V
.8798 g 4394 5167 M
-127 -33 V
.8842 g 4267 5134 M
-127 -47 V
.8811 g 4140 5087 M
-127 -66 V
.8774 g 4013 5021 M
-127 -49 V
.8813 g 3886 4972 M
-127 -32 V
.8846 g 3759 4940 M
-127 -53 V
.88 g 3632 4887 M
-127 -67 V
.8743 g 3505 4820 M
-126 -57 V
.8769 g 3379 4763 M
-127 -30 V
.8885 g 3252 4733 M
-127 -17 V
.8847 g 3125 4716 M
-127 -99 V
.8194 g 2998 4617 M
2871 4325 L
.8247 g 2871 4325 M
-127 216 V
.8087 g 5376 5449 M
5249 5072 L
.8031 g 5249 5072 M
-127 253 V
.8842 g 5122 5325 M
-127 10 V
.8891 g 4995 5335 M
-127 -87 V
.8758 g 4868 5248 M
-127 -72 V
.8727 g 4741 5176 M
-127 -41 V
.8796 g 4614 5135 M
-127 -27 V
stroke
.8858 g 4487 5108 M
-127 -44 V
.8805 g 4360 5064 M
-127 -79 V
.8739 g 4233 4985 M
-127 -50 V
.8808 g 4106 4935 M
-127 -18 V
.8865 g 3979 4917 M
-127 -55 V
.8799 g 3852 4862 M
-127 -73 V
.8725 g 3725 4789 M
-127 -60 V
.8759 g 3598 4729 M
-127 -24 V
.8911 g 3471 4705 M
-126 -7 V
.8854 g 3345 4698 M
3218 4580 L
.7672 g 3218 4580 M
3091 4072 L
.7762 g 3091 4072 M
-127 449 V
.7496 g 5596 5374 M
5469 4827 L
.7482 g 5469 4827 M
-127 441 V
.8765 g 5342 5268 M
-127 32 V
.8854 g 5215 5300 M
-127 -91 V
.87 g 5088 5209 M
-127 -76 V
.866 g 4961 5133 M
-127 -42 V
.8725 g 4834 5091 M
-127 -28 V
.8756 g 4707 5063 M
-127 -57 V
.85 g 4580 5006 M
4453 4850 L
.8241 g 4453 4850 M
-127 -58 V
.8481 g 4326 4792 M
-127 65 V
.8757 g 4199 4857 M
-127 -41 V
.8723 g 4072 4816 M
-127 -73 V
.8652 g 3945 4743 M
-127 -58 V
.8696 g 3818 4685 M
-127 -21 V
.8873 g 3691 4664 M
-127 1 V
.8753 g 3564 4665 M
3437 4512 L
.6232 g 3437 4512 M
3311 3442 L
.6082 g 3311 3442 M
-127 904 V
.7534 g 5815 5346 M
5688 4814 L
.7518 g 5688 4814 M
-126 426 V
.8766 g 5562 5240 M
-127 31 V
.8853 g 5435 5271 M
-127 -91 V
.8701 g 5308 5180 M
-127 -76 V
.8661 g 5181 5104 M
-127 -41 V
.8725 g 5054 5063 M
-127 -29 V
.8756 g 4927 5034 M
-127 -56 V
.8516 g 4800 4978 M
4673 4828 L
.8275 g 4673 4828 M
-127 -57 V
.8499 g 4546 4771 M
-127 58 V
.8757 g 4419 4829 M
-127 -42 V
.8723 g 4292 4787 M
-127 -72 V
.8653 g 4165 4715 M
-127 -59 V
.8696 g 4038 4656 M
-127 -21 V
.8871 g 3911 4635 M
-127 0 V
.8754 g 3784 4635 M
3657 4484 L
.6371 g 3657 4484 M
3530 3473 L
.6252 g 3530 3473 M
-127 859 V
.8124 g 6035 5362 M
5908 5003 L
.8071 g 5908 5003 M
-127 237 V
.884 g 5781 5240 M
-127 7 V
stroke
.8887 g 5654 5247 M
-126 -85 V
.8758 g 5528 5162 M
-127 -72 V
.8727 g 5401 5090 M
-127 -40 V
.8795 g 5274 5050 M
-127 -29 V
.8853 g 5147 5021 M
-127 -45 V
.8802 g 5020 4976 M
-127 -77 V
.874 g 4893 4899 M
-127 -49 V
.8805 g 4766 4850 M
-127 -21 V
.8859 g 4639 4829 M
-127 -54 V
.8797 g 4512 4775 M
-127 -72 V
.8726 g 4385 4703 M
-127 -59 V
.8759 g 4258 4644 M
-127 -25 V
.8906 g 4131 4619 M
-127 -8 V
.8851 g 4004 4611 M
3877 4495 L
.7759 g 3877 4495 M
3750 4025 L
.784 g 3750 4025 M
-127 407 V
.8379 g 6255 5333 M
6128 5090 L
.8342 g 6128 5090 M
-127 127 V
.8834 g 6001 5217 M
-127 -7 V
.8867 g 5874 5210 M
-127 -77 V
.8767 g 5747 5133 M
-127 -67 V
.8743 g 5620 5066 M
-126 -42 V
.8796 g 5494 5024 M
-127 -34 V
.8837 g 5367 4990 M
-127 -47 V
.8807 g 5240 4943 M
-127 -65 V
.8772 g 5113 4878 M
-127 -49 V
.8809 g 4986 4829 M
-127 -34 V
.8841 g 4859 4795 M
-127 -51 V
.8798 g 4732 4744 M
-127 -67 V
.8743 g 4605 4677 M
-127 -57 V
.8768 g 4478 4620 M
-127 -31 V
.888 g 4351 4589 M
-127 -18 V
.8843 g 4224 4571 M
-127 -97 V
.8236 g 4097 4474 M
3970 4201 L
.8284 g 3970 4201 M
-127 196 V
.8405 g 6475 5283 M
6348 5094 L
.8387 g 6348 5094 M
-127 82 V
.8765 g 6221 5176 M
-127 -13 V
.8801 g 6094 5163 M
-127 -70 V
.8723 g 5967 5093 M
-127 -64 V
.8702 g 5840 5029 M
-127 -44 V
.8736 g 5713 4985 M
-127 -39 V
.8753 g 5586 4946 M
-127 -53 V
.8713 g 5459 4893 M
-126 -64 V
.8678 g 5333 4829 M
-127 -50 V
.8712 g 5206 4779 M
-127 -34 V
.8753 g 5079 4745 M
-127 -47 V
.8736 g 4952 4698 M
-127 -60 V
.8699 g 4825 4638 M
-127 -55 V
.8721 g 4698 4583 M
-127 -34 V
.8806 g 4571 4549 M
-127 -28 V
.8766 g 4444 4521 M
-127 -89 V
.8321 g 4317 4432 M
4190 4224 L
stroke
.8339 g 4190 4224 M
-127 117 V
.8409 g 6695 5246 M
6568 5076 L
.8398 g 6568 5076 M
-127 66 V
.8734 g 6441 5142 M
-127 -16 V
.877 g 6314 5126 M
-127 -67 V
.8701 g 6187 5059 M
-127 -63 V
.8681 g 6060 4996 M
-127 -45 V
.8709 g 5933 4951 M
-127 -41 V
.8718 g 5806 4910 M
-127 -54 V
.8675 g 5679 4856 M
-127 -64 V
.8642 g 5552 4792 M
-127 -50 V
.8674 g 5425 4742 M
-126 -35 V
.8717 g 5299 4707 M
-127 -45 V
.8707 g 5172 4662 M
-127 -58 V
.8678 g 5045 4604 M
-127 -54 V
.8698 g 4918 4550 M
-127 -36 V
.8772 g 4791 4514 M
-127 -30 V
.8731 g 4664 4484 M
-127 -87 V
.8343 g 4537 4397 M
4410 4212 L
.8352 g 4410 4212 M
-127 90 V
.8503 g 6915 5241 M
6788 5065 L
.848 g 6788 5065 M
-127 67 V
.881 g 6661 5132 M
-127 -18 V
.8836 g 6534 5114 M
-127 -70 V
.8761 g 6407 5044 M
-127 -63 V
.8743 g 6280 4981 M
-127 -44 V
.8781 g 6153 4937 M
-127 -38 V
.8807 g 6026 4899 M
-127 -49 V
.8783 g 5899 4850 M
-127 -61 V
.8759 g 5772 4789 M
-127 -49 V
.8784 g 5645 4740 M
-127 -39 V
.8808 g 5518 4701 M
-127 -49 V
.8782 g 5391 4652 M
-126 -62 V
.8742 g 5265 4590 M
-127 -55 V
.8761 g 5138 4535 M
-127 -35 V
.8843 g 5011 4500 M
-127 -28 V
.8815 g 4884 4472 M
-127 -83 V
.8435 g 4757 4389 M
4630 4204 L
.8463 g 4630 4204 M
-127 98 V
.8607 g 7135 5251 M
7008 5045 L
.8558 g 7008 5045 M
-127 85 V
.8928 g 6881 5130 M
-127 -19 V
.8939 g 6754 5111 M
-127 -75 V
.8846 g 6627 5036 M
-127 -66 V
.8829 g 6500 4970 M
-127 -41 V
.8888 g 6373 4929 M
-127 -32 V
.8948 g 6246 4897 M
-127 -40 V
.8957 g 6119 4857 M
-127 -55 V
.8947 g 5992 4802 M
-127 -49 V
.8961 g 5865 4753 M
-127 -43 V
.8955 g 5738 4710 M
-127 -59 V
.8894 g 5611 4651 M
-127 -68 V
.8833 g 5484 4583 M
-127 -58 V
stroke
.8852 g 5357 4525 M
-126 -32 V
.8956 g 5231 4493 M
-127 -21 V
.8947 g 5104 4472 M
-127 -82 V
.8515 g 4977 4390 M
4850 4181 L
.8583 g 4850 4181 M
-127 140 V
.8189 g 7355 5156 M
7228 4896 L
.8174 g 7228 4896 M
-127 154 V
.8745 g 7101 5050 M
-127 1 V
.8799 g 6974 5051 M
-127 -76 V
.8699 g 6847 4975 M
-127 -67 V
.8671 g 6720 4908 M
-127 -44 V
.8712 g 6593 4864 M
-127 -37 V
.8726 g 6466 4827 M
-127 -56 V
.8649 g 6339 4771 M
-127 -78 V
.8584 g 6212 4693 M
-127 -50 V
.8647 g 6085 4643 M
-127 -21 V
.8725 g 5958 4622 M
-127 -43 V
.871 g 5831 4579 M
-127 -63 V
.8666 g 5704 4516 M
-127 -55 V
.8695 g 5577 4461 M
-127 -30 V
.8805 g 5450 4431 M
-127 -20 V
.8741 g 5323 4411 M
5196 4303 L
.8012 g 5196 4303 M
5070 3986 L
.8021 g 5070 3986 M
-127 222 V
.6523 g 7574 4779 M
7448 4474 L
.6833 g 7448 4474 M
-127 344 V
.7987 g 7321 4818 M
-127 71 V
.8239 g 7194 4889 M
-127 -58 V
.8179 g 7067 4831 M
-127 -68 V
.8114 g 6940 4763 M
-127 -60 V
.8018 g 6813 4703 M
-127 -82 V
.7687 g 6686 4621 M
6559 4457 L
.694 g 6559 4457 M
6432 4189 L
.6416 g 6432 4189 M
-127 -65 V
.6866 g 6305 4124 M
-127 167 V
.7621 g 6178 4291 M
-127 71 V
.7969 g 6051 4362 M
-127 -16 V
.8067 g 5924 4346 M
-127 -39 V
.8128 g 5797 4307 M
-127 -33 V
.8175 g 5670 4274 M
-127 -45 V
.7821 g 5543 4229 M
5416 4017 L
.604 g 5416 4017 M
5289 3335 L
.5262 g 5289 3335 M
-127 237 V
.7923 g 7794 5119 M
7667 4701 L
.788 g 7667 4701 M
-127 299 V
.881 g 7540 5000 M
-126 16 V
.8872 g 7414 5016 M
-127 -87 V
.8733 g 7287 4929 M
-127 -74 V
.8699 g 7160 4855 M
-127 -41 V
.8766 g 7033 4814 M
-127 -28 V
.8816 g 6906 4786 M
-127 -48 V
.8717 g 6779 4738 M
-127 -95 V
.8614 g 6652 4643 M
-127 -50 V
stroke
.8717 g 6525 4593 M
-127 -3 V
.882 g 6398 4590 M
-127 -51 V
.8767 g 6271 4539 M
-127 -72 V
.8695 g 6144 4467 M
-127 -59 V
.8732 g 6017 4408 M
-127 -23 V
.889 g 5890 4385 M
-127 -5 V
.8814 g 5763 4380 M
5636 4252 L
.7368 g 5636 4252 M
5509 3636 L
.7424 g 5509 3636 M
-127 542 V
.7424 g 3617 5662 M
220 -620 V
.7368 g 3837 5042 M
219 538 V
.8814 g 4056 5580 M
220 50 V
.889 g 4276 5630 M
220 -73 V
.8732 g 4496 5557 M
220 -55 V
.8695 g 4716 5502 M
220 -19 V
.8767 g 4936 5483 M
220 -6 V
.882 g 5156 5477 M
220 -28 V
.8717 g 5376 5449 M
220 -75 V
.8614 g 5596 5374 M
219 -28 V
.8717 g 5815 5346 M
220 16 V
.8816 g 6035 5362 M
220 -29 V
.8766 g 6255 5333 M
220 -50 V
.8699 g 6475 5283 M
220 -37 V
.8733 g 6695 5246 M
220 -5 V
.8872 g 6915 5241 M
220 10 V
.881 g 7135 5251 M
220 -95 V
.788 g 7355 5156 M
219 -377 V
.7923 g 7574 4779 M
220 340 V
.5262 g 3490 4978 M
220 -315 V
.604 g 3710 4663 M
219 604 V
.7821 g 3929 5267 M
220 133 V
.8175 g 4149 5400 M
220 -32 V
.8128 g 4369 5368 M
220 -46 V
.8067 g 4589 5322 M
220 -38 V
.7969 g 4809 5284 M
220 -63 V
.7621 g 5029 5221 M
220 -149 V
.6866 g 5249 5072 M
220 -245 V
.6416 g 5469 4827 M
219 -13 V
.694 g 5688 4814 M
220 189 V
.7687 g 5908 5003 M
220 87 V
.8018 g 6128 5090 M
220 4 V
.8114 g 6348 5094 M
220 -18 V
.8179 g 6568 5076 M
220 -11 V
.8239 g 6788 5065 M
220 -20 V
.7987 g 7008 5045 M
220 -149 V
.6833 g 7228 4896 M
220 -422 V
.6523 g 7448 4474 M
219 227 V
.8021 g 3363 5536 M
220 -300 V
.8012 g 3583 5236 M
220 239 V
.8741 g 3803 5475 M
219 29 V
.8805 g 4022 5504 M
220 -58 V
.8695 g 4242 5446 M
220 -48 V
.8666 g 4462 5398 M
220 -22 V
stroke
.871 g 4682 5376 M
220 -16 V
.8725 g 4902 5360 M
220 -35 V
.8647 g 5122 5325 M
220 -57 V
.8584 g 5342 5268 M
220 -28 V
.8649 g 5562 5240 M
219 0 V
.8726 g 5781 5240 M
220 -23 V
.8712 g 6001 5217 M
220 -41 V
.8671 g 6221 5176 M
220 -34 V
.8699 g 6441 5142 M
220 -10 V
.8799 g 6661 5132 M
220 -2 V
.8745 g 6881 5130 M
220 -80 V
.8174 g 7101 5050 M
220 -232 V
.8189 g 7321 4818 M
219 182 V
.8583 g 3236 5571 M
220 -219 V
.8515 g 3456 5352 M
220 132 V
.8947 g 3676 5484 M
219 4 V
.8956 g 3895 5488 M
220 -58 V
.8852 g 4115 5430 M
220 -45 V
.8833 g 4335 5385 M
220 -21 V
.8894 g 4555 5364 M
220 -9 V
.8955 g 4775 5355 M
220 -20 V
.8961 g 4995 5335 M
220 -35 V
.8947 g 5215 5300 M
220 -29 V
.8957 g 5435 5271 M
219 -24 V
.8948 g 5654 5247 M
220 -37 V
.8888 g 5874 5210 M
220 -47 V
.8829 g 6094 5163 M
220 -37 V
.8846 g 6314 5126 M
220 -12 V
.8939 g 6534 5114 M
220 -3 V
.8928 g 6754 5111 M
220 -60 V
.8558 g 6974 5051 M
220 -162 V
.8607 g 7194 4889 M
220 127 V
.8463 g 3109 5474 M
220 -177 V
.8435 g 3329 5297 M
220 107 V
.8815 g 3549 5404 M
219 6 V
.8843 g 3768 5410 M
220 -51 V
.8761 g 3988 5359 M
220 -43 V
.8742 g 4208 5316 M
220 -23 V
.8782 g 4428 5293 M
220 -16 V
.8808 g 4648 5277 M
220 -29 V
.8784 g 4868 5248 M
220 -39 V
.8759 g 5088 5209 M
220 -29 V
.8783 g 5308 5180 M
220 -18 V
.8807 g 5528 5162 M
219 -29 V
.8781 g 5747 5133 M
220 -40 V
.8743 g 5967 5093 M
220 -34 V
.8761 g 6187 5059 M
220 -15 V
.8836 g 6407 5044 M
220 -8 V
.881 g 6627 5036 M
220 -61 V
.848 g 6847 4975 M
220 -144 V
.8503 g 7067 4831 M
220 98 V
.8352 g 2982 5396 M
220 -169 V
.8343 g 3202 5227 M
220 107 V
stroke
.8731 g 3422 5334 M
220 9 V
.8772 g 3642 5343 M
219 -48 V
.8698 g 3861 5295 M
220 -42 V
.8678 g 4081 5253 M
220 -24 V
.8707 g 4301 5229 M
220 -20 V
.8717 g 4521 5209 M
220 -33 V
.8674 g 4741 5176 M
220 -43 V
.8642 g 4961 5133 M
220 -29 V
.8675 g 5181 5104 M
220 -14 V
.8718 g 5401 5090 M
219 -24 V
.8709 g 5620 5066 M
220 -37 V
.8681 g 5840 5029 M
220 -33 V
.8701 g 6060 4996 M
220 -15 V
.877 g 6280 4981 M
220 -11 V
.8734 g 6500 4970 M
220 -62 V
.8398 g 6720 4908 M
220 -145 V
.8409 g 6940 4763 M
220 92 V
.8339 g 2855 5356 M
220 -194 V
.8321 g 3075 5162 M
220 129 V
.8766 g 3295 5291 M
220 12 V
.8806 g 3515 5303 M
219 -51 V
.8721 g 3734 5252 M
220 -44 V
.8699 g 3954 5208 M
220 -23 V
.8736 g 4174 5185 M
220 -18 V
.8753 g 4394 5167 M
220 -32 V
.8712 g 4614 5135 M
220 -44 V
.8678 g 4834 5091 M
220 -28 V
.8713 g 5054 5063 M
220 -13 V
.8753 g 5274 5050 M
220 -26 V
.8736 g 5494 5024 M
219 -39 V
.8702 g 5713 4985 M
220 -34 V
.8723 g 5933 4951 M
220 -14 V
.8801 g 6153 4937 M
220 -8 V
.8765 g 6373 4929 M
220 -65 V
.8387 g 6593 4864 M
220 -161 V
.8405 g 6813 4703 M
220 111 V
.8284 g 2728 5334 M
220 -274 V
.8236 g 2948 5060 M
220 195 V
.8843 g 3168 5255 M
220 19 V
.888 g 3388 5274 M
220 -60 V
.8768 g 3608 5214 M
219 -47 V
.8743 g 3827 5167 M
220 -21 V
.8798 g 4047 5146 M
220 -12 V
.8841 g 4267 5134 M
220 -26 V
.8809 g 4487 5108 M
220 -45 V
.8772 g 4707 5063 M
220 -29 V
.8807 g 4927 5034 M
220 -13 V
.8837 g 5147 5021 M
220 -31 V
.8796 g 5367 4990 M
219 -44 V
.8743 g 5586 4946 M
220 -36 V
.8767 g 5806 4910 M
220 -11 V
.8867 g 6026 4899 M
220 -2 V
.8834 g 6246 4897 M
220 -70 V
stroke
.8342 g 6466 4827 M
220 -206 V
.8379 g 6686 4621 M
220 165 V
.784 g 2601 5291 M
220 -485 V
.7759 g 2821 4806 M
220 392 V
.8851 g 3041 5198 M
220 38 V
.8906 g 3261 5236 M
220 -71 V
.8759 g 3481 5165 M
219 -52 V
.8726 g 3700 5113 M
220 -20 V
.8797 g 3920 5093 M
220 -6 V
.8859 g 4140 5087 M
220 -23 V
.8805 g 4360 5064 M
220 -58 V
.874 g 4580 5006 M
220 -28 V
.8802 g 4800 4978 M
220 -2 V
.8853 g 5020 4976 M
220 -33 V
.8795 g 5240 4943 M
219 -50 V
.8727 g 5459 4893 M
220 -37 V
.8758 g 5679 4856 M
220 -6 V
.8887 g 5899 4850 M
220 7 V
.884 g 6119 4857 M
220 -86 V
.8071 g 6339 4771 M
220 -314 V
.8124 g 6559 4457 M
220 281 V
.6252 g 2474 5113 M
220 -937 V
.6371 g 2694 4176 M
220 933 V
.8754 g 2914 5109 M
220 73 V
.8871 g 3134 5182 M
220 -78 V
.8696 g 3354 5104 M
220 -57 V
.8653 g 3574 5047 M
219 -20 V
.8723 g 3793 5027 M
220 -6 V
.8757 g 4013 5021 M
220 -36 V
.8499 g 4233 4985 M
220 -135 V
.8275 g 4453 4850 M
220 -22 V
.8516 g 4673 4828 M
220 71 V
.8756 g 4893 4899 M
220 -21 V
.8725 g 5113 4878 M
220 -49 V
.8661 g 5333 4829 M
219 -37 V
.8701 g 5552 4792 M
220 -3 V
.8853 g 5772 4789 M
220 13 V
.8766 g 5992 4802 M
220 -109 V
.7518 g 6212 4693 M
220 -504 V
.7534 g 6432 4189 M
220 454 V
.6082 g 2347 5049 M
220 -983 V
.6232 g 2567 4066 M
220 993 V
.8753 g 2787 5059 M
220 74 V
.8873 g 3007 5133 M
220 -78 V
.8696 g 3227 5055 M
220 -58 V
.8652 g 3447 4997 M
219 -19 V
.8723 g 3666 4978 M
220 -6 V
.8757 g 3886 4972 M
220 -37 V
.8481 g 4106 4935 M
220 -143 V
.8241 g 4326 4792 M
220 -21 V
.85 g 4546 4771 M
220 79 V
.8756 g 4766 4850 M
220 -21 V
.8725 g 4986 4829 M
220 -50 V
stroke
.866 g 5206 4779 M
219 -37 V
.87 g 5425 4742 M
220 -2 V
.8854 g 5645 4740 M
220 13 V
.8765 g 5865 4753 M
220 -110 V
.7482 g 6085 4643 M
220 -519 V
.7496 g 6305 4124 M
220 469 V
.7762 g 2220 5146 M
220 -527 V
.7672 g 2440 4619 M
220 430 V
.8854 g 2660 5049 M
220 40 V
.8911 g 2880 5089 M
220 -72 V
.8759 g 3100 5017 M
220 -53 V
.8725 g 3320 4964 M
220 -19 V
.8799 g 3540 4945 M
219 -5 V
.8865 g 3759 4940 M
220 -23 V
.8808 g 3979 4917 M
220 -60 V
.8739 g 4199 4857 M
220 -28 V
.8805 g 4419 4829 M
220 0 V
.8858 g 4639 4829 M
220 -34 V
.8796 g 4859 4795 M
220 -50 V
.8727 g 5079 4745 M
220 -38 V
.8758 g 5299 4707 M
219 -6 V
.8891 g 5518 4701 M
220 9 V
.8842 g 5738 4710 M
220 -88 V
.8031 g 5958 4622 M
220 -331 V
.8087 g 6178 4291 M
220 299 V
.8247 g 2093 5088 M
220 -294 V
.8194 g 2313 4794 M
220 214 V
.8847 g 2533 5008 M
220 20 V
.8885 g 2753 5028 M
220 -61 V
.8769 g 2973 4967 M
220 -48 V
.8743 g 3193 4919 M
220 -21 V
.88 g 3413 4898 M
219 -11 V
.8846 g 3632 4887 M
220 -25 V
.8813 g 3852 4862 M
220 -46 V
.8774 g 4072 4816 M
220 -29 V
.8811 g 4292 4787 M
220 -12 V
.8842 g 4512 4775 M
220 -31 V
.8798 g 4732 4744 M
220 -46 V
.8743 g 4952 4698 M
220 -36 V
.8767 g 5172 4662 M
219 -10 V
.8872 g 5391 4652 M
220 -1 V
.8837 g 5611 4651 M
220 -72 V
.8316 g 5831 4579 M
220 -217 V
.8355 g 6051 4362 M
220 177 V
.8306 g 1966 5009 M
220 -208 V
.8287 g 2186 4801 M
220 142 V
.8766 g 2406 4943 M
220 14 V
.8809 g 2626 4957 M
220 -52 V
.872 g 2846 4905 M
220 -45 V
.8697 g 3066 4860 M
220 -23 V
.8735 g 3286 4837 M
219 -17 V
.8754 g 3505 4820 M
220 -31 V
.8709 g 3725 4789 M
220 -46 V
stroke
.8672 g 3945 4743 M
220 -28 V
.871 g 4165 4715 M
220 -12 V
.8753 g 4385 4703 M
220 -26 V
.8736 g 4605 4677 M
220 -39 V
.8699 g 4825 4638 M
220 -34 V
.8721 g 5045 4604 M
220 -14 V
.8803 g 5265 4590 M
219 -7 V
.8766 g 5484 4583 M
220 -67 V
.8363 g 5704 4516 M
220 -170 V
.838 g 5924 4346 M
220 121 V
.8316 g 1839 4948 M
220 -181 V
.8306 g 2059 4767 M
220 120 V
.873 g 2279 4887 M
220 11 V
.8774 g 2499 4898 M
220 -49 V
.8695 g 2719 4849 M
220 -43 V
.8674 g 2939 4806 M
220 -24 V
.8704 g 3159 4782 M
220 -19 V
.8714 g 3379 4763 M
219 -34 V
.8667 g 3598 4729 M
220 -44 V
.8632 g 3818 4685 M
220 -29 V
.8668 g 4038 4656 M
220 -12 V
.8715 g 4258 4644 M
220 -24 V
.8706 g 4478 4620 M
220 -37 V
.8677 g 4698 4583 M
220 -33 V
.8698 g 4918 4550 M
220 -15 V
.8771 g 5138 4535 M
219 -10 V
.8733 g 5357 4525 M
220 -64 V
.837 g 5577 4461 M
220 -154 V
.8382 g 5797 4307 M
220 101 V
.8429 g 1712 4930 M
220 -194 V
.8398 g 1932 4736 M
220 123 V
.882 g 2152 4859 M
220 8 V
.885 g 2372 4867 M
220 -52 V
.8762 g 2592 4815 M
220 -44 V
.8742 g 2812 4771 M
220 -22 V
.8784 g 3032 4749 M
220 -16 V
.8814 g 3252 4733 M
219 -28 V
.8788 g 3471 4705 M
220 -41 V
.876 g 3691 4664 M
220 -29 V
.8787 g 3911 4635 M
220 -16 V
.8812 g 4131 4619 M
220 -30 V
.8783 g 4351 4589 M
220 -40 V
.8742 g 4571 4549 M
220 -35 V
.8761 g 4791 4514 M
220 -14 V
.8842 g 5011 4500 M
220 -7 V
.8815 g 5231 4493 M
219 -62 V
.8453 g 5450 4431 M
220 -157 V
.8479 g 5670 4274 M
220 111 V
.8556 g 1585 4939 M
220 -254 V
.847 g 1805 4685 M
220 159 V
.897 g 2025 4844 M
220 7 V
.8977 g 2245 4851 M
220 -62 V
.8861 g 2465 4789 M
220 -47 V
stroke
.8841 g 2685 4742 M
220 -19 V
.8909 g 2905 4723 M
220 -7 V
.8983 g 3125 4716 M
220 -18 V
.8997 g 3345 4698 M
219 -33 V
.8983 g 3564 4665 M
220 -30 V
.8991 g 3784 4635 M
220 -24 V
.8974 g 4004 4611 M
220 -40 V
.8902 g 4224 4571 M
220 -50 V
.8836 g 4444 4521 M
220 -37 V
.8854 g 4664 4484 M
220 -12 V
.8957 g 4884 4472 M
220 0 V
.8946 g 5104 4472 M
219 -61 V
.8528 g 5323 4411 M
220 -182 V
.8587 g 5543 4229 M
220 151 V
.7768 g 1459 4781 M
219 -388 V
.777 g 1678 4393 M
220 332 V
.8735 g 1898 4725 M
220 41 V
.8814 g 2118 4766 M
220 -63 V
.8689 g 2338 4703 M
220 -51 V
.8655 g 2558 4652 M
220 -21 V
.8704 g 2778 4631 M
220 -14 V
.8719 g 2998 4617 M
220 -37 V
.8611 g 3218 4580 M
219 -68 V
.8524 g 3437 4512 M
220 -28 V
.8615 g 3657 4484 M
220 11 V
.872 g 3877 4495 M
220 -21 V
.8706 g 4097 4474 M
220 -42 V
.8661 g 4317 4432 M
220 -35 V
.8693 g 4537 4397 M
220 -8 V
.8806 g 4757 4389 M
220 1 V
.8742 g 4977 4390 M
219 -87 V
.8034 g 5196 4303 M
220 -286 V
.8048 g 5416 4017 M
220 235 V
.1027 g 1332 3044 M
219 -19 V
.4005 g 1551 3025 M
220 1289 V
.7506 g 1771 4314 M
220 215 V
.8055 g 1991 4529 M
220 -27 V
.8016 g 2211 4502 M
220 -48 V
.7938 g 2431 4454 M
220 -44 V
.7777 g 2651 4410 M
220 -85 V
.7148 g 2871 4325 M
220 -253 V
.5294 g 3091 4072 M
220 -630 V
.4079 g 3311 3442 M
219 31 V
.5514 g 3530 3473 M
220 552 V
.7274 g 3750 4025 M
220 176 V
.7851 g 3970 4201 M
220 23 V
.8003 g 4190 4224 M
220 -12 V
.8085 g 4410 4212 M
220 -8 V
.8144 g 4630 4204 M
220 -23 V
.7785 g 4850 4181 M
220 -195 V
.6017 g 5070 3986 M
219 -651 V
.536 g 5289 3335 M
220 301 V
.4877 g 1205 4721 M
1425 2965 L
stroke
.479 g 1425 2965 M
219 1660 V
.8819 g 1644 4625 M
220 80 V
.8931 g 1864 4705 M
220 -87 V
.8729 g 2084 4618 M
220 -60 V
.8683 g 2304 4558 M
220 -18 V
.8775 g 2524 4540 M
220 1 V
.8861 g 2744 4541 M
220 -20 V
.855 g 2964 4521 M
220 -175 V
.8255 g 3184 4346 M
219 -14 V
.8577 g 3403 4332 M
220 100 V
.885 g 3623 4432 M
220 -35 V
.8773 g 3843 4397 M
220 -56 V
.8689 g 4063 4341 M
220 -39 V
.873 g 4283 4302 M
220 0 V
.8902 g 4503 4302 M
220 19 V
.8819 g 4723 4321 M
220 -113 V
.7265 g 4943 4208 M
219 -636 V
.7326 g 5162 3572 M
220 606 V
1.000 UL
LT0
4835 1779 M
1.000 UL
LT0
.875 g 4835 1779 M
-79 5 V
1.000 UL
LT0
.875 g 4756 1784 M
-318 -19 V
1.000 UL
LT0
.875 g 4438 1765 M
-58 -13 V
1.000 UL
LT0
.875 g 4380 1752 M
-220 28 V
1.000 UL
LT0
.875 g 4160 1780 M
22 18 V
1.000 UL
LT0
.875 g 4182 1798 M
-85 72 V
1.000 UL
LT0
.875 g 4097 1870 M
-59 13 V
1.000 UL
LT0
.875 g 4038 1883 M
128 49 V
1.000 UL
LT0
.875 g 4166 1932 M
79 -5 V
1.000 UL
LT0
.875 g 4245 1927 M
318 19 V
1.000 UL
LT0
.875 g 4563 1946 M
57 14 V
1.000 UL
LT0
.875 g 4620 1960 M
219 -29 V
1.000 UL
LT0
.875 g 4839 1931 M
-21 -18 V
1.000 UL
LT0
.875 g 4818 1913 M
85 -72 V
1.000 UL
LT0
.875 g 4903 1841 M
58 -12 V
1.000 UL
LT0
.875 g 4961 1829 M
-126 -50 V
181 -156 R
1.000 UL
LT0
.875 g 5016 1623 M
-90 -1 V
1.000 UL
LT0
.875 g 4926 1622 M
-276 -17 V
1.000 UL
LT0
.875 g 4650 1605 M
-82 -9 V
1.000 UL
LT0
.875 g 4568 1596 M
-128 36 V
1.000 UL
LT0
.875 g 4440 1632 M
-50 9 V
1.000 UL
LT0
.875 g 4390 1641 M
-127 65 V
1.000 UL
LT0
.875 g 4263 1706 M
-220 28 V
1.000 UL
LT0
.875 g 4043 1734 M
-313 -7 V
1.000 UL
LT0
.875 g 3730 1727 M
-57 5 V
1.000 UL
LT0
.875 g 3673 1732 M
-203 7 V
1.000 UL
LT0
.875 g 3470 1739 M
-8 21 V
1.000 UL
LT0
.875 g 3462 1760 M
-74 62 V
1.000 UL
LT0
.875 g 3388 1822 M
-38 18 V
1.000 UL
LT0
.875 g 3350 1840 M
160 29 V
1.000 UL
LT0
.875 g 3510 1869 M
37 11 V
1.000 UL
LT0
.875 g 3547 1880 M
288 29 V
1.000 UL
LT0
.875 g 3835 1909 M
127 50 V
1.000 UL
LT0
.875 g 3962 1959 M
-34 70 V
1.000 UL
LT0
.875 g 3928 2029 M
24 13 V
1.000 UL
LT0
.875 g 3952 2042 M
33 46 V
1.000 UL
LT0
.875 g 3985 2088 M
89 2 V
1.000 UL
LT0
.875 g 4074 2090 M
277 16 V
1.000 UL
LT0
.875 g 4351 2106 M
81 9 V
1.000 UL
LT0
.875 g 4432 2115 M
130 -37 V
1.000 UL
LT0
.875 g 4562 2078 M
48 -8 V
1.000 UL
LT0
.875 g 4610 2070 M
127 -65 V
1.000 UL
LT0
.875 g 4737 2005 M
220 -28 V
1.000 UL
LT0
.875 g 4957 1977 M
313 7 V
1.000 UL
LT0
.875 g 5270 1984 M
56 -5 V
1.000 UL
LT0
.875 g 5326 1979 M
205 -7 V
1.000 UL
LT0
.875 g 5531 1972 M
7 -20 V
1.000 UL
LT0
.875 g 5538 1952 M
74 -63 V
1.000 UL
LT0
.875 g 5612 1889 M
39 -18 V
1.000 UL
LT0
.875 g 5651 1871 M
-161 -29 V
1.000 UL
LT0
.875 g 5490 1842 M
-37 -11 V
1.000 UL
LT0
.875 g 5453 1831 M
-288 -29 V
1.000 UL
LT0
.875 g 5165 1802 M
-127 -49 V
1.000 UL
LT0
.875 g 5038 1753 M
34 -71 V
1.000 UL
LT0
.875 g 5072 1682 M
-23 -12 V
1.000 UL
LT0
.875 g 5049 1670 M
-33 -47 V
176 -155 R
1.000 UL
LT0
.875 g 5192 1468 M
-95 -9 V
1.000 UL
LT0
.875 g 5097 1459 M
-235 -14 V
1.000 UL
LT0
.875 g 4862 1445 M
-102 -3 V
1.000 UL
LT0
.875 g 4760 1442 M
-145 35 V
1.000 UL
LT0
.875 g 4615 1477 M
-34 10 V
1.000 UL
LT0
.875 g 4581 1487 M
-139 60 V
1.000 UL
LT0
.875 g 4442 1547 M
-236 22 V
1.000 UL
LT0
.875 g 4206 1569 M
-284 4 V
1.000 UL
LT0
.875 g 3922 1573 M
-219 28 V
1.000 UL
LT0
.875 g 3703 1601 M
-157 54 V
1.000 UL
LT0
.875 g 3546 1655 M
-203 35 V
1.000 UL
LT0
.875 g 3343 1690 M
-300 -3 V
1.000 UL
LT0
.875 g 3043 1687 M
-54 2 V
1.000 UL
LT0
.875 g 2989 1689 M
-207 11 V
1.000 UL
LT0
.875 g 2782 1700 M
-40 21 V
1.000 UL
LT0
.875 g 2742 1721 M
-63 53 V
1.000 UL
LT0
.875 g 2679 1774 M
-12 23 V
1.000 UL
LT0
.875 g 2667 1797 M
155 33 V
1.000 UL
LT0
.875 g 2822 1830 M
42 7 V
1.000 UL
LT0
.875 g 2864 1837 M
267 32 V
1.000 UL
LT0
.875 g 3131 1869 M
98 53 V
1.000 UL
LT0
.875 g 3229 1922 M
16 64 V
1.000 UL
LT0
.875 g 3245 1986 M
127 49 V
1.000 UL
LT0
.875 g 3372 2035 M
237 35 V
1.000 UL
LT0
.875 g 3609 2070 M
156 46 V
1.000 UL
LT0
.875 g 3765 2116 M
-12 68 V
1.000 UL
LT0
.875 g 3753 2184 M
8 12 V
1.000 UL
LT0
.875 g 3761 2196 M
48 47 V
1.000 UL
LT0
.875 g 3809 2243 M
95 9 V
1.000 UL
LT0
.875 g 3904 2252 M
234 14 V
1.000 UL
LT0
.875 g 4138 2266 M
103 3 V
1.000 UL
LT0
.875 g 4241 2269 M
145 -35 V
1.000 UL
LT0
.875 g 4386 2234 M
33 -10 V
1.000 UL
LT0
.875 g 4419 2224 M
139 -60 V
1.000 UL
LT0
.875 g 4558 2164 M
237 -22 V
1.000 UL
LT0
.875 g 4795 2142 M
283 -4 V
1.000 UL
LT0
.875 g 5078 2138 M
220 -28 V
1.000 UL
LT0
.875 g 5298 2110 M
156 -54 V
1.000 UL
LT0
.875 g 5454 2056 M
203 -35 V
1.000 UL
LT0
.875 g 5657 2021 M
301 3 V
1.000 UL
LT0
.875 g 5958 2024 M
53 -2 V
1.000 UL
LT0
.875 g 6011 2022 M
208 -10 V
1.000 UL
LT0
.875 g 6219 2012 M
40 -22 V
1.000 UL
LT0
.875 g 6259 1990 M
62 -53 V
1.000 UL
LT0
.875 g 6321 1937 M
14 -23 V
1.000 UL
LT0
.875 g 6335 1914 M
-156 -32 V
1.000 UL
LT0
.875 g 6179 1882 M
-43 -8 V
1.000 UL
LT0
.875 g 6136 1874 M
-266 -32 V
1.000 UL
LT0
.875 g 5870 1842 M
-97 -53 V
1.000 UL
LT0
.875 g 5773 1789 M
-18 -64 V
1.000 UL
LT0
.875 g 5755 1725 M
-127 -49 V
1.000 UL
LT0
.875 g 5628 1676 M
-236 -36 V
1.000 UL
LT0
.875 g 5392 1640 M
-157 -45 V
1.000 UL
LT0
.875 g 5235 1595 M
13 -68 V
1.000 UL
LT0
.875 g 5248 1527 M
-9 -12 V
1.000 UL
LT0
.875 g 5239 1515 M
-47 -47 V
170 -154 R
1.000 UL
LT0
.875 g 5362 1314 M
-98 -18 V
1.000 UL
LT0
.875 g 5264 1296 M
-184 -11 V
1.000 UL
LT0
.875 g 5080 1285 M
-125 5 V
1.000 UL
LT0
.875 g 4955 1290 M
-180 34 V
1.000 UL
LT0
.875 g 4775 1324 M
-9 7 V
1.000 UL
LT0
.875 g 4766 1331 M
-152 55 V
1.000 UL
LT0
.875 g 4614 1386 M
-244 19 V
1.000 UL
LT0
.875 g 4370 1405 M
-264 11 V
1.000 UL
LT0
.875 g 4106 1416 M
-208 33 V
1.000 UL
LT0
.875 g 3898 1449 M
-177 45 V
1.000 UL
LT0
.875 g 3721 1494 M
-220 29 V
1.000 UL
LT0
.875 g 3501 1523 M
-262 12 V
1.000 UL
LT0
.875 g 3239 1535 M
-233 24 V
1.000 UL
LT0
.875 g 3006 1559 M
-174 46 V
1.000 UL
LT0
.875 g 2832 1605 M
-195 38 V
1.000 UL
LT0
.875 g 2637 1643 M
-288 2 V
1.000 UL
LT0
.875 g 2349 1645 M
-28 -1 V
1.000 UL
LT0
.875 g 2321 1644 M
-223 18 V
1.000 UL
LT0
.875 g 2098 1662 M
-78 21 V
1.000 UL
LT0
.875 g 2020 1683 M
-51 43 V
1.000 UL
LT0
.875 g 1969 1726 M
21 27 V
1.000 UL
LT0
.875 g 1990 1753 M
153 41 V
1.000 UL
LT0
.875 g 2143 1794 M
27 1 V
1.000 UL
LT0
.875 g 2170 1795 M
245 35 V
1.000 UL
LT0
.875 g 2415 1830 M
84 55 V
1.000 UL
LT0
.875 g 2499 1885 M
48 59 V
1.000 UL
LT0
.875 g 2547 1944 M
149 47 V
1.000 UL
LT0
.875 g 2696 1991 M
200 40 V
1.000 UL
LT0
.875 g 2896 2031 M
127 50 V
1.000 UL
LT0
.875 g 3023 2081 M
54 59 V
1.000 UL
LT0
.875 g 3077 2140 M
105 52 V
1.000 UL
LT0
.875 g 3182 2192 M
205 39 V
1.000 UL
LT0
.875 g 3387 2231 M
170 44 V
1.000 UL
LT0
.875 g 3557 2275 M
9 65 V
1.000 UL
LT0
.875 g 3566 2340 M
-6 7 V
1.000 UL
LT0
.875 g 3560 2347 M
79 50 V
1.000 UL
LT0
.875 g 3639 2397 M
97 18 V
1.000 UL
LT0
.875 g 3736 2415 M
185 11 V
1.000 UL
LT0
.875 g 3921 2426 M
125 -4 V
1.000 UL
LT0
.875 g 4046 2422 M
179 -35 V
1.000 UL
LT0
.875 g 4225 2387 M
9 -6 V
1.000 UL
LT0
.875 g 4234 2381 M
152 -55 V
1.000 UL
LT0
.875 g 4386 2326 M
244 -19 V
1.000 UL
LT0
.875 g 4630 2307 M
265 -11 V
1.000 UL
LT0
.875 g 4895 2296 M
208 -34 V
1.000 UL
LT0
.875 g 5103 2262 M
181 -43 V
1.000 UL
LT0
.875 g 5284 2219 M
220 -29 V
1.000 UL
LT0
.875 g 5504 2190 M
259 -13 V
1.000 UL
LT0
.875 g 5763 2177 M
231 -24 V
1.000 UL
LT0
.875 g 5994 2153 M
176 -46 V
1.000 UL
LT0
.875 g 6170 2107 M
194 -39 V
1.000 UL
LT0
.875 g 6364 2068 M
288 -2 V
1.000 UL
LT0
.875 g 6652 2066 M
28 1 V
1.000 UL
LT0
.875 g 6680 2067 M
224 -17 V
1.000 UL
LT0
.875 g 6904 2050 M
82 -23 V
1.000 UL
LT0
.875 g 6986 2027 M
49 -40 V
1.000 UL
LT0
.875 g 7035 1987 M
-22 -29 V
1.000 UL
LT0
.875 g 7013 1958 M
-155 -40 V
1.000 UL
LT0
.875 g 6858 1918 M
-27 -2 V
1.000 UL
LT0
.875 g 6831 1916 M
-244 -35 V
1.000 UL
LT0
.875 g 6587 1881 M
-83 -55 V
1.000 UL
LT0
.875 g 6504 1826 M
-50 -60 V
1.000 UL
LT0
.875 g 6454 1766 M
-148 -46 V
1.000 UL
LT0
.875 g 6306 1720 M
-194 -41 V
1.000 UL
LT0
.875 g 6112 1679 M
-128 -50 V
1.000 UL
LT0
.875 g 5984 1629 M
-59 -58 V
1.000 UL
LT0
.875 g 5925 1571 M
-106 -52 V
1.000 UL
LT0
.875 g 5819 1519 M
-204 -40 V
1.000 UL
LT0
.875 g 5615 1479 M
-171 -43 V
1.000 UL
LT0
.875 g 5444 1436 M
-10 -65 V
1.000 UL
LT0
.875 g 5434 1371 M
6 -6 V
1.000 UL
LT0
.875 g 5440 1365 M
-78 -51 V
3066 2383 M
1.000 UL
LT0
.875 g 3066 2383 M
58 15 V
1.000 UL
LT0
.875 g 3124 2398 M
180 42 V
1.000 UL
LT0
.875 g 3304 2440 M
19 43 V
2577 2192 M
1.000 UL
LT0
.875 g 2577 2192 M
37 8 V
1.000 UL
LT0
.875 g 2614 2200 M
132 49 V
1.000 UL
LT0
.875 g 2746 2249 M
70 36 V
2007 1969 M
1.000 UL
LT0
.875 g 2007 1969 M
104 32 V
1.000 UL
LT0
.875 g 2111 2001 M
123 50 V
1.000 UL
LT0
.875 g 2234 2051 M
12 12 V
1505 1773 M
1.000 UL
LT0
.875 g 1505 1773 M
149 23 V
1.000 UL
LT0
.875 g 1654 1796 M
74 57 V
1.000 UL
LT0
.875 g 1728 1853 M
30 19 V
1860 726 R
955 -125 R
1.000 UL
LT0
.875 g 4573 2473 M
-84 7 V
1.000 UL
LT0
.875 g 4489 2480 M
-250 17 V
1.000 UL
LT0
.875 g 4239 2497 M
-111 34 V
2162 1532 M
1.000 UL
LT0
.875 g 2162 1532 M
-68 14 V
1.000 UL
LT0
.875 g 2094 1546 M
-190 40 V
1.000 UL
LT0
.875 g 1904 1586 M
-180 3 V
3727 770 R
1.000 UL
LT0
.875 g 5451 2359 M
-82 7 V
1.000 UL
LT0
.875 g 5369 2366 M
-222 28 V
1.000 UL
LT0
.875 g 5147 2394 M
-137 23 V
3008 1422 M
1.000 UL
LT0
.875 g 3008 1422 M
-36 9 V
1.000 UL
LT0
.875 g 2972 1431 M
-217 29 V
1.000 UL
LT0
.875 g 2755 1460 M
-161 16 V
3808 759 R
1.000 UL
LT0
.875 g 6402 2235 M
-156 16 V
1.000 UL
LT0
.875 g 6246 2251 M
-217 30 V
1.000 UL
LT0
.875 g 6029 2281 M
-68 12 V
3995 1294 M
1.000 UL
LT0
.875 g 3995 1294 M
-141 23 V
1.000 UL
LT0
.875 g 3854 1317 M
-223 28 V
1.000 UL
LT0
.875 g 3631 1345 M
-51 3 V
3709 772 R
1.000 UL
LT0
.875 g 7289 2120 M
-192 6 V
1.000 UL
LT0
.875 g 7097 2126 M
-190 40 V
1.000 UL
LT0
.875 g 6907 2166 M
-67 13 V
4872 1180 M
1.000 UL
LT0
.875 g 4872 1180 M
-111 34 V
1.000 UL
LT0
.875 g 4761 1214 M
-250 17 V
1.000 UL
LT0
.875 g 4511 1231 M
-83 7 V
3366 816 R
7243 1839 M
1.000 UL
LT0
.875 g 7243 1839 M
29 19 V
1.000 UL
LT0
.875 g 7272 1858 M
76 56 V
1.000 UL
LT0
.875 g 7348 1914 M
155 27 V
6736 1641 M
1.000 UL
LT0
.875 g 6736 1641 M
32 19 V
1.000 UL
LT0
.875 g 6768 1660 M
122 50 V
1.000 UL
LT0
.875 g 6890 1710 M
100 31 V
6187 1427 M
1.000 UL
LT0
.875 g 6187 1427 M
68 35 V
1.000 UL
LT0
.875 g 6255 1462 M
132 49 V
1.000 UL
LT0
.875 g 6387 1511 M
55 16 V
5677 1228 M
1.000 UL
LT0
.875 g 5677 1228 M
21 43 V
1.000 UL
LT0
.875 g 5698 1271 M
178 42 V
1.000 UL
LT0
.875 g 5876 1313 M
58 16 V
4489 1824 M
1.000 UL
LT0
.825 g 4489 1824 M
-168 19 V
1.000 UL
LT0
.825 g 4321 1843 M
-5 4 V
1.000 UL
LT0
.825 g 4316 1847 M
104 35 V
1.000 UL
LT0
.825 g 4420 1882 M
69 -58 V
2402 2123 M
1.000 UL
LT0
.825 g 2402 2123 M
75 29 V
1.000 UL
LT0
.825 g 2477 2152 M
191 41 V
1.000 UL
LT0
.825 g 2668 2193 M
178 43 V
1.000 UL
LT0
.825 g 2846 2236 M
146 47 V
1.000 UL
LT0
.825 g 2992 2283 M
137 48 V
1.000 UL
LT0
.825 g 3129 2331 M
161 45 V
1.000 UL
LT0
.825 g 3290 2376 M
143 48 V
1.000 UL
LT0
.825 g 3433 2424 M
-1 66 V
1.000 UL
LT0
.825 g 3432 2490 M
-51 15 V
1454 1754 M
1.000 UL
LT0
.825 g 1454 1754 M
50 -4 V
1.000 UL
LT0
.825 g 1504 1750 M
259 32 V
1.000 UL
LT0
.825 g 1763 1782 M
114 52 V
1.000 UL
LT0
.825 g 1877 1834 M
94 53 V
1.000 UL
LT0
.825 g 1971 1887 M
121 51 V
1.000 UL
LT0
.825 g 2092 1938 M
112 51 V
1.000 UL
LT0
.825 g 2204 1989 M
79 56 V
1.000 UL
LT0
.825 g 2283 2045 M
60 55 V
1316 492 R
1.000 UL
LT0
.825 g 3659 2592 M
-64 -3 V
1220 1655 M
1.000 UL
LT0
.825 g 1220 1655 M
-6 5 V
3175 1401 M
1.000 UL
LT0
.825 g 3175 1401 M
-175 41 V
1.000 UL
LT0
.825 g 3000 1442 M
-192 39 V
1.000 UL
LT0
.825 g 2808 1481 M
-211 32 V
1.000 UL
LT0
.825 g 2597 1513 M
-216 30 V
1.000 UL
LT0
.825 g 2381 1543 M
-202 36 V
1.000 UL
LT0
.825 g 2179 1579 M
-212 32 V
1.000 UL
LT0
.825 g 1967 1611 M
-296 -1 V
1.000 UL
LT0
.825 g 1671 1610 M
-35 -9 V
4973 1167 M
1.000 UL
LT0
.825 g 4973 1167 M
9 19 V
1.000 UL
LT0
.825 g 4982 1186 M
-146 57 V
1.000 UL
LT0
.825 g 4836 1243 M
-229 25 V
1.000 UL
LT0
.825 g 4607 1268 M
-239 21 V
1.000 UL
LT0
.825 g 4368 1289 M
-225 27 V
1.000 UL
LT0
.825 g 4143 1316 M
-231 24 V
1.000 UL
LT0
.825 g 3912 1340 M
-250 17 V
1.000 UL
LT0
.825 g 3662 1357 M
-256 14 V
1.000 UL
LT0
.825 g 3406 1371 M
-128 16 V
4478 652 R
1.000 UL
LT0
.825 g 7756 2039 M
-28 24 V
-154 -95 R
1.000 UL
LT0
.825 g 7574 1968 M
-129 0 V
1.000 UL
LT0
.825 g 7445 1968 M
-250 -33 V
1.000 UL
LT0
.825 g 7195 1935 M
-3 66 V
1.000 UL
LT0
.825 g 7192 2001 M
-38 32 V
1.000 UL
LT0
.825 g 7154 2033 M
-143 57 V
1.000 UL
LT0
.825 g 7011 2090 M
288 0 V
1.000 UL
LT0
.825 g 7299 2090 M
114 14 V
5617 1205 M
1.000 UL
LT0
.825 g 5617 1205 M
-53 17 V
1.000 UL
LT0
.825 g 5564 1222 M
-3 66 V
1.000 UL
LT0
.825 g 5561 1288 M
139 48 V
1.000 UL
LT0
.825 g 5700 1336 M
158 46 V
1.000 UL
LT0
.825 g 5858 1382 M
133 48 V
1.000 UL
LT0
.825 g 5991 1430 M
145 48 V
1.000 UL
LT0
.825 g 6136 1478 M
176 43 V
1.000 UL
LT0
.825 g 6312 1521 M
177 43 V
1.000 UL
LT0
.825 g 6489 1564 M
126 50 V
1.000 UL
LT0
.825 g 6615 1614 M
74 56 V
1.000 UL
LT0
.825 g 6689 1670 M
74 56 V
1.000 UL
LT0
.825 g 6763 1726 M
106 53 V
1.000 UL
LT0
.825 g 6869 1779 M
116 50 V
1.000 UL
LT0
.825 g 6985 1829 M
93 54 V
1.000 UL
LT0
.825 g 7078 1883 M
91 42 V
1.000 UL
LT0
.825 g 7169 1925 M
-115 -38 V
1.000 UL
LT0
.825 g 7054 1887 M
-162 -45 V
1.000 UL
LT0
.825 g 6892 1842 M
-138 -48 V
1.000 UL
LT0
.825 g 6754 1794 M
-153 -47 V
1.000 UL
LT0
.825 g 6601 1747 M
-183 -42 V
1.000 UL
LT0
.825 g 6418 1705 M
-171 -44 V
1.000 UL
LT0
.825 g 6247 1661 M
-129 -49 V
1.000 UL
LT0
.825 g 6118 1612 M
-85 -55 V
1.000 UL
LT0
.825 g 6033 1557 M
-75 -56 V
1.000 UL
LT0
.825 g 5958 1501 M
-105 -53 V
1.000 UL
LT0
.825 g 5853 1448 M
-119 -50 V
1.000 UL
LT0
.825 g 5734 1398 M
-96 -54 V
1.000 UL
LT0
.825 g 5638 1344 M
-116 -51 V
1.000 UL
LT0
.825 g 5522 1293 M
-257 -32 V
1.000 UL
LT0
.825 g 5265 1261 M
-107 -6 V
1.000 UL
LT0
.825 g 5158 1255 M
-292 0 V
1.000 UL
LT0
.825 g 4866 1255 M
-211 32 V
1.000 UL
LT0
.825 g 4655 1287 M
-200 36 V
1.000 UL
LT0
.825 g 4455 1323 M
-213 31 V
1.000 UL
LT0
.825 g 4242 1354 M
-206 35 V
1.000 UL
LT0
.825 g 4036 1389 M
-188 40 V
1.000 UL
LT0
.825 g 3848 1429 M
-198 38 V
1.000 UL
LT0
.825 g 3650 1467 M
-219 28 V
1.000 UL
LT0
.825 g 3431 1495 M
-240 21 V
1.000 UL
LT0
.825 g 3191 1516 M
-249 17 V
1.000 UL
LT0
.825 g 2942 1533 M
-233 24 V
1.000 UL
LT0
.825 g 2709 1557 M
-224 27 V
1.000 UL
LT0
.825 g 2485 1584 M
-237 22 V
1.000 UL
LT0
.825 g 2248 1606 M
-226 26 V
1.000 UL
LT0
.825 g 2022 1632 M
-149 56 V
1.000 UL
LT0
.825 g 1873 1688 M
-18 16 V
1.000 UL
LT0
.825 g 1855 1704 M
4 66 V
1.000 UL
LT0
.825 g 1859 1770 M
136 48 V
1.000 UL
LT0
.825 g 1995 1818 M
157 46 V
1.000 UL
LT0
.825 g 2152 1864 M
135 48 V
1.000 UL
LT0
.825 g 2287 1912 M
148 47 V
1.000 UL
LT0
.825 g 2435 1959 M
178 43 V
1.000 UL
LT0
.825 g 2613 2002 M
162 45 V
1.000 UL
LT0
.825 g 2775 2047 M
126 50 V
1.000 UL
LT0
.825 g 2901 2097 M
88 54 V
1.000 UL
LT0
.825 g 2989 2151 M
73 57 V
1.000 UL
LT0
.825 g 3062 2208 M
102 52 V
1.000 UL
LT0
.825 g 3164 2260 M
115 51 V
1.000 UL
LT0
.825 g 3279 2311 M
94 54 V
1.000 UL
LT0
.825 g 3373 2365 M
112 52 V
1.000 UL
LT0
.825 g 3485 2417 M
252 33 V
1.000 UL
LT0
.825 g 3737 2450 M
106 7 V
1.000 UL
LT0
.825 g 3843 2457 M
295 1 V
1.000 UL
LT0
.825 g 4138 2458 M
214 -31 V
1.000 UL
LT0
.825 g 4352 2427 M
201 -36 V
1.000 UL
LT0
.825 g 4553 2391 M
215 -30 V
1.000 UL
LT0
.825 g 4768 2361 M
207 -34 V
1.000 UL
LT0
.825 g 4975 2327 M
190 -40 V
1.000 UL
LT0
.825 g 5165 2287 M
196 -38 V
1.000 UL
LT0
.825 g 5361 2249 M
220 -29 V
1.000 UL
LT0
.825 g 5581 2220 M
246 -18 V
1.000 UL
LT0
.825 g 5827 2202 M
252 -16 V
1.000 UL
LT0
.825 g 6079 2186 M
235 -23 V
1.000 UL
LT0
.825 g 6314 2163 M
227 -26 V
1.000 UL
LT0
.825 g 6541 2137 M
240 -21 V
1.000 UL
LT0
.825 g 6781 2116 M
184 -20 V
1.000 UL
LT0
.825 g 6965 2096 M
-171 26 V
1.000 UL
LT0
.825 g 6794 2122 M
-200 36 V
1.000 UL
LT0
.825 g 6594 2158 M
-214 31 V
1.000 UL
LT0
.825 g 6380 2189 M
-207 33 V
1.000 UL
LT0
.825 g 6173 2222 M
-190 41 V
1.000 UL
LT0
.825 g 5983 2263 M
-189 40 V
1.000 UL
LT0
.825 g 5794 2303 M
-219 29 V
1.000 UL
LT0
.825 g 5575 2332 M
-249 18 V
1.000 UL
LT0
.825 g 5326 2350 M
-248 17 V
1.000 UL
LT0
.825 g 5078 2367 M
-230 25 V
1.000 UL
LT0
.825 g 4848 2392 M
-224 27 V
1.000 UL
LT0
.825 g 4624 2419 M
-237 21 V
1.000 UL
LT0
.825 g 4387 2440 M
-226 26 V
1.000 UL
LT0
.825 g 4161 2466 M
-145 58 V
1.000 UL
LT0
.825 g 4016 2524 M
8 21 V
5406 1123 M
1.000 UL
LT0
.825 g 5406 1123 M
-62 -5 V
2334 1972 M
1.000 UL
LT0
.775 g 2334 1972 M
-70 -17 V
1.000 UL
LT0
.775 g 2264 1955 M
32 22 V
1.000 UL
LT0
.775 g 2296 1977 M
36 61 V
1.000 UL
LT0
.775 g 2332 2038 M
40 61 V
1.000 UL
LT0
.775 g 2372 2099 M
132 49 V
1.000 UL
LT0
.775 g 2504 2148 M
218 38 V
1.000 UL
LT0
.775 g 2722 2186 M
224 37 V
1.000 UL
LT0
.775 g 2946 2223 M
12 3 V
1.000 UL
LT0
.775 g 2958 2226 M
-6 -4 V
1.000 UL
LT0
.775 g 2952 2222 M
-21 -63 V
1.000 UL
LT0
.775 g 2931 2159 M
-56 -59 V
1.000 UL
LT0
.775 g 2875 2100 M
-124 -50 V
1.000 UL
LT0
.775 g 2751 2050 M
-192 -41 V
1.000 UL
LT0
.775 g 2559 2009 M
-225 -37 V
3711 244 R
1.000 UL
LT0
.775 g 6045 2216 M
-168 5 V
1.000 UL
LT0
.775 g 5877 2221 M
-266 11 V
1.000 UL
LT0
.775 g 5611 2232 M
-221 28 V
1.000 UL
LT0
.775 g 5390 2260 M
-179 45 V
1.000 UL
LT0
.775 g 5211 2305 M
-124 35 V
1.000 UL
LT0
.775 g 5087 2340 M
196 -7 V
1.000 UL
LT0
.775 g 5283 2333 M
264 -12 V
1.000 UL
LT0
.775 g 5547 2321 M
218 -29 V
1.000 UL
LT0
.775 g 5765 2292 M
173 -47 V
1.000 UL
LT0
.775 g 5938 2245 M
107 -29 V
3987 1361 M
1.000 UL
LT0
.775 g 3987 1361 M
-18 1 V
1.000 UL
LT0
.775 g 3969 1362 M
-276 7 V
1.000 UL
LT0
.775 g 3693 1369 M
-272 8 V
1.000 UL
LT0
.775 g 3421 1377 M
-222 28 V
1.000 UL
LT0
.775 g 3199 1405 M
-170 48 V
1.000 UL
LT0
.775 g 3029 1453 M
-168 49 V
1.000 UL
LT0
.775 g 2861 1502 M
-75 15 V
1.000 UL
LT0
.775 g 2786 1517 M
97 -6 V
1.000 UL
LT0
.775 g 2883 1511 M
277 -7 V
1.000 UL
LT0
.775 g 3160 1504 M
257 -14 V
1.000 UL
LT0
.775 g 3417 1490 M
218 -29 V
1.000 UL
LT0
.775 g 3635 1461 M
179 -45 V
1.000 UL
LT0
.775 g 3814 1416 M
159 -52 V
1.000 UL
LT0
.775 g 3973 1364 M
14 -3 V
2251 169 R
1.000 UL
LT0
.775 g 6238 1530 M
-154 -28 V
1.000 UL
LT0
.775 g 6084 1502 M
29 45 V
1.000 UL
LT0
.775 g 6113 1547 M
55 59 V
1.000 UL
LT0
.775 g 6168 1606 M
130 49 V
1.000 UL
LT0
.775 g 6298 1655 M
206 39 V
1.000 UL
LT0
.775 g 6504 1694 M
134 24 V
1.000 UL
LT0
.775 g 6638 1718 M
-28 -38 V
1.000 UL
LT0
.775 g 6610 1680 M
-46 -60 V
1.000 UL
LT0
.775 g 6564 1620 M
-124 -50 V
1.000 UL
LT0
.775 g 6440 1570 M
-202 -40 V
3701 2587 M
1.000 UL
LT0
.775 g 3701 2587 M
-128 -7 V
1234 1653 M
1.000 UL
LT0
.775 g 1234 1653 M
-12 10 V
2759 887 R
1.000 UL
LT0
.775 g 3981 2550 M
-19 -47 V
1.000 UL
LT0
.775 g 3962 2503 M
57 -24 V
1.000 UL
LT0
.775 g 4019 2479 M
-121 -1 V
1.000 UL
LT0
.775 g 3898 2478 M
-252 -16 V
1.000 UL
LT0
.775 g 3646 2462 M
-120 -14 V
1.000 UL
LT0
.775 g 3526 2448 M
-3 30 V
1.000 UL
LT0
.775 g 3523 2478 M
-118 37 V
1621 1603 M
1.000 UL
LT0
.775 g 1621 1603 M
89 22 V
1.000 UL
LT0
.775 g 1710 1625 M
222 3 V
1.000 UL
LT0
.775 g 1932 1628 M
-98 45 V
1.000 UL
LT0
.775 g 1834 1673 M
-47 40 V
1.000 UL
LT0
.775 g 1787 1713 M
-16 50 V
1.000 UL
LT0
.775 g 1771 1763 M
-199 -22 V
1.000 UL
LT0
.775 g 1572 1741 M
-126 9 V
6272 274 R
1.000 UL
LT0
.775 g 7718 2024 M
-57 48 V
-47 -88 R
1.000 UL
LT0
.775 g 7614 1984 M
-286 -1 V
1.000 UL
LT0
.775 g 7328 1983 M
-15 -2 V
1.000 UL
LT0
.775 g 7313 1981 M
0 4 V
1.000 UL
LT0
.775 g 7313 1985 M
-90 75 V
1.000 UL
LT0
.775 g 7223 2060 M
-9 4 V
1.000 UL
LT0
.775 g 7214 2064 M
18 0 V
1.000 UL
LT0
.775 g 7232 2064 M
251 31 V
5592 1195 M
1.000 UL
LT0
.775 g 5592 1195 M
-121 39 V
1.000 UL
LT0
.775 g 5471 1234 M
-4 27 V
1.000 UL
LT0
.775 g 5467 1261 M
-106 -13 V
1.000 UL
LT0
.775 g 5361 1248 M
-256 -14 V
1.000 UL
LT0
.775 g 5105 1234 M
-135 -1 V
1.000 UL
LT0
.775 g 4970 1233 M
64 -27 V
1.000 UL
LT0
.775 g 5034 1206 M
-21 -45 V
417 -29 R
1.000 UL
LT0
.775 g 5430 1132 M
-125 -9 V
2506 2016 M
1.000 UL
LT0
.725 g 2506 2016 M
-141 -22 V
1.000 UL
LT0
.725 g 2365 1994 M
17 38 V
1.000 UL
LT0
.725 g 2382 2032 M
16 64 V
1.000 UL
LT0
.725 g 2398 2096 M
133 49 V
1.000 UL
LT0
.725 g 2531 2145 M
244 34 V
1.000 UL
LT0
.725 g 2775 2179 M
107 17 V
1.000 UL
LT0
.725 g 2882 2196 M
-9 -30 V
1.000 UL
LT0
.725 g 2873 2166 M
-23 -63 V
1.000 UL
LT0
.725 g 2850 2103 M
-123 -50 V
1.000 UL
LT0
.725 g 2727 2053 M
-221 -37 V
3362 223 R
1.000 UL
LT0
.725 g 5868 2239 M
-227 5 V
1.000 UL
LT0
.725 g 5641 2244 M
-222 27 V
1.000 UL
LT0
.725 g 5419 2271 M
-147 45 V
1.000 UL
LT0
.725 g 5272 2316 M
246 -6 V
1.000 UL
LT0
.725 g 5518 2310 M
217 -30 V
1.000 UL
LT0
.725 g 5735 2280 M
133 -41 V
3855 1378 M
1.000 UL
LT0
.725 g 3855 1378 M
-131 3 V
1.000 UL
LT0
.725 g 3724 1381 M
-287 2 V
1.000 UL
LT0
.725 g 3437 1383 M
-224 28 V
1.000 UL
LT0
.725 g 3213 1411 M
-156 53 V
1.000 UL
LT0
.725 g 3057 1464 M
-98 31 V
1.000 UL
LT0
.725 g 2959 1495 M
170 -3 V
1.000 UL
LT0
.725 g 3129 1492 M
274 -7 V
1.000 UL
LT0
.725 g 3403 1485 M
218 -30 V
1.000 UL
LT0
.725 g 3621 1455 M
160 -52 V
1.000 UL
LT0
.725 g 3781 1403 M
74 -25 V
2536 199 R
1.000 UL
LT0
.725 g 6391 1577 M
-200 -34 V
1.000 UL
LT0
.725 g 6191 1543 M
27 56 V
1.000 UL
LT0
.725 g 6218 1599 M
132 49 V
1.000 UL
LT0
.725 g 6350 1648 M
186 30 V
1.000 UL
LT0
.725 g 6536 1678 M
-23 -51 V
1.000 UL
LT0
.725 g 6513 1627 M
-122 -50 V
3742 2581 M
1.000 UL
LT0
.725 g 3742 2581 M
-191 -9 V
1248 1651 M
1.000 UL
LT0
.725 g 1248 1651 M
-18 15 V
2707 890 R
1.000 UL
LT0
.725 g 3937 2556 M
-23 -63 V
1.000 UL
LT0
.725 g 3914 2493 M
-323 -20 V
1.000 UL
LT0
.725 g 3591 2473 M
-163 51 V
1607 1605 M
1.000 UL
LT0
.725 g 1607 1605 M
143 35 V
1.000 UL
LT0
.725 g 1750 1640 M
81 1 V
1.000 UL
LT0
.725 g 1831 1641 M
-36 17 V
1.000 UL
LT0
.725 g 1795 1658 M
-76 64 V
1.000 UL
LT0
.725 g 1719 1722 M
-6 18 V
1.000 UL
LT0
.725 g 1713 1740 M
-73 -8 V
1.000 UL
LT0
.725 g 1640 1732 M
-203 15 V
6242 262 R
1.000 UL
LT0
.725 g 7679 2009 M
-84 71 V
60 -80 R
1.000 UL
LT0
.725 g 7655 2000 M
-301 -3 V
1.000 UL
LT0
.725 g 7354 1997 M
-68 57 V
1.000 UL
LT0
.725 g 7286 2054 M
267 32 V
5567 1185 M
1.000 UL
LT0
.725 g 5567 1185 M
-160 52 V
1.000 UL
LT0
.725 g 5407 1237 M
-325 -19 V
1.000 UL
LT0
.725 g 5082 1218 M
-28 -62 V
400 -15 R
1.000 UL
LT0
.725 g 5454 1141 M
-187 -12 V
2452 2023 M
1.000 UL
LT0
.675 g 2452 2023 M
-24 -4 V
1.000 UL
LT0
.675 g 2428 2019 M
3 7 V
1.000 UL
LT0
.675 g 2431 2026 M
-7 67 V
1.000 UL
LT0
.675 g 2424 2093 M
134 48 V
1.000 UL
LT0
.675 g 2558 2141 M
261 31 V
1.000 UL
LT0
.675 g 2819 2172 M
5 -65 V
1.000 UL
LT0
.675 g 2824 2107 M
-121 -51 V
1.000 UL
LT0
.675 g 2703 2056 M
-251 -33 V
3304 230 R
1.000 UL
LT0
.675 g 5756 2253 M
-85 2 V
1.000 UL
LT0
.675 g 5671 2255 M
-224 27 V
1.000 UL
LT0
.675 g 5447 2282 M
-62 20 V
1.000 UL
LT0
.675 g 5385 2302 M
105 -3 V
1.000 UL
LT0
.675 g 5490 2299 M
216 -30 V
1.000 UL
LT0
.675 g 5706 2269 M
50 -16 V
3746 1392 M
1.000 UL
LT0
.675 g 3746 1392 M
-294 -3 V
1.000 UL
LT0
.675 g 3452 1389 M
-224 27 V
1.000 UL
LT0
.675 g 3228 1416 M
-142 59 V
1.000 UL
LT0
.675 g 3086 1475 M
-17 5 V
1.000 UL
LT0
.675 g 3069 1480 M
29 0 V
1.000 UL
LT0
.675 g 3098 1480 M
291 -1 V
1.000 UL
LT0
.675 g 3389 1479 M
217 -30 V
1.000 UL
LT0
.675 g 3606 1449 M
140 -57 V
3855 622 R
1.000 UL
LT0
.675 g 7601 2014 M
-211 -3 V
1.000 UL
LT0
.675 g 7390 2011 M
-42 35 V
1.000 UL
LT0
.675 g 7348 2046 M
188 22 V
1.000 UL
LT0
.675 g 7536 2068 M
65 -54 V
6341 1583 M
1.000 UL
LT0
.675 g 6341 1583 M
-84 -14 V
1.000 UL
LT0
.675 g 6257 1569 M
11 24 V
1.000 UL
LT0
.675 g 6268 1593 M
133 48 V
1.000 UL
LT0
.675 g 6401 1641 M
70 11 V
1.000 UL
LT0
.675 g 6471 1652 M
-9 -19 V
1.000 UL
LT0
.675 g 6462 1633 M
-121 -50 V
3783 2576 M
1.000 UL
LT0
.675 g 3783 2576 M
-255 -13 V
1262 1649 M
1.000 UL
LT0
.675 g 1262 1649 M
-24 20 V
2656 893 R
1.000 UL
LT0
.675 g 3894 2562 M
-18 -64 V
1.000 UL
LT0
.675 g 3876 2498 M
-262 -16 V
1.000 UL
LT0
.675 g 3614 2482 M
-163 51 V
1592 1606 M
1.000 UL
LT0
.675 g 1592 1606 M
173 44 V
1.000 UL
LT0
.675 g 1765 1650 M
-90 75 V
1.000 UL
LT0
.675 g 1675 1725 M
-246 19 V
5542 1176 M
1.000 UL
LT0
.675 g 5542 1176 M
-157 53 V
1.000 UL
LT0
.675 g 5385 1229 M
-263 -16 V
1.000 UL
LT0
.675 g 5122 1213 M
-28 -62 V
384 0 R
1.000 UL
LT0
.675 g 5478 1151 M
-250 -17 V
2679 2059 M
1.000 UL
LT0
.625 g 2679 2059 M
-219 -27 V
1.000 UL
LT0
.625 g 2460 2032 M
-11 57 V
1.000 UL
LT0
.625 g 2449 2089 M
136 49 V
1.000 UL
LT0
.625 g 2585 2138 M
209 24 V
1.000 UL
LT0
.625 g 2794 2162 M
5 -52 V
1.000 UL
LT0
.625 g 2799 2110 M
-120 -51 V
3704 1398 M
1.000 UL
LT0
.625 g 3704 1398 M
-236 -2 V
1.000 UL
LT0
.625 g 3468 1396 M
-225 26 V
1.000 UL
LT0
.625 g 3243 1422 M
-119 51 V
1.000 UL
LT0
.625 g 3124 1473 M
251 1 V
1.000 UL
LT0
.625 g 3375 1474 M
216 -30 V
1.000 UL
LT0
.625 g 3591 1444 M
113 -46 V
3801 628 R
1.000 UL
LT0
.625 g 7505 2026 M
-79 -1 V
1.000 UL
LT0
.625 g 7426 2025 M
-16 13 V
1.000 UL
LT0
.625 g 7410 2038 M
71 8 V
1.000 UL
LT0
.625 g 7481 2046 M
24 -20 V
3825 2571 M
1.000 UL
LT0
.625 g 3825 2571 M
-319 -17 V
1277 1647 M
1.000 UL
LT0
.625 g 1277 1647 M
-30 26 V
2604 894 R
1.000 UL
LT0
.625 g 3851 2567 M
-14 -64 V
1.000 UL
LT0
.625 g 3837 2503 M
-200 -12 V
1.000 UL
LT0
.625 g 3637 2491 M
-162 51 V
1578 1608 M
1.000 UL
LT0
.625 g 1578 1608 M
168 44 V
1.000 UL
LT0
.625 g 1746 1652 M
-82 69 V
1.000 UL
LT0
.625 g 1664 1721 M
-243 20 V
5517 1166 M
1.000 UL
LT0
.625 g 5517 1166 M
-155 54 V
1.000 UL
LT0
.625 g 5362 1220 M
-201 -12 V
1.000 UL
LT0
.625 g 5161 1208 M
-27 -62 V
368 14 R
1.000 UL
LT0
.625 g 5502 1160 M
-313 -21 V
3798 2508 M
1.000 UL
LT0
.575 g 3798 2508 M
-139 -8 V
1.000 UL
LT0
.575 g 3659 2500 M
-142 45 V
1.000 UL
LT0
.575 g 3517 2545 M
291 12 V
1.000 UL
LT0
.575 g 3808 2557 M
-10 -49 V
2655 2063 M
1.000 UL
LT0
.575 g 2655 2063 M
-172 -22 V
1.000 UL
LT0
.575 g 2483 2041 M
-8 45 V
1.000 UL
LT0
.575 g 2475 2086 M
137 48 V
1.000 UL
LT0
.575 g 2612 2134 M
158 19 V
1.000 UL
LT0
.575 g 2770 2153 M
3 -40 V
1.000 UL
LT0
.575 g 2773 2113 M
-118 -50 V
3661 1403 M
1.000 UL
LT0
.575 g 3661 1403 M
-177 -1 V
1.000 UL
LT0
.575 g 3484 1402 M
-226 26 V
1.000 UL
LT0
.575 g 3258 1428 M
-94 40 V
1.000 UL
LT0
.575 g 3164 1468 M
198 0 V
1.000 UL
LT0
.575 g 3362 1468 M
215 -30 V
1.000 UL
LT0
.575 g 3577 1438 M
84 -35 V
5457 1170 M
1.000 UL
LT0
.575 g 5457 1170 M
-279 -22 V
1.000 UL
LT0
.575 g 5178 1148 M
23 55 V
1.000 UL
LT0
.575 g 5201 1203 M
139 8 V
1.000 UL
LT0
.575 g 5340 1211 M
117 -41 V
1291 1646 M
1.000 UL
LT0
.575 g 1291 1646 M
-36 30 V
308 -66 R
1.000 UL
LT0
.575 g 1563 1610 M
164 45 V
1.000 UL
LT0
.575 g 1727 1655 M
-74 62 V
1.000 UL
LT0
.575 g 1653 1717 M
-241 20 V
2347 776 R
1.000 UL
LT0
.525 g 3759 2513 M
-77 -5 V
1.000 UL
LT0
.525 g 3682 2508 M
-79 26 V
1.000 UL
LT0
.525 g 3603 2534 M
162 7 V
1.000 UL
LT0
.525 g 3765 2541 M
-6 -28 V
2631 2066 M
1.000 UL
LT0
.525 g 2631 2066 M
-124 -16 V
1.000 UL
LT0
.525 g 2507 2050 M
-6 33 V
1.000 UL
LT0
.525 g 2501 2083 M
138 48 V
1.000 UL
LT0
.525 g 2639 2131 M
107 12 V
1.000 UL
LT0
.525 g 2746 2143 M
2 -27 V
1.000 UL
LT0
.525 g 2748 2116 M
-117 -50 V
988 -657 R
1.000 UL
LT0
.525 g 3619 1409 M
-120 -1 V
1.000 UL
LT0
.525 g 3499 1408 M
-226 26 V
1.000 UL
LT0
.525 g 3273 1434 M
-68 29 V
1.000 UL
LT0
.525 g 3205 1463 M
143 0 V
1.000 UL
LT0
.525 g 3348 1463 M
214 -31 V
1.000 UL
LT0
.525 g 3562 1432 M
57 -23 V
5383 1179 M
1.000 UL
LT0
.525 g 5383 1179 M
-156 -12 V
1.000 UL
LT0
.525 g 5227 1167 M
13 31 V
1.000 UL
LT0
.525 g 5240 1198 M
78 5 V
1.000 UL
LT0
.525 g 5318 1203 M
65 -24 V
1305 1644 M
1.000 UL
LT0
.525 g 1305 1644 M
-42 35 V
286 -67 R
1.000 UL
LT0
.525 g 1549 1612 M
160 45 V
1.000 UL
LT0
.525 g 1709 1657 M
-66 56 V
1.000 UL
LT0
.525 g 1643 1713 M
-239 21 V
2317 784 R
1.000 UL
LT0
.475 g 3721 2518 M
-16 -1 V
1.000 UL
LT0
.475 g 3705 2517 M
-16 5 V
1.000 UL
LT0
.475 g 3689 2522 M
33 2 V
1.000 UL
LT0
.475 g 3722 2524 M
-1 -6 V
2607 2069 M
1.000 UL
LT0
.475 g 2607 2069 M
-77 -10 V
1.000 UL
LT0
.475 g 2530 2059 M
-3 20 V
1.000 UL
LT0
.475 g 2527 2079 M
139 48 V
1.000 UL
LT0
.475 g 2666 2127 M
55 7 V
1.000 UL
LT0
.475 g 2721 2134 M
1 -14 V
1.000 UL
LT0
.475 g 2722 2120 M
-115 -51 V
970 -655 R
1.000 UL
LT0
.475 g 3577 1414 M
-62 0 V
1.000 UL
LT0
.475 g 3515 1414 M
-227 26 V
1.000 UL
LT0
.475 g 3288 1440 M
-42 17 V
1.000 UL
LT0
.475 g 3246 1457 M
88 1 V
1.000 UL
LT0
.475 g 3334 1458 M
213 -32 V
1.000 UL
LT0
.475 g 3547 1426 M
30 -12 V
5309 1189 M
1.000 UL
LT0
.475 g 5309 1189 M
-32 -2 V
1.000 UL
LT0
.475 g 5277 1187 M
2 6 V
1.000 UL
LT0
.475 g 5279 1193 M
16 1 V
1.000 UL
LT0
.475 g 5295 1194 M
14 -5 V
1319 1642 M
1.000 UL
LT0
.475 g 1319 1642 M
-48 40 V
263 -68 R
1.000 UL
LT0
.475 g 1534 1614 M
156 46 V
1.000 UL
LT0
.475 g 1690 1660 M
-58 49 V
1.000 UL
LT0
.475 g 1632 1709 M
-237 22 V
1188 341 R
1.000 UL
LT0
.425 g 2583 2072 M
-29 -4 V
1.000 UL
LT0
.425 g 2554 2068 M
-2 8 V
1.000 UL
LT0
.425 g 2552 2076 M
141 48 V
1.000 UL
LT0
.425 g 2693 2124 M
4 0 V
1.000 UL
LT0
.425 g 2697 2124 M
0 -1 V
1.000 UL
LT0
.425 g 2697 2123 M
-114 -51 V
951 -652 R
1.000 UL
LT0
.425 g 3534 1420 M
-4 0 V
1.000 UL
LT0
.425 g 3530 1420 M
-228 25 V
1.000 UL
LT0
.425 g 3302 1445 M
-15 7 V
1.000 UL
LT0
.425 g 3287 1452 M
33 0 V
1.000 UL
LT0
.425 g 3320 1452 M
212 -31 V
1.000 UL
LT0
.425 g 3532 1421 M
2 -1 V
1333 1640 M
1.000 UL
LT0
.425 g 1333 1640 M
-54 45 V
241 -69 R
1.000 UL
LT0
.425 g 1520 1616 M
152 46 V
1.000 UL
LT0
.425 g 1672 1662 M
-51 42 V
1.000 UL
LT0
.425 g 1621 1704 M
-234 23 V
-39 -89 R
1.000 UL
LT0
.375 g 1348 1638 M
-60 51 V
217 -71 R
1.000 UL
LT0
.375 g 1505 1618 M
148 47 V
1.000 UL
LT0
.375 g 1653 1665 M
-43 35 V
1.000 UL
LT0
.375 g 1610 1700 M
-231 24 V
-17 -88 R
1.000 UL
LT0
.325 g 1362 1636 M
-66 56 V
195 -72 R
1.000 UL
LT0
.325 g 1491 1620 M
143 47 V
1.000 UL
LT0
.325 g 1634 1667 M
-34 29 V
1.000 UL
LT0
.325 g 1600 1696 M
-230 25 V
6 -86 R
1.000 UL
LT0
.275 g 1376 1635 M
-72 60 V
172 -73 R
1.000 UL
LT0
.275 g 1476 1622 M
140 47 V
1.000 UL
LT0
.275 g 1616 1669 M
-27 23 V
1.000 UL
LT0
.275 g 1589 1692 M
-227 26 V
28 -85 R
1.000 UL
LT0
.225 g 1390 1633 M
-78 65 V
150 -75 R
1.000 UL
LT0
.225 g 1462 1623 M
135 49 V
1.000 UL
LT0
.225 g 1597 1672 M
-19 16 V
1.000 UL
LT0
.225 g 1578 1688 M
-225 26 V
51 -83 R
1.000 UL
LT0
.175 g 1404 1631 M
-84 70 V
127 -76 R
1.000 UL
LT0
.175 g 1447 1625 M
132 49 V
1.000 UL
LT0
.175 g 1579 1674 M
-11 9 V
1.000 UL
LT0
.175 g 1568 1683 M
-223 28 V
74 -82 R
1.000 UL
LT0
.125 g 1419 1629 M
-90 76 V
104 -78 R
1.000 UL
LT0
.125 g 1433 1627 M
127 50 V
1.000 UL
LT0
.125 g 1560 1677 M
-3 2 V
1.000 UL
LT0
.125 g 1557 1679 M
-220 29 V
1.000 UL
LTb
7794 2054 M
5382 1113 L
1.000 UL
LTb
1206 1657 M
5382 1113 L
1.000 UL
LTb
5382 1113 M
0 3065 V
LTb
2692 1150 M
[ [(Helvetica) 180.0 0.0 true true 0 (x)]
] -60.0 MCshow
LTb
7633 1448 M
[ [(Helvetica) 180.0 0.0 true true 0 (y)]
] -60.0 MCshow
LTb
1205 5836 M
[ [(Helvetica) 180.0 0.0 true true 0 (Erreur)]
] -60.0 MCshow
1.000 UP
grestore % colour palette end
stroke
grestore
end
showpage
%%Trailer
%%DocumentFonts: Times-Roman Helvetica
