ndim          2
test          201
xmin          0.0
xmax          2.0
ndata         10
ntest         20
datatype      uniform
nom           bdd_rast_2d.dat




****************************************************Commentaires****************************************************************************

ndim      --------> a definir    : Nombre de parametres de design


test       --------> 101         : fonction teste lineaire

           --------> 102         : fonction teste quadratique

           --------> 103         : fonction teste sinusoidale

           --------> 201         : fonction teste de Rastrigin

           --------> 202         : fonction teste de quadratique (2D et plus)

xmin, xmax --------> a definir   : bornes du domaine de calcul

ndata      --------> a definir   : Nombre de points (dans chaque direction) de la base de 
                                   donnees servant a construire le metamodele 

ntest      --------> a definir   : Nombre de points (dans chaque direction) servant a evaluer
                                   le metamodele 

datatype   --------> uniform     : Les points de la base de donnees et les points test sont
                                   generes sur des grilles uniformes

           --------> random      : Les points de la base de donnees et les points test sont
                                   generes sur des grilles aleatoires

nom        --------> a definir   : Nom du fichier de la base de donnees