// Allan CORNET - 2012
//
// unit test ConvertColorSpace
//
global IPD_PATH;
RGB = ReadImage(IPD_PATH + 'demos\teaset.png');
global CONVERSION_RGB2LAB;
LABPixelList = ConvertColorSpace(RGB(:), size(RGB), CONVERSION_RGB2LAB);
LAB = matrix(LABPixelList, size(RGB));
figure();
ShowImage(LAB(:, :, 1), 'L*');
figure();
ShowImage(LAB(:, :, 2), 'a*');
figure();
ShowImage(LAB(:, :, 3), 'b*');
