// Allan CORNET - 2012
//
// unit test CalculateOtsuThreshold
//
global IPD_PATH;
RGB = ReadImage(IPD_PATH + 'demos\teaset.png');
Image = RGB2Gray(RGB);
Image = uint8(255 * ones(size(Image, 1), size(Image, 2))) - Image;
Threshold = CalculateOtsuThreshold(Image)
 Threshold  =
 
  52  
