{
  "lambda-basic-execution": {
    "policy_content": {
      "Statement": [
        {
          "Action": [
            "logs:CreateLogGroup",
            "logs:CreateLogStream",
            "logs:PutLogEvents",
            "dynamodb:GetItem",
            "dynamodb:Query",
            "dynamodb:PutItem",
            "dynamodb:Batch*",
            "dynamodb:Scan",
            "dynamodb:DeleteItem",
            "dynamodb:Query",
            "ssm:PutParameter",
            "ssm:GetParameter",
            "kms:Decrypt",
            "cognito-idp:DescribeUserPool",
            "cognito-idp:GetUser",
            "cognito-idp:ListUsers",
            "cognito-idp:AdminCreateUser",
            "cognito-idp:AdminInitiateAuth",
            "cognito-idp:GetIdentityProviderByIdentifier",
            "cognito-idp:ListUserPools",
            "cognito-idp:ListUserPoolClients",
            "cognito-idp:AdminRespondToAuthChallenge",
            "ssm:PutParameter",           
            "ssm:GetParameter",            
            "kms:Decrypt"
          ],
          "Effect": "Allow",
          "Resource": "*"
        }
      ],
      "Version": "2012-10-17"
    },
    "resource_type": "iam_policy"
  },
  "handler-role": {
    "predefined_policies": [],
    "principal_service": "lambda",
    "custom_policies": [
      "lambda-basic-execution"
    ],
    "resource_type": "iam_role",
    "allowed_accounts": [
      "${account_id}"
    ]
  },
  "Tables": {
    "resource_type": "dynamodb_table",
    "hash_key_name": "id",
    "hash_key_type": "N",
    "read_capacity": 1,
    "write_capacity": 1,
    "global_indexes": [],
    "autoscaling": []
  },
  "Reservations": {
    "resource_type": "dynamodb_table",
    "hash_key_name": "id",
    "hash_key_type": "S",
    "read_capacity": 1,
    "write_capacity": 1,
    "global_indexes": [],
    "autoscaling": []
  },
  "simple-booking-userpool": {
    "resource_type": "cognito_idp",
    "auth_role": "api_handler-role",
    "password_policy": {
      "minimum_length": 8,
      "require_uppercase": true,
      "require_symbols": true,
      "require_lowercase": true,
      "require_numbers": true
    },
    "auto_verified_attributes": [
      "email"
    ],
    "sms_configuration": {},
    "username_attributes": [
      "email"
    ],
    "custom_attributes": [],
    "client": {
      "client_name": "cmtr-3477d8b3-task10-client",
      "generate_secret": false,
      "explicit_auth_flows": [
        "ALLOW_REFRESH_TOKEN_AUTH",
        "ALLOW_ADMIN_USER_PASSWORD_AUTH"
      ]
    }
  },
  "task11_api": {
    "resource_type": "api_gateway",
    "deploy_stage": "api",
    "dependencies": [],
    "resources": {
      "/signin": {
        "enable_cors": true,
        "POST": {
          "authorization_type": "NONE",
          "integration_type": "lambda",
          "lambda_name": "api_handler",
          "api_key_required": false,
          "method_request_parameters": {},
          "integration_request_body_template": {},
          "responses": [],
          "integration_responses": [],
          "default_error_pattern": true,
          "enable_proxy": true
        }
      },
      "/signup": {
        "enable_cors": true,
        "POST": {
          "authorization_type": "NONE",
          "integration_type": "lambda",
          "lambda_name": "api_handler",
          "api_key_required": false,
          "method_request_parameters": {},
          "integration_request_body_template": {},
          "responses": [],
          "integration_responses": [],
          "default_error_pattern": true,
          "enable_proxy": true
        }
      },
      "/tables": {
        "enable_cors": true,
        "GET": {
          "authorization_type": "demo-authorizer",
          "integration_type": "lambda",
          "lambda_name": "api_handler",
          "api_key_required": false,
          "method_request_parameters": {},
          "integration_request_body_template": {},
          "responses": [],
          "integration_responses": [],
          "default_error_pattern": true,
          "enable_proxy": true
        },
        "POST": {
          "authorization_type": "demo-authorizer",
          "integration_type": "lambda",
          "lambda_name": "api_handler",
          "api_key_required": false,
          "method_request_parameters": {},
          "integration_request_body_template": {},
          "responses": [],
          "integration_responses": [],
          "default_error_pattern": true,
          "enable_proxy": true
        }
      },
      "/tables/{tableId}": {
        "enable_cors": true,
        "GET": {
          "authorization_type": "demo-authorizer",
          "integration_type": "lambda",
          "lambda_name": "api_handler",
          "api_key_required": false,
          "method_request_parameters": {
            "method.request.path.tableId": true
          },
          "integration_request_body_template": {},
          "responses": [],
          "integration_responses": [],
          "default_error_pattern": true,
          "enable_proxy": true
        }
      },
      "/reservations": {
        "enable_cors": true,
        "POST": {
          "authorization_type": "demo-authorizer",
          "integration_type": "lambda",
          "lambda_name": "api_handler",
          "api_key_required": false,
          "method_request_parameters": {},
          "integration_request_body_template": {},
          "responses": [],
          "integration_responses": [],
          "default_error_pattern": true,
          "enable_proxy": true
        },
        "GET": {
          "authorization_type": "demo-authorizer",
          "integration_type": "lambda",
          "lambda_name": "api_handler",
          "api_key_required": false,
          "method_request_parameters": {},
          "integration_request_body_template": {},
          "responses": [],
          "integration_responses": [],
          "default_error_pattern": true,
          "enable_proxy": true
        }
      }
    },
    "authorizers": {
      "demo-authorizer": {
        "type": "COGNITO_USER_POOLS",
        "identity_source": "method.request.header.Authorization",
        "ttl": 300,
        "user_pools": [
          "simple-booking-userpool"
        ]
      }
    }
  },
  "api-ui-hoster": {
    "resource_type": "s3_bucket",
    "acl": "public-read",
    "cors": [],
    "policy": {
      "Version": "2012-10-17",
      "Statement": [
        {
          "Sid": "PublicReadGetObject",
          "Effect": "Allow",
          "Principal": "*",
          "Action": [
            "s3:GetObject"
          ],
          "Resource": [
            "arn:aws:s3:::{bucket_name}/*"
          ]
        }
      ]
    },
    "public_access_block": {
      "block_public_acls": false,
      "ignore_public_acls": false,
      "block_public_policy": false,
      "restrict_public_buckets": false
    },
    "website_hosting": {
      "enabled": true,
      "index_document": "index.html",
      "error_document": "error.html"
    }
  }
}