<svg width="95" height="40" viewBox="0 0 95 40" fill="none" xmlns="http://www.w3.org/2000/svg">
<path d="M17.9472 14.7404C17.9412 14.8539 17.9088 14.9644 17.8525 15.0631C17.7961 15.1619 17.7175 15.246 17.6229 15.309L13.0634 17.9404V7.7864L4.27252 2.70941L8.82833 0.0779746C8.93008 0.0267059 9.04242 0 9.15635 0C9.27028 0 9.38263 0.0267059 9.48437 0.0779746L17.9472 4.96545V14.7404ZM11.1062 8.90896L5.0707 5.43561C4.96943 5.38493 4.85775 5.35855 4.7445 5.35855C4.63126 5.35855 4.51958 5.38493 4.41831 5.43561L0.361816 7.7864L6.71444 11.4529V18.786L10.7819 16.4352C10.876 16.3726 10.9544 16.289 11.0107 16.1909C11.067 16.0929 11.0997 15.9831 11.1062 15.8702V8.90896ZM0.361816 15.1194L4.75726 17.6707V12.5791L0.361816 15.1194Z" fill="#5CE500"/>
<path d="M27.6384 4.96179H22.8457V17.9367H24.9705V12.8342H27.6676C30.5833 12.8342 32.1724 11.4165 32.1724 8.82512C32.1724 7.65883 31.7314 4.93628 27.653 4.93628M30.0074 8.86156C30.0074 10.3194 29.2493 10.9208 27.3869 10.9208H24.9705V6.89345H27.6676C29.2457 6.89345 30.0074 7.54949 30.0074 8.90165M38.4995 8.50074L38.6598 8.57728L38.2954 10.4944L38.0475 10.4178C37.848 10.3561 37.6404 10.3242 37.4316 10.3231C35.4452 10.3231 35.2849 11.9048 35.2849 13.8183V17.9367H33.3168V8.40963H35.161V9.56134C35.3578 9.2149 35.6331 8.91941 35.9648 8.69852C36.2964 8.47763 36.6752 8.3375 37.0708 8.28935C37.5548 8.22267 38.0479 8.29077 38.4958 8.48617M43.3396 8.21646C41.7869 8.21646 40.5478 8.80689 39.7496 9.9258C39.1013 10.8954 38.7643 12.0398 38.7837 13.206C38.7837 16.2165 40.5733 18.1627 43.3396 18.1627C46.6999 18.1627 47.8917 15.4547 47.8917 13.1367C47.9316 11.9075 47.5453 10.7024 46.7983 9.72535C46.3751 9.23237 45.8456 8.84178 45.2497 8.58295C44.6538 8.32413 44.0069 8.20381 43.3578 8.23104M43.3578 16.4023C41.8161 16.4023 40.8575 15.1777 40.8575 13.206C40.8575 11.2342 41.8161 9.97318 43.3578 9.97318C44.8995 9.97318 45.8726 11.2269 45.8726 13.1695C45.8726 15.1121 44.9068 16.4023 43.3578 16.4023M64.4566 8.50074L64.617 8.57728L64.2525 10.4944L64.0047 10.4178C63.8065 10.3559 63.6001 10.3239 63.3924 10.3231C61.4061 10.3231 61.2457 11.9048 61.2457 13.8183V17.9367H59.2776V8.40963H61.1218V9.56134C61.3187 9.2149 61.594 8.91941 61.9256 8.69852C62.2573 8.47763 62.636 8.3375 63.0316 8.28935C63.5157 8.22267 64.0088 8.29077 64.4566 8.48617M71.5236 14.8825L71.4872 14.9882C71.3385 15.4292 71.0471 15.8081 70.659 16.0649C70.2708 16.3217 69.8081 16.4417 69.3441 16.406C67.8534 16.406 66.8949 15.4183 66.7929 13.811H73.5318L73.5573 13.6251C73.5738 13.3727 73.5738 13.1195 73.5573 12.867V12.6921C73.4589 10.0279 71.735 8.23468 69.2311 8.23468C68.5653 8.21019 67.9036 8.34801 67.3029 8.63628C66.7022 8.92455 66.1807 9.3546 65.7833 9.88935C65.104 10.862 64.747 12.0233 64.7628 13.2096C64.7628 16.1545 66.5851 18.1299 69.3186 18.1299C71.4252 18.1299 72.8758 17.062 73.4042 15.1158L73.4698 14.8825H71.5236ZM66.8657 12.1017C67.0334 10.7823 67.9373 9.94402 69.2202 9.94402C69.8119 9.92533 70.387 10.1419 70.8194 10.5463C71.2518 10.9507 71.5063 11.51 71.5273 12.1017H66.8657ZM55.6585 9.21145C55.3269 8.87579 54.9283 8.61372 54.4888 8.44229C54.0492 8.27086 53.5785 8.19391 53.1072 8.21646C50.217 8.21646 48.9049 10.7677 48.9049 13.1222C48.9049 15.5458 50.2024 17.9914 53.1072 17.9914C53.5629 17.9999 54.0156 17.9157 54.4379 17.744C54.8601 17.5724 55.2431 17.3168 55.5637 16.9928C55.5637 17.4119 55.5455 17.8128 55.5345 17.9841C55.4288 19.555 54.6744 20.2875 53.1582 20.2875C52.3345 20.2875 51.3906 19.996 51.2083 19.1723L51.1683 18.9937H49.2439L49.2767 19.2525C49.4808 20.9326 50.9532 21.975 53.1254 21.975C55.0279 21.975 56.3837 21.2461 57.0434 19.9012C57.4055 19.0041 57.5684 18.0391 57.5209 17.073V8.40963H55.6585V9.21145ZM53.2493 16.231C52.5605 16.231 50.9605 15.9212 50.9605 13.0347C50.9605 11.1358 51.8571 9.9586 53.3004 9.9586C54.4156 9.9586 55.6074 10.7677 55.6074 13.0347C55.6074 15.0356 54.7254 16.231 53.2493 16.231ZM82.6434 15.0684C82.6434 16.5846 81.386 18.1153 78.576 18.1153C76.0903 18.1153 74.6143 17.0219 74.4138 15.083L74.3919 14.8825H76.3309L76.3601 15.0283C76.597 16.2055 77.7159 16.4497 78.6124 16.4497C79.5965 16.4497 80.6462 16.1326 80.6462 15.247C80.6462 14.795 80.3546 14.4743 79.7751 14.2957C79.4325 14.1937 79.0134 14.0771 78.5687 13.9531C77.8033 13.7381 77.0088 13.5121 76.5204 13.3445C75.3104 12.9144 74.6179 12.0689 74.6179 11.0338C74.6179 9.11304 76.4876 8.25291 78.3427 8.25291C80.8211 8.25291 82.1004 9.18594 82.2644 11.103V11.3035H80.3692L80.3437 11.154C80.1505 10.0607 79.0534 9.88207 78.4156 9.88207C77.8617 9.88207 76.5933 9.98047 76.5933 10.8953C76.5933 11.3108 76.9578 11.6242 77.6867 11.8283L78.6052 12.0689C79.3815 12.2693 80.3509 12.5208 80.8393 12.6884C82.053 13.1149 82.6616 13.9167 82.6616 15.072M91.755 15.072C91.755 16.5882 90.4976 18.119 87.6876 18.119C85.202 18.119 83.7259 17.0256 83.5254 15.0866L83.5036 14.8862H85.4425L85.4717 15.032C85.7086 16.2092 86.8275 16.4534 87.7241 16.4534C88.7081 16.4534 89.7578 16.1363 89.7578 15.2506C89.7578 14.7987 89.4662 14.478 88.8867 14.2994C88.5441 14.1973 88.125 14.0807 87.6803 13.9568C86.915 13.7417 86.1204 13.5158 85.632 13.3481C84.4257 12.9181 83.7295 12.0725 83.7295 11.0374C83.7295 9.11669 85.5992 8.25655 87.4544 8.25655C89.9327 8.25655 91.212 9.18958 91.3724 11.1067V11.3071H89.4626L89.437 11.1577C89.2439 10.0643 88.1468 9.88571 87.509 9.88571C86.9587 9.88571 85.6867 9.98412 85.6867 10.8989C85.6867 11.3144 86.0512 11.6278 86.7801 11.832L87.6986 12.0725C88.4749 12.273 89.4443 12.5244 89.9327 12.6921C91.1427 13.1185 91.755 13.9203 91.755 15.0757" fill="#4B4E52"/>
<path d="M93.2969 9.44474C93.0272 9.44835 92.7626 9.3717 92.5367 9.22454C92.3108 9.07738 92.1337 8.86634 92.028 8.61828C91.9223 8.37021 91.8927 8.09631 91.9431 7.83142C91.9935 7.56652 92.1215 7.32259 92.3109 7.13064C92.5003 6.93869 92.7425 6.80739 93.0067 6.75344C93.2708 6.69949 93.5451 6.72533 93.7946 6.82766C94.0441 6.93 94.2575 7.10421 94.4077 7.32815C94.5579 7.55209 94.6381 7.81564 94.6381 8.08528C94.6415 8.26321 94.6093 8.44002 94.5433 8.6053C94.4773 8.77058 94.379 8.92099 94.254 9.04767C94.129 9.17435 93.9799 9.27475 93.8156 9.34294C93.6512 9.41113 93.4748 9.44574 93.2969 9.44474M93.2969 6.95909C93.0728 6.95256 92.852 7.01302 92.6625 7.13273C92.473 7.25245 92.3236 7.42597 92.2333 7.63109C92.143 7.83622 92.116 8.06362 92.1557 8.2842C92.1953 8.50477 92.2999 8.70849 92.456 8.86929C92.6122 9.03009 92.8127 9.14066 93.032 9.18684C93.2513 9.23302 93.4794 9.21271 93.6871 9.12852C93.8948 9.04433 94.0727 8.90009 94.1979 8.71424C94.3232 8.52839 94.3902 8.3094 94.3903 8.08528C94.3947 7.93896 94.3696 7.79325 94.3166 7.65678C94.2637 7.52031 94.1838 7.39588 94.0818 7.29085C93.9799 7.18581 93.8578 7.10233 93.723 7.04534C93.5882 6.98835 93.4433 6.95902 93.2969 6.95909ZM93.1401 8.33676V8.79235H92.7392V7.35635H93.4062C93.4746 7.34893 93.5438 7.35639 93.6091 7.37821C93.6744 7.40003 93.7341 7.4357 93.7843 7.48278C93.8345 7.52985 93.8739 7.58722 93.8999 7.65096C93.9258 7.71469 93.9377 7.78328 93.9347 7.85203C93.9431 7.94434 93.9204 8.03681 93.8702 8.11474C93.82 8.19267 93.7452 8.25158 93.6577 8.28209L93.9857 8.78141H93.5411L93.2714 8.32583L93.1401 8.33676ZM93.3625 7.69895H93.1401V8.01968H93.3625C93.4827 8.01968 93.5483 7.96137 93.5483 7.86296C93.5486 7.83945 93.5437 7.81617 93.5341 7.7947C93.5246 7.77323 93.5105 7.75407 93.4929 7.73851C93.4752 7.72296 93.4545 7.71138 93.432 7.70455C93.4095 7.69773 93.3858 7.69582 93.3625 7.69895" fill="#4B4E52"/>
<path d="M27.7914 26.8625C29.048 26.8025 30.2851 27.1899 31.283 27.9559V29.1258C30.3327 28.2724 29.09 27.8181 27.8133 27.8575C25.0907 27.8575 23.0971 29.975 23.0971 33.4265C23.0971 36.878 25.0907 38.9955 27.8133 38.9955C29.0926 39.0267 30.3348 38.5647 31.283 37.7053V38.8898C30.2851 39.6558 29.048 40.0432 27.7914 39.9832C24.5695 39.9832 22.0146 37.4684 22.0146 33.4229C22.0146 29.3773 24.5695 26.8625 27.7914 26.8625Z" fill="#4B4E52"/>
<path d="M32.6936 26.3012H33.7323V32.0415C34.0497 31.5439 34.4847 31.1319 34.9989 30.8421C35.5131 30.5523 36.0907 30.3934 36.6808 30.3796C38.7802 30.3796 39.8808 31.7317 39.8808 33.6853V39.7937H38.864V33.8639C38.864 32.4279 38.1351 31.3709 36.495 31.3709C35.8895 31.395 35.3046 31.597 34.8133 31.9515C34.322 32.3061 33.946 32.7976 33.7323 33.3645V39.8265H32.6936V26.3012Z" fill="#4B4E52"/>
<path d="M45.7629 39.0794C46.7141 39.121 47.6447 38.7947 48.3616 38.1682V39.1851C47.5904 39.7591 46.6428 40.0454 45.6828 39.9942C43.106 39.9942 41.3821 38.1718 41.3821 35.278C41.3821 32.3841 42.9165 30.3942 45.3693 30.3942C47.8222 30.3942 49.014 32.2165 49.014 34.9026V35.2671H42.3989C42.3989 37.7709 43.8532 39.0794 45.7629 39.0794ZM42.439 34.4251H48.0299C47.968 32.8069 47.1989 31.309 45.3693 31.309C43.8532 31.3126 42.6905 32.4315 42.439 34.4251Z" fill="#4B4E52"/>
<path d="M54.5284 27.2598C54.2402 27.1063 53.9182 27.0274 53.5917 27.0302C52.615 27.0302 51.9079 27.7372 51.9079 29.0238V30.5837H54.0692V31.4766H51.9079V39.8083H50.891V31.4766H49.3967V30.5837H50.891V28.9217C50.891 27.2379 51.9844 26.1153 53.4897 26.1153C53.8447 26.1096 54.1974 26.1727 54.5284 26.3012V27.2598Z" fill="#4B4E52"/>
<path d="M57.1165 31.3126C56.847 31.3155 56.5827 31.2382 56.3573 31.0906C56.1318 30.943 55.9553 30.7317 55.8501 30.4835C55.745 30.2354 55.716 29.9616 55.7668 29.697C55.8176 29.4323 55.9459 29.1887 56.1354 28.9971C56.325 28.8055 56.5672 28.6746 56.8313 28.621C57.0954 28.5673 57.3694 28.5934 57.6187 28.6958C57.868 28.7983 58.0811 28.9725 58.2312 29.1964C58.3812 29.4202 58.4613 29.6836 58.4613 29.9531C58.4648 30.1314 58.4324 30.3085 58.3662 30.474C58.3 30.6395 58.2013 30.7901 58.076 30.9168C57.9506 31.0436 57.8011 31.1439 57.6363 31.2118C57.4715 31.2798 57.2947 31.3141 57.1165 31.3126V31.3126ZM57.1165 28.8233C56.8916 28.816 56.6697 28.8761 56.4791 28.9957C56.2886 29.1154 56.1381 29.2892 56.047 29.4949C55.9559 29.7006 55.9282 29.9288 55.9676 30.1504C56.007 30.3719 56.1116 30.5766 56.2681 30.7383C56.4246 30.8999 56.6257 31.0112 56.8458 31.0578C57.0659 31.1045 57.295 31.0843 57.5035 31C57.7121 30.9157 57.8908 30.771 58.0166 30.5845C58.1425 30.3979 58.2097 30.1781 58.2099 29.9531C58.2128 29.8077 58.1866 29.6632 58.133 29.528C58.0793 29.3928 57.9993 29.2697 57.8974 29.1658C57.7956 29.0619 57.6741 28.9794 57.54 28.9231C57.4059 28.8668 57.2619 28.8378 57.1165 28.8379V28.8233ZM56.9597 30.2083V30.6602H56.5588V29.2461H57.2258C57.2945 29.2386 57.3641 29.2461 57.4296 29.2681C57.4951 29.2902 57.5551 29.3262 57.6054 29.3737C57.6556 29.4211 57.695 29.479 57.7207 29.5432C57.7464 29.6073 57.7579 29.6763 57.7543 29.7454C57.7629 29.8372 57.7408 29.9294 57.6913 30.0072C57.6418 30.0851 57.5678 30.1443 57.4809 30.1754L57.8089 30.6748H57.3607L57.0873 30.2192L56.9597 30.2083ZM57.1821 29.5668H56.9597V29.8875H57.1894C57.3096 29.8875 57.3752 29.8256 57.3752 29.7308C57.3752 29.636 57.3023 29.5814 57.1894 29.5814L57.1821 29.5668Z" fill="#4B4E52"/>
</svg>
