<svg width="131" height="21" viewBox="0 0 131 21" fill="none" xmlns="http://www.w3.org/2000/svg">
<path fill-rule="evenodd" clip-rule="evenodd" d="M14.5383 0.705416V4.49878C12.7342 3.86777 10.7588 3.49938 9.18378 3.49938C7.23968 3.49938 6.15784 4.09173 6.15784 5.15606C6.15784 5.83522 6.63128 6.28531 7.9896 6.8959L11.6429 8.53507C14.5652 9.84816 16.0381 11.7638 16.0381 14.2528C16.0381 18.0943 12.7131 20.5177 7.44248 20.5177C5.52027 20.5177 3.29677 20.2427 0.941239 19.7102V15.7891C3.27635 16.4245 5.41522 16.7638 7.07919 16.7638C9.25819 16.7638 10.4254 16.1568 10.4254 15.0254C10.4254 14.3455 9.96944 13.8458 8.92554 13.3796L4.92719 11.5989C1.96326 10.2771 0.595459 8.49641 0.595459 5.95777C0.595459 2.31979 3.80012 0 8.82779 0C10.5881 0 12.7546 0.26772 14.5383 0.705416ZM18.8831 0.397572H24.7913V20.1202H18.8831V0.397572ZM44.001 0.397572V4.01075H35.0815V8.4592H42.8732V11.7273H35.0815V16.3392H44.1163V20.1202H29.3404V0.397572H44.001ZM71.9129 0.397572V20.1202H66.1966V7.13882L60.597 20.2741H56.9831L51.4214 7.13882V20.1202H47.4741V0.397572H54.6888L59.7894 12.3941L64.8638 0.397572H71.9129ZM91.1379 0.397572V4.01075H82.2053V8.4592H89.9948V11.7273H82.2053V16.3392H91.2386V20.1202H76.4496V0.397572H91.1379ZM111.948 0.397572V20.1202H105.643L98.5437 7.47074V20.1202H94.5957V0.397572H101.067L108.014 12.8799V0.397572H111.948ZM129.094 0.705416V4.49878C127.303 3.87215 125.315 3.49938 123.77 3.49938C121.795 3.49938 120.714 4.08224 120.714 5.15022C120.714 5.84616 121.155 6.26197 122.56 6.89662L126.197 8.5358C129.141 9.86274 130.595 11.7616 130.595 14.2798C130.595 18.1009 127.268 20.5192 122.009 20.5192C120.083 20.5192 117.851 20.2427 115.499 19.7116V15.7906C117.831 16.4245 119.965 16.7652 121.618 16.7652C123.783 16.7652 124.982 16.1583 124.982 15.0626C124.982 14.3375 124.562 13.8698 123.468 13.3811L119.485 11.6004C116.503 10.2683 115.151 8.50808 115.151 5.95996C115.151 2.32416 118.357 0.00291637 123.373 0.00291637C125.139 0.00072789 127.314 0.26772 129.094 0.705416Z" fill="white"/>
</svg>
