<svg width="209" height="31" viewBox="0 0 209 31" fill="none" xmlns="http://www.w3.org/2000/svg">
<g clip-path="url(#clip0_76_3060)">
<path d="M2.54299 15.2969H5.91633L3.87135 24.7623H9.25634L8.75735 27.0793H0L2.54299 15.2969Z" fill="white"/>
<path d="M13.1962 16.6021C15.0402 15.1004 17.3675 14.9705 18.2488 14.9705C23.0358 14.9705 23.6005 18.3483 22.9691 21.2207C21.9555 25.9211 18.2488 27.3564 15.3902 27.3564C12.1992 27.3564 9.60617 25.6276 10.5532 21.2371C10.7198 20.4535 11.3678 18.1038 13.1962 16.6021ZM15.9548 24.9576C18.3312 24.9576 19.1958 22.8032 19.5448 21.1716C19.8938 19.5227 19.6782 18.7073 19.4282 18.1856C19.0792 17.5329 18.3478 17.3366 17.6165 17.3366C15.4225 17.3366 14.4255 19.1963 13.9765 21.2197C13.5775 23.0968 13.7442 24.9576 15.9548 24.9576Z" fill="white"/>
<path d="M32.9546 19.0009C33.0703 17.8101 32.3066 17.3693 31.3586 17.3693C29.347 17.3693 28.35 19.1809 27.8843 21.3352C27.7176 22.0533 27.1039 25.023 29.6793 25.023C31.441 25.023 31.8899 23.7658 32.0566 23.3096H35.5133C34.6986 26.9983 30.8096 27.3083 29.247 27.3083C28.0833 27.3083 26.0726 27.1128 25.0256 25.7411C24.012 24.3704 24.1943 22.4942 24.461 21.2698C24.81 19.6536 25.5413 18.0383 26.9373 16.7821C28.4666 15.4113 30.1283 15.0532 31.8733 15.0532C33.8183 15.0532 35.1976 15.5105 35.9289 16.4894C36.6769 17.5002 36.4613 18.5619 36.3779 19.0019H32.9546V19.0009Z" fill="white"/>
<path d="M39.2012 15.2969H42.5745L41.4609 20.4709L46.4135 15.2969H50.3525L45.1009 20.4863L48.1429 27.0793H44.0215L41.3952 20.8126L40.0325 27.0793H36.6582L39.2012 15.2969Z" fill="white"/>
<path d="M51.9473 15.2969H55.3049L54.3246 19.8991H58.3293L59.3106 15.2969H62.6839L60.1409 27.0793H56.7666L57.797 22.3143H53.7746L52.7443 27.0793H49.4043L51.9473 15.2969Z" fill="white"/>
<path d="M64.9434 15.3296H73.9517L73.4704 17.5821H67.753L67.2207 20.03H72.6057L72.1067 22.2825H66.7217L66.1894 24.7959H72.04L71.5411 27.0802H62.4004L64.9434 15.3306V15.3296Z" fill="white"/>
<path d="M76.0254 15.3296H85.0337L84.5524 17.5821H78.8351L78.3027 20.03H83.6877L83.1887 22.2825H77.8037L77.2714 24.7959H83.1221L82.6231 27.0802H73.4824L76.0254 15.3306V15.3296Z" fill="white"/>
<path d="M87.1768 15.2969H92.2461C93.6754 15.2969 95.5528 15.4442 96.6164 16.2759C98.1291 17.4676 98.1958 19.4092 97.8134 21.1553C97.2488 23.7669 95.9851 25.6931 93.3598 26.623C92.0304 27.0802 90.5678 27.0802 89.7364 27.0802H84.6348L87.1778 15.2978L87.1768 15.2969ZM88.5394 24.8104H89.9688C92.1794 24.794 93.7911 23.8641 94.3901 21.1226C95.1548 17.5484 92.4294 17.5484 91.4158 17.5484L90.1021 17.5321L88.5394 24.8104Z" fill="white"/>
<path d="M106.386 15.2969H111.622L111.904 23.2769L115.511 15.2969L120.746 15.2805L118.203 27.0802H115.062L117.356 17.1903L112.37 27.0802H109.378L108.796 17.1085L106.719 27.0802H103.844L106.387 15.2978L106.386 15.2969Z" fill="white"/>
<path d="M126.828 15.2969H130.883L133.077 27.0793H129.322L129.006 24.7132H124.202L122.873 27.0793H119.549L126.829 15.2969H126.828ZM128.706 22.5425L128.224 17.5975H128.174L125.449 22.5425H128.706Z" fill="white"/>
<path d="M136.88 15.2969H142.431C144.591 15.2969 145.389 15.4278 145.937 16.1459C146.236 16.505 146.552 17.1576 146.286 18.4302C146.004 19.7191 145.356 20.2745 144.708 20.6172C143.843 21.0899 143.095 21.1717 142.747 21.2208L142.731 21.2863C145.057 21.3517 144.958 22.3644 144.841 24.1751C144.775 24.975 144.675 26.2476 144.775 27.0802H141.168C141.118 26.3621 141.235 25.464 141.351 24.4196C141.5 22.9997 141.567 22.478 140.071 22.478H138.675L137.678 27.0802H134.338L136.881 15.2978L136.88 15.2969ZM139.141 20.3564H140.388C141.119 20.3564 141.485 20.3564 141.784 20.2582C142.564 20.03 142.864 19.2956 142.947 18.9202C143.263 17.4676 141.966 17.4676 141.002 17.4676H139.756L139.141 20.3554V20.3564Z" fill="white"/>
<path d="M151.122 17.6302H147.465L147.964 15.2969H158.716L158.217 17.6302H154.478L152.433 27.0793H149.076L151.121 17.6302H151.122Z" fill="white"/>
<path d="M159.879 15.2969H163.302L160.759 27.0793H157.336L159.879 15.2969Z" fill="white"/>
<path d="M165.528 15.2969H170.115L172.276 24.0769L174.138 15.2969H177.046L174.503 27.0793H170.016L167.856 17.9248L165.912 27.0793H162.986L165.529 15.2969H165.528Z" fill="white"/>
<path d="M195.461 12.127L199.052 0.192509C199.095 0.0394535 198.899 -0.0673966 198.79 0.0490796L187.375 12.127H137.505C137.304 12.127 137.295 12.4273 137.496 12.4302L186.251 13.4785L189.323 13.5449L192.268 13.6085L192.452 12.127H188.795L194.953 6.61892L193.882 12.127L192.315 20.187L190.251 30.819C190.214 31.0096 190.499 31.0751 190.552 30.8874L193.36 19.6835L208.916 12.4148C209.063 12.3436 209.012 12.127 208.848 12.127H195.462H195.461ZM195.033 13.6681L200.822 13.7923L193.869 17.8468L195.032 13.6681H195.033Z" fill="white"/>
<path d="M186.609 14.2256L185.628 14.1929L179.88 19.9541C179.745 20.0947 179.948 20.3007 180.095 20.1717L186.608 14.2246L186.609 14.2256Z" fill="white"/>
<path d="M191.438 20.5748L191.613 19.0645L178.202 26.7885C178.032 26.8886 178.172 27.1408 178.35 27.0551L191.438 20.5738V20.5748Z" fill="white"/>
</g>
<defs>
<clipPath id="clip0_76_3060">
<rect width="209" height="31" fill="white"/>
</clipPath>
</defs>
</svg>
