term,from,to,sig,positive,negative,neutral
bread,bread,loaf,1376.42215340538,145,53,12
bread,bread,wheat,1138.9728890704,201,38,10
bread,bread,toast,662.695613569114,247,16,6
bread,bread,this,580.746824264526,1117,164,52
bread,bread,sandwich,549.36579226749,270,35,12
bread,bread,garlic,524.834795080125,138,8,9
bread,bread,toasted,523.322596778162,95,1,2
bread,bread,sandwiches,517.197090727277,155,18,5
bread,bread,loaves,499.318073520903,43,16,5
bread,bread,breads,463.696435656864,183,13,10
bread,bread,white,437.609493519645,129,19,8
bread,bread,french,428.875603651628,44,1,0
bread,bread,butter,402.839375521988,195,21,4
bread,bread,crust,398.891006348189,172,25,3
bread,bread,grains,349.795735697262,41,1,0
bread,loaf,of,210.214836678468,179,56,11
bread,loaf,wheat,183.016191522125,17,8,3
bread,loaf,loaves,182.889117920771,14,5,1
bread,loaf,slices,103.332849962637,16,7,1
bread,loaf,whole,101.032382267527,20,5,2
bread,loaf,white,92.9771265480667,18,4,2
bread,loaf,breads,88.6435575736687,15,1,1
bread,loaf,this,84.785192690324,129,38,6
bread,loaf,heb,82.6070743012242,3,2,0
bread,loaf,was,79.8664880087599,116,41,10
bread,loaf,bakery,79.3539257645607,12,2,0
bread,wheat,bread,1138.9728890704,201,38,10
bread,wheat,whole,933.97014824627,138,25,7
bread,wheat,dog,713.849004352465,139,7,3
bread,wheat,hot,611.882299304474,130,8,3
bread,wheat,white,363.445362632629,79,6,1
bread,wheat,bake,285.095003761817,38,3,1
bread,wheat,dogs,278.086354334373,53,2,1
bread,wheat,bun,238.189318854362,189,8,5
bread,wheat,loaf,183.016191522125,17,8,3
bread,wheat,breads,159.988832857925,25,1,2
bread,wheat,grain,155.708274839446,27,5,1
bread,wheat,shop,151.392723945435,37,6,1
bread,wheat,soft,148.72407072084,68,1,1
bread,wheat,these,145.378650179133,107,8,5
bread,wheat,honey,135.739550319035,20,6,2
bread,toast,butter,392.05722148763,140,5,5
bread,toast,french,352.235600987915,24,1,1
bread,toast,sandwiches,296.140964370687,82,1,2
bread,toast,spread,202.725019163452,51,1,3
bread,toast,on,182.034601784777,448,31,14
bread,toast,peanut,178.227909435984,54,1,1
bread,toast,breakfast,142.600413090084,67,1,0
bread,toast,sandwich,139.880311328918,125,4,5
bread,toast,morning,91.8683159793727,41,4,1
bread,toast,slice,89.4552672249265,57,6,1
bread,toast,garlic,88.317426496651,32,1,2
bread,toast,makes,86.3584453132935,48,2,0
bread,toast,or,84.655818561092,459,29,19
bread,toast,avocado,81.42783885682,18,1,0
bread,this,is,4951.30114607746,32127,5334,2438
bread,this,of,3802.15404030448,14877,3202,792
bread,this,but,3608.25949995033,7771,2150,368
bread,this,one,3411.07807390904,7712,1939,372
bread,this,to,2968.58085452206,19546,4221,1161
bread,this,be,2700.22187447036,13261,3079,678
bread,this,like,2497.85138356406,7181,1229,173
bread,this,was,2370.93799044425,9340,2705,421
bread,this,that,2254.39316141419,7481,2078,330
bread,this,will,2196.00144418143,3224,726,278
bread,sandwich,sandwiches,348.841231852304,805,61,39
bread,sandwich,or,241.482578416355,1065,105,44
bread,sandwich,lunch,189.099881526083,87,11,3
bread,sandwich,turkey,187.674988208804,45,6,3
bread,sandwich,make,164.948949872982,280,25,12
bread,sandwich,cheese,161.137708638795,148,14,11
bread,sandwich,on,152.262492189649,893,101,45
bread,sandwich,ham,147.794065104797,78,9,3
bread,sandwich,toast,139.880311328918,125,4,5
bread,sandwich,butter,139.595229617786,111,2,4
bread,sandwich,peanut,135.77216101205,83,2,4
bread,sandwich,mayo,130.364639155567,45,2,5
bread,sandwich,for,127.245450892951,748,68,20
bread,sandwich,deli,126.104216390289,172,16,5
bread,garlic,sauce,330.788783603348,111,8,8
bread,garlic,pepper,276.285121448338,73,3,5
bread,garlic,roasted,246.862070738338,30,5,0
bread,garlic,salt,225.995657803491,62,6,3
bread,garlic,oil,220.787933028303,81,6,4
bread,garlic,minced,193.80457250122,15,3,2
bread,garlic,butter,193.46643166244,61,8,4
bread,garlic,meal,192.979632665869,64,7,3
bread,garlic,olive,191.303877035622,56,4,3
bread,garlic,powder,180.777785357088,30,5,2
bread,garlic,pasta,178.187438248191,68,3,1
bread,garlic,tomatoes,175.449844568968,36,2,6
bread,garlic,onion,163.703338235151,54,5,6
bread,toasted,butter,203.244787489064,46,1,4
bread,toasted,fudge,111.61609706236,4,0,1
bread,toasted,toast,66.8851763657294,177,8,8
bread,toasted,or,65.273959712591,119,6,6
bread,toasted,sandwich,64.4099132246338,29,0,0
bread,toasted,sandwiches,62.3835610384122,16,0,0
bread,toasted,o's,62.2171283224598,0,1,0
bread,toasted,buttered,61.1591764693148,6,0,0
bread,toasted,breakfast,59.3045209413394,19,0,0
bread,toasted,spread,46.3724581575952,10,0,1
bread,toasted,lightly,46.1278800503351,9,0,2
bread,toasted,almonds,44.9627603003755,6,0,0
bread,toasted,on,44.9167781788856,115,7,3
bread,sandwiches,for,370.069504759274,476,40,12
bread,sandwiches,sandwich,348.841231852304,805,61,39
bread,sandwiches,toast,296.140964370687,82,1,2
bread,sandwiches,burgers,208.012981976848,59,1,1
bread,sandwiches,peanut,172.050497954711,46,2,3
bread,sandwiches,on,164.369796783663,527,49,28
bread,sandwiches,use,161.790422121994,219,23,10
bread,sandwiches,breakfast,160.844374951907,54,2,4
bread,sandwiches,butter,153.630965092219,61,2,3
bread,sandwiches,mayo,143.487579365727,27,2,3
bread,sandwiches,bacon,141.414823371451,56,0,2
bread,sandwiches,or,139.775611578021,637,53,21
bread,sandwiches,grilled,137.102427633479,36,1,2
bread,sandwiches,salads,135.979207841214,50,0,1
bread,sandwiches,make,129.320549798198,161,9,8
bread,loaves,loaf,182.889117920771,14,5,1
bread,loaves,two,137.382025329862,15,10,4
bread,loaves,wheat,72.1359370793216,7,3,0
bread,loaves,white,55.841555442661,7,1,0
bread,loaves,cad,47.1419916870072,0,1,0
bread,loaves,bought,44.2156280819327,13,4,1
bread,loaves,bare,40.7250865385868,0,2,0
bread,loaves,couple,39.384981604293,7,2,1
bread,loaves,bad,38.2675821278244,6,7,0
bread,loaves,this,38.0117295323871,25,12,3
bread,loaves,purchased,37.6592037328519,6,8,0
bread,loaves,last,37.3102338653989,12,3,1
bread,loaves,slices,36.4226896557957,5,1,0
bread,breads,grain,166.882679958362,26,1,1
bread,breads,wheat,159.988832857925,25,1,2
bread,breads,loaf,88.6435575736687,15,1,1
bread,breads,other,87.5272882743739,46,4,2
bread,breads,whole,80.2323367772624,22,2,0
bread,breads,sandwiches,79.7933028177358,19,1,0
bread,breads,fresh,63.2127280104905,40,0,0
bread,breads,soft,53.4596876706928,25,1,0
bread,breads,toast,51.9186569610611,19,0,0
bread,breads,baked,48.8245915630832,13,1,0
bread,breads,carb,47.468542676419,9,0,0
bread,breads,bakery,46.3320617126301,12,1,0
bread,breads,buns,45.7876236662269,11,0,0
bread,breads,all,44.126529419329,74,5,2
bread,white,bread,437.609493519645,129,19,8
bread,white,wheat,363.445362632629,79,6,1
bread,white,buns,338.587626683526,78,3,1
bread,white,corn,310.745571456384,69,13,1
bread,white,of,280.417136235163,515,136,37
bread,white,yellow,255.691845947877,45,8,2
bread,white,tortilla,187.97516061645,45,10,0
bread,white,cheddar,180.424228220247,25,1,4
bread,white,or,164.698971553706,656,166,42
bread,white,but,163.696745405439,281,83,12
bread,french,toast,352.235600987915,24,1,1
bread,french,fries,255.111136985477,14,2,3
bread,french,vanilla,244.482418587431,7,1,0
bread,french,onion,151.053528945427,13,0,1
bread,french,coffee,114.779304260854,6,0,0
bread,french,fried,113.869924234692,5,1,0
bread,french,roast,111.451093729585,4,0,1
bread,french,onions,108.213415473234,7,0,0
bread,french,press,104.655811063014,4,0,0
bread,french,dip,102.452601545956,11,0,1
bread,french,creamer,80.39299435867,3,0,0
bread,french,heb,67.0117751462385,6,0,0
bread,french,green,63.2570830178447,4,1,1
bread,butter,crunchy,535.085663608275,120,7,3
bread,butter,jelly,435.824367828667,60,2,3
bread,butter,bread,402.839375521988,195,21,4
bread,butter,creamy,397.459258394782,143,5,3
bread,butter,spread,395.147675769869,97,5,4
bread,butter,toast,392.05722148763,140,5,5
bread,butter,peanuts,251.432650449686,47,5,0
bread,butter,this,237.140271889046,629,61,24
bread,butter,pb,236.984634893946,16,1,1
bread,butter,butters,229.272052834742,41,5,0
bread,butter,jar,216.401285710745,57,6,1
bread,butter,toasted,203.244787489064,46,1,4
bread,crust,pie,634.728538841009,98,19,5
bread,crust,pizzas,464.449622835498,65,7,1
bread,crust,bread,398.891006348189,172,25,3
bread,crust,pepperoni,345.630124981515,39,7,0
bread,crust,toppings,324.109095892403,45,8,0
bread,crust,thin,305.133999894373,125,26,5
bread,crust,flaky,270.176944850478,33,1,1
bread,crust,frozen,269.475638546981,80,7,0
bread,crust,crispy,200.513387911022,51,2,0
bread,crust,this,152.776670847554,305,45,8
bread,crust,is,150.780327701941,554,84,22
bread,crust,cheese,149.590929281898,96,11,4
bread,crust,cut,140.159395690076,56,15,1
bread,crust,midtown,132.187963259872,0,1,0
bread,grains,essential,289.050567390397,7,0,0
bread,grains,grain,110.560788368806,91,5,1
bread,grains,whole,90.6064872606657,21,0,0
bread,grains,toast,76.3091440168209,13,0,1
bread,grains,wheat,63.8418074408546,6,0,0
bread,grains,multigrain,51.2810155744664,1,0,0
bread,grains,sandwiches,50.9831447619945,7,0,0
bread,grains,of,50.8970902902074,62,2,0
bread,grains,healthy,45.1553702284582,12,0,0
bread,grains,breads,40.2642327058129,3,0,0
bread,grains,cereal,37.2465324350633,6,1,0
bread,grains,nut,36.1741163153201,11,2,0
bread,grains,rice,30.5771160474978,9,2,0
bread,grains,honey,29.6747306301259,5,0,0
bread,grains,fiber,27.9395881285891,3,1,0
milk,milk,mootopia,1095.85689475853,17,8,1
milk,milk,lactose,802.25153356418,73,9,1
milk,milk,gallon,731.569145593792,95,63,20
milk,milk,chocolate,582.64682081854,135,29,7
milk,milk,carton,472.167251690757,82,30,10
milk,milk,fat,460.46837491123,68,25,6
milk,milk,almond,446.266870030202,92,23,13
milk,milk,date,418.158388738055,99,64,13
milk,milk,of,416.862265475094,711,243,70
milk,milk,gallons,390.0990671115,33,20,9
milk,milk,expiration,320.379567642696,43,32,8
milk,milk,cartons,281.560847008135,37,13,2
milk,milk,cereal,276.825282285921,55,16,1
milk,mootopia,carton,434.066479645204,7,3,0
milk,mootopia,fat,279.653996911366,5,2,0
milk,mootopia,bottom,275.944744387642,4,2,0
milk,mootopia,lactose,249.344891119748,3,0,0
milk,mootopia,free,158.003501109779,7,1,0
milk,mootopia,cartons,154.735435164068,1,1,0
milk,mootopia,l2,143.969794598874,0,0,0
milk,mootopia,date,137.483279224951,3,3,1
milk,mootopia,t3,135.886560153216,1,0,0
milk,mootopia,chocolate,129.008213810157,4,3,0
milk,mootopia,nov,128.624267543666,0,0,0
milk,mootopia,lote,117.998834887519,0,0,0
milk,mootopia,drinking,100.292695375625,1,3,0
milk,mootopia,expiration,93.5166719537228,1,2,0
milk,lactose,free,562.720177542418,68,6,2
milk,lactose,intolerant,433.785123586189,29,3,1
milk,lactose,mootopia,249.344891119748,3,0,0
milk,lactose,regular,68.9555058921687,13,1,0
milk,lactose,fat,64.039284685161,7,1,0
milk,lactose,drink,57.2776213460602,18,2,0
milk,lactose,also,51.8187947380356,14,6,0
milk,lactose,that,48.2428812519647,36,9,1
milk,lactose,stomach,47.7457649139687,8,2,0
milk,lactose,i_have,47.5378262521699,0,0,0
milk,lactose,milks,45.3812979678623,5,0,0
milk,lactose,not,43.4975371095352,30,9,1
milk,lactose,protein,43.1554876258597,6,2,0
milk,gallon,half,651.53409466939,99,38,16
milk,gallon,bags,394.697396053467,51,34,5
milk,gallon,of,321.510163803585,222,124,37
milk,gallon,zipper,246.89554572897,11,10,0
milk,gallon,tough,239.568138687871,5,5,0
milk,gallon,water,224.79882663535,38,32,12
milk,gallon,gallons,209.722387246788,69,43,16
milk,gallon,texas,206.963446530048,3,1,0
milk,gallon,in,185.392123028636,263,145,42
milk,gallon,to,182.447626181412,248,133,33
milk,gallon,size,173.218648558017,46,25,3
milk,gallon,not,171.531142296735,154,93,17
milk,chocolate,dark,893.732850220986,121,10,10
milk,chocolate,chip,695.005393034313,150,25,8
milk,chocolate,milk,582.64682081854,135,29,7
milk,chocolate,creamy,565.382563111838,118,5,1
milk,chocolate,vanilla,560.786829341203,102,14,4
milk,chocolate,cookie,435.130094156601,142,21,5
milk,chocolate,creations,398.504239608068,23,3,0
milk,chocolate,cookies,389.372762503568,87,12,4
milk,chocolate,coffee,286.268804135267,128,6,4
milk,chocolate,swirl,263.464323169552,43,4,2
milk,chocolate,of,246.581225684378,671,98,27
milk,chocolate,curls,228.855431652628,24,1,3
milk,chocolate,cinnamon,228.473457765765,50,4,0
milk,chocolate,cake,223.280368164647,98,16,0
milk,carton,milk,472.167251690757,82,30,10
milk,carton,mootopia,434.066479645204,7,3,0
milk,carton,of,339.00616481388,227,101,23
milk,carton,eggs,279.459526026156,41,35,4
milk,carton,bottom,263.842208343092,41,14,3
milk,carton,egg,205.033972131554,50,38,5
milk,carton,plastic,198.891222341917,46,23,2
milk,carton,in,173.836571857799,266,112,28
milk,carton,in_the,162.876315922011,0,0,0
milk,carton,that,154.336121729575,120,57,10
milk,carton,heb,148.25667217467,5,4,0
milk,fat,low,395.034510490485,114,31,3
milk,fat,meat,357.46103100758,89,50,5
milk,fat,reduced,318.920755238738,18,6,2
milk,fat,free,283.481752943713,303,16,1
milk,fat,mootopia,279.653996911366,5,2,0
milk,fat,of,255.530744776595,584,148,21
milk,fat,bacon,192.327023013029,47,19,6
milk,fat,lean,184.164160196669,123,12,3
milk,fat,not,166.972078500316,333,117,13
milk,fat,content,150.407314324286,22,8,0
milk,fat,beef,148.068038047757,32,13,5
milk,fat,calories,146.990190853365,31,9,0
milk,almond,wash,7082.16522260802,294,2,3
milk,almond,body,7069.57147125388,292,2,3
milk,almond,yardley,6744.05366385216,30,0,1
milk,almond,earth,6134.92329105316,49,0,1
milk,almond,spring,5955.65726033133,56,1,1
milk,almond,sample,5453.87919139303,305,2,4
milk,almond,london,5358.45865596551,10,0,0
milk,almond,skin,4432.8617774467,263,1,3
milk,almond,amp,3727.28717003623,333,2,4
milk,almond,received,3670.47807438578,230,4,3
milk,almond,pinchme,3499.73953332379,38,0,0
milk,almond,free,3232.82095659152,238,2,1
milk,almond,scent,2547.16437420994,219,3,1
milk,almond,from,1489.58680863539,218,10,3
milk,almond,feeling,1448.92445262615,93,1,0
milk,date,by,1925.77311185002,426,201,48
milk,date,purchased,1420.32179003675,274,164,42
milk,date,sell,1112.44592868863,91,92,17
milk,date,opened,1046.35531106452,169,104,34
milk,date,bought,970.64664671896,252,147,23
milk,date,of,969.287778513972,882,435,108
milk,date,heb,893.963660892099,31,14,6
milk,date,had,841.785900917836,371,259,33
milk,date,was,792.913727567997,667,395,94
milk,date,on,786.990342820063,1238,603,177
milk,date,that,734.203095907345,586,319,60
milk,date,not,583.469086998142,598,356,72
milk,of,that,7052.07113006199,10674,3203,654
milk,of,one,7036.71009588428,9861,2910,598
milk,of,out,6841.33952170191,9455,2907,832
milk,of,to,5477.50800623605,26023,6487,1929
milk,of,not,5270.88216573233,10488,4147,992
milk,of,but,4950.45284029795,9373,3011,582
milk,of,in,4254.65535870288,32538,7471,2513
milk,of,was,4136.84385996498,11995,4174,895
milk,of,is,3809.69004616607,28659,6441,1797
milk,of,this,3802.15404030448,14877,3202,792
milk,gallons,gallon,209.722387246788,69,43,16
milk,gallons,half,196.717531202827,25,10,5
milk,gallons,of,153.202899686992,61,32,12
milk,gallons,two,99.2215082249604,22,6,3
milk,gallons,that,83.2886098199524,35,21,4
milk,gallons,water,80.9727665255778,11,10,5
milk,gallons,one,70.4976501855999,33,18,9
milk,gallons,had,68.8195520932786,24,15,4
milk,gallons,week,68.0015116105787,20,6,2
milk,gallons,last,65.2327848910354,18,12,2
milk,gallons,not,58.8757750061341,41,21,4
milk,gallons,they,56.8052125875838,23,12,5
milk,gallons,was,54.8303867150098,38,20,6
milk,gallons,have,52.6887886351906,39,21,5
milk,expiration,dates,993.859674093779,69,34,11
milk,expiration,purchased,742.372744888533,99,74,23
milk,expiration,opened,478.303102273494,48,45,19
milk,expiration,had,412.19720865367,126,102,10
milk,expiration,heb,392.858811615501,11,6,1
milk,expiration,expired,391.877931811847,35,29,10
milk,expiration,mold,321.668032547459,38,22,8
milk,expiration,milk,320.379567642696,43,32,8
milk,expiration,that,319.361376354937,157,108,25
milk,expiration,bought,315.752028548159,65,59,8
milk,expiration,about,312.68550048396,60,59,9
milk,expiration,on,309.737327625509,341,234,82
milk,expiration,of,307.946353797801,222,166,39
milk,cartons,milk,281.560847008135,37,13,2
milk,cartons,eggs,194.247257451061,17,19,0
milk,cartons,of,192.943467317615,88,41,5
milk,cartons,egg,186.250242457259,23,21,1
milk,cartons,plastic,158.27799078729,19,14,1
milk,cartons,mootopia,154.735435164068,1,1,0
milk,cartons,bottom,128.463040305767,19,6,0
milk,cartons,two,114.288054785691,21,12,1
milk,cartons,have,108.030903979205,71,25,2
milk,cartons,to,89.4895188827068,102,49,7
milk,cartons,been,88.5173896257766,30,15,0
milk,cartons,last,87.8711683778092,40,22,3
milk,cartons,that,85.7980575188994,53,20,2
milk,cereal,flakes,326.155005783774,23,6,0
milk,cereal,fiber,324.827516067307,16,5,0
milk,cereal,milk,276.825282285921,55,16,1
milk,cereal,granola,174.730482772458,13,2,2
milk,cereal,bowl,149.064494146965,27,8,0
milk,cereal,frosted,147.756585088093,5,1,0
milk,cereal,raisins,147.264157444704,13,7,0
milk,cereal,boxes,133.403159447946,17,8,1
milk,cereal,hard,122.618853755295,37,13,2
milk,cereal,this,120.518912151922,138,32,9
milk,cereal,heb,113.958647926804,9,3,0
milk,cereal,oats,98.0994931538589,6,1,1
milk,cereal,bran,97.6421635318547,32,9,2
hill,hill,country,11220.1015244969,63,52,13
hill,hill,fare,8023.16368108988,36,30,9
hill,hill,purchased,714.036464252975,21,18,2
hill,hill,of,707.522146471776,149,76,11
hill,hill,to,489.088256517891,187,88,20
hill,hill,bought,483.682226426899,26,20,3
hill,hill,at,480.07835096959,206,94,16
hill,hill,not,469.394299621228,79,57,7
hill,hill,fair,467.9995340975,14,8,0
hill,hill,but,458.692898333538,72,42,4
hill,hill,in,434.378846029751,230,99,28
hill,hill,that,433.199564241339,80,40,5
hill,country,fare,7846.2952577644,54,41,13
hill,country,of,727.784160567913,115,70,13
hill,country,purchased,699.01007335633,20,21,3
hill,country,to,498.052526864223,150,84,17
hill,country,bought,463.528499202337,27,25,5
hill,country,fair,458.179450683761,19,10,0
hill,country,but,457.962452175096,61,40,4
hill,country,not,457.214505836368,82,57,9
hill,country,that,456.512819795869,70,41,5
hill,country,have,430.454477117397,84,52,6
hill,country,in,429.74984879652,174,94,25
hill,country,can,428.869380195625,48,33,6
hill,fare,country,7846.2952577644,54,41,13
hill,fare,purchased,547.755993790459,10,11,2
hill,fare,of,490.006241284311,51,38,8
hill,fare,bought,342.152850697748,20,12,2
hill,fare,was,307.15168005228,37,25,5
hill,fare,there,305.225073033012,15,12,3
hill,fare,but,300.68787027197,35,27,2
hill,fare,can,299.670344473328,22,22,3
hill,fare,to,293.545396478381,62,45,9
hill,fare,have,290.86382428417,29,29,4
hill,fare,not,286.940072219353,37,27,4
hill,purchased,of,2725.24864320224,1905,1048,233
hill,purchased,heb,2661.77726767957,72,35,6
hill,purchased,was,2348.86440894054,1526,918,172
hill,purchased,had,1941.29855329636,805,511,80
hill,purchased,at,1895.77324593859,2309,1251,273
hill,purchased,opened,1739.18914223136,303,177,44
hill,purchased,that,1724.01895443629,1148,650,107
hill,purchased,not,1713.92758362368,1287,799,124
hill,purchased,it_was,1692.18402599217,0,0,0
hill,purchased,on,1619.29998804815,2374,1297,296
hill,purchased,i_have,1517.28106690617,0,0,0
hill,purchased,date,1420.32179003675,274,164,42
hill,of,that,7052.07113006199,10674,3203,654
hill,of,one,7036.71009588428,9861,2910,598
hill,of,out,6841.33952170191,9455,2907,832
hill,of,to,5477.50800623605,26023,6487,1929
hill,of,not,5270.88216573233,10488,4147,992
hill,of,but,4950.45284029795,9373,3011,582
hill,of,in,4254.65535870288,32538,7471,2513
hill,of,was,4136.84385996498,11995,4174,895
hill,of,is,3809.69004616607,28659,6441,1797
hill,of,this,3802.15404030448,14877,3202,792
hill,to,have,10766.2939216457,16948,4448,1172
hill,to,be,7855.22104276111,24361,6117,1615
hill,to,you,7794.88162864326,17184,3307,832
hill,to,that,7661.20321153011,14143,4191,928
hill,to,in,6544.77616941882,48169,10305,3731
hill,to,for,5903.72464697901,24666,5168,1425
hill,to,get,5836.68561064964,8806,2599,698
hill,to,your,5722.07783499733,7906,1505,352
hill,to,of,5477.50800623605,26023,6487,1929
hill,to,not,5349.13230337668,14505,5512,1460
hill,bought,heb,2246.93259802042,112,66,9
hill,bought,of,2120.03470833506,2185,1049,219
hill,bought,was,1839.52480525058,1725,921,154
hill,bought,but,1782.46051222505,1344,624,98
hill,bought,this,1744.99124983931,1949,820,178
hill,bought,it_was,1697.26931875478,0,0,0
hill,bought,had,1638.26755240606,848,493,81
hill,bought,at,1428.12626392581,2803,1271,256
hill,bought,them,1424.026540522,826,387,67
hill,bought,just,1422.15388945397,866,407,60
hill,bought,to,1412.54902220471,2835,1246,249
hill,at,heb,5058.88961497741,732,198,57
hill,at,to,4638.98663302558,42183,8594,2733
hill,at,least,4586.19760304783,757,311,64
hill,at,1-800-432-3113,4178.28992769914,894,0,0
hill,at,invite,4062.79226716794,906,1,1
hill,at,discuss,3865.94046988338,949,22,4
hill,at,store,3636.65356052341,5421,1961,487
hill,at,concerns,3609.38168048114,981,21,3
hill,at,have,3578.75842821086,15580,4235,953
hill,at,in,3533.03141662665,50436,9917,3223
hill,at,all,3240.31236560224,21299,4995,1189
hill,at,you,3083.67011108808,16688,3157,714
hill,at,in_the,2976.24715765659,0,0,0
hill,not,did,7006.54569465108,2673,1545,387
hill,not,that,6756.73684899881,6789,2890,590
hill,not,to,5349.13230337668,14505,5512,1460
hill,not,of,5270.88216573233,10488,4147,992
hill,not,was,4887.82585553313,7221,3628,668
hill,not,do,4718.34003252909,6736,2722,570
hill,not,be,4012.50446008658,10097,3942,827
hill,not,if,3891.6910537947,4549,1747,357
hill,not,have,3298.70336225815,6494,2870,618
hill,not,does,3238.46372257592,1647,577,141
hill,not,store,3040.07790728193,2872,1364,368
hill,fair,country,458.179450683761,19,10,0
hill,fair,price,142.787066575605,99,11,3
hill,fair,prices,122.019333994947,28,1,0
hill,fair,brand,90.0423124553636,45,12,0
hill,fair,be,88.7454205276445,149,38,8
hill,fair,at,83.3858495140448,256,47,8
hill,fair,of,83.284276667051,182,37,7
hill,fair,not,71.6479139677249,119,37,4
hill,fair,that,62.0218534064479,115,26,2
hill,fair,no,53.8298466266133,158,45,6
hill,fair,had,49.8584524556063,52,18,2
hill,fair,you,47.8739073015749,104,29,5
hill,but,not,10770.6880820878,7095,2769,548
hill,but,that,5494.79276386276,5619,2058,321
hill,but,to,5215.02001692541,12804,3992,826
hill,but,of,4950.45284029795,9373,3011,582
hill,but,was,4794.32710699411,6488,2643,396
hill,but,be,4213.41060752468,9161,2877,517
hill,but,this,3608.25949995033,7771,2150,368
hill,but,had,3384.79006791115,2869,1383,167
hill,but,like,3123.32972207852,4815,1030,122
hill,but,is,3105.96926820511,13758,4087,780
hill,but,one,3072.88747386402,5111,1743,270
hill,but,would,3018.2904985426,2862,826,127
hill,in,valued,5535.99876406323,1726,1,0
hill,in,management,5530.72015708545,1771,40,1
hill,in,shared,5450.0755527094,1763,13,1
hill,in,have,5440.92424910283,18178,4917,1279
hill,in,your,5265.34058062779,8789,1622,401
hill,in,write,5182.36014685174,1849,39,5
hill,in,further,5181.77215531329,1856,56,4
hill,in,feedback,5168.09329762449,1870,51,4
hill,in,you,5074.00056911632,19711,3606,983
hill,in,review,4963.04557118099,2777,217,27
hill,in,future,4676.80992746772,2114,71,9
hill,that,to,7661.20321153011,14143,4191,928
hill,that,of,7052.07113006199,10674,3203,654
hill,that,not,6756.73684899881,6789,2890,590
hill,that,was,6137.07989233593,7309,2821,495
hill,that,but,5494.79276386276,5619,2058,321
hill,that,is,5244.8866630313,14677,4198,810
hill,that,be,4876.74167742161,9991,3121,610
hill,that,had,4510.69971610699,3272,1596,237
hill,that,in,4330.08464550832,16388,4731,1096
hill,that,have,4115.81298027746,6587,2336,408
hill,that,there,4059.78632308496,2340,975,152
gtc,gtc,bulbs,101.984588067047,0,0,0
gtc,gtc,bulb,86.5422869492322,0,0,0
gtc,gtc,light,34.9674931825139,0,0,0
gtc,gtc,watts,28.7791531658731,0,0,0
gtc,gtc,watt,27.8713663397357,0,0,0
gtc,gtc,purchased,26.8550410396419,0,0,0
gtc,gtc,maker,26.3003607667051,0,0,0
gtc,gtc,two,25.7168204798363,0,0,0
gtc,gtc,envelopes,25.50255399663,0,0,0
gtc,gtc,bought,23.7509240815416,0,0,0
gtc,gtc,crumb,21.7462068721652,0,0,0
gtc,gtc,led,21.7462068721652,0,1,0
gtc,gtc,black,20.0150393811055,0,0,0
gtc,gtc,on,19.5652717831545,0,1,0
gtc,gtc,slice,18.9784555858932,0,0,0
gtc,gtc,tape,18.1945258318447,0,0,0
gtc,bulbs,gtc,101.984588067047,0,0,0
gtc,bulbs,light,85.0388261298649,6,6,2
gtc,bulbs,fire,36.6678501162678,1,3,0
gtc,bulbs,watts,29.8112101606093,0,1,1
gtc,bulbs,watt,28.903359872289,1,2,1
gtc,bulbs,these,19.2798721226864,2,3,0
gtc,bulbs,in,19.0219997428358,5,7,2
gtc,bulbs,neighbor,18.6907319799066,1,1,0
gtc,bulbs,back,17.9492814275436,1,3,2
gtc,bulbs,glass,17.8801996107213,1,2,0
gtc,bulbs,two,17.357910359744,0,5,0
gtc,bulbs,recall,16.7567261555232,1,1,0
gtc,bulbs,serious,15.9310246817768,1,1,0
gtc,bulbs,causing,15.8694131379016,2,0,0
gtc,bulbs,burned,15.6034793280996,1,1,0
gtc,bulb,gtc,86.5422869492322,0,0,0
gtc,bulb,watt,47.4554466735572,1,2,1
gtc,bulb,light,41.1470784540288,7,8,2
gtc,bulb,neighbor,31.4689412666485,1,1,0
gtc,bulb,in,28.4788685329258,9,12,2
gtc,bulb,fire,26.3451429670677,1,3,0
gtc,bulb,bottom,24.5518743358552,1,2,1
gtc,bulb,in_the,24.5098090693355,0,0,0
gtc,bulb,remove,20.3858059910126,0,2,1
gtc,bulb,days,19.3683270053007,1,3,0
gtc,bulb,had,18.8736977768131,4,8,0
gtc,bulb,glass,18.6440886468627,1,2,0
gtc,bulb,broken,18.4627728112973,0,3,0
gtc,bulb,which,18.1839653681964,2,3,0
gtc,bulb,recall,17.2554211127572,1,1,0
gtc,light,refreshing,344.349847594276,101,1,13
gtc,light,crispy,308.248601228464,86,4,3
gtc,light,skin,259.466630849987,237,8,2
gtc,light,crisp,256.707759118639,171,5,11
gtc,light,wash,245.827445274219,181,5,0
gtc,light,sample,239.807208065409,219,3,0
gtc,light,body,233.510871133767,184,1,1
gtc,light,service,226.34887285158,36,6,1
gtc,light,yardley,225.147645371035,6,0,0
gtc,light,flavor,189.860052163247,507,32,57
gtc,light,london,189.758646481205,0,0,0
gtc,light,chips,164.872819889337,173,12,12
gtc,watts,gtc,28.7791531658731,0,0,0
gtc,watts,unscrewed,15.9277918376029,0,1,0
gtc,watts,microwave,15.3508329330944,0,2,0
gtc,watts,installed,14.9036457841285,0,1,0
gtc,watts,elizabeth,14.6530414042063,0,0,0
gtc,watts,warms,13.5844229198992,0,0,0
gtc,watts,mechanism,13.5844229198992,0,1,0
gtc,watts,bulb,13.4510414111428,0,1,1
gtc,watts,bought,13.0382995312102,0,1,1
gtc,watts,steamable,12.4556534411386,0,0,0
gtc,watts,kidney,12.4556534411386,0,1,0
gtc,watts,ago,12.1896497760899,0,1,0
gtc,watts,additions,11.9102717293426,0,1,0
gtc,watts,soften,11.6322819548659,0,0,0
gtc,watts,containing,11.3883182536811,0,1,0
gtc,watt,bulbs,28.903359872289,1,2,1
gtc,watt,gtc,27.8713663397357,0,0,0
gtc,watt,remove,27.4590565483086,1,1,0
gtc,watt,microwave,24.7962374510244,4,3,0
gtc,watt,suggestion,20.9582551135682,1,0,0
gtc,watt,burned,20.5022388561629,1,2,0
gtc,watt,fire,20.1981474338099,1,1,0
gtc,watt,or,18.8913275348023,7,5,0
gtc,watt,melted,18.8552931812592,2,0,0
gtc,watt,additional,17.7944584093057,2,0,0
gtc,watt,aware,16.6629293677397,1,1,0
gtc,watt,packaged,16.2087141294032,1,1,0
gtc,watt,an,15.9434553585015,6,7,1
gtc,watt,fixtures,15.5251323306002,1,0,0
gtc,watt,slits,15.5251323306002,1,0,0
gtc,purchased,of,2725.24864320224,1905,1048,233
gtc,purchased,heb,2661.77726767957,72,35,6
gtc,purchased,was,2348.86440894054,1526,918,172
gtc,purchased,had,1941.29855329636,805,511,80
gtc,purchased,at,1895.77324593859,2309,1251,273
gtc,purchased,opened,1739.18914223136,303,177,44
gtc,purchased,that,1724.01895443629,1148,650,107
gtc,purchased,not,1713.92758362368,1287,799,124
gtc,purchased,it_was,1692.18402599217,0,0,0
gtc,purchased,on,1619.29998804815,2374,1297,296
gtc,purchased,i_have,1517.28106690617,0,0,0
gtc,purchased,date,1420.32179003675,274,164,42
gtc,maker,cup,85.768441948574,15,5,1
gtc,maker,moka,62.9962340747006,2,0,0
gtc,maker,espresso,56.1331297708675,6,0,0
gtc,maker,roast,55.1017101565376,5,0,0
gtc,maker,this,51.0878405198455,47,13,5
gtc,maker,brew,50.6551862359047,7,2,0
gtc,maker,pods,47.3043640013784,5,1,1
gtc,maker,pot,45.9826067308895,9,2,0
gtc,maker,cups,44.7048348146491,6,2,1
gtc,maker,waffle,35.8879905650392,3,1,1
gtc,maker,drip,35.8856824482791,4,0,0
gtc,maker,machine,32.668135760352,6,0,0
gtc,maker,years,32.5338144050911,8,2,2
gtc,two,one,1439.22948346054,831,430,84
gtc,two,had,1342.05839916226,573,342,59
gtc,two,were,1324.61088837776,494,305,66
gtc,two,purchased,1293.03858452104,334,214,48
gtc,two,that,1242.77270160336,868,447,78
gtc,two,last,1199.85202135053,342,233,44
gtc,two,but,1089.04089406691,798,403,48
gtc,two,not,1016.47404656932,900,515,93
gtc,two,to,1001.45524073765,1728,791,158
gtc,two,weeks,918.63777858438,153,88,21
gtc,two,was,917.116619748529,870,534,86
gtc,two,i_have,899.651310096029,0,0,0
gtc,envelopes,gtc,25.50255399663,0,0,0
gtc,envelopes,box,22.7629871801473,2,1,0
gtc,envelopes,tape,21.7676041065715,2,0,0
gtc,envelopes,flimsy,20.6008941191249,1,0,0
gtc,envelopes,trail,18.6594633394852,0,0,0
gtc,envelopes,pink,17.199075830169,2,0,0
gtc,envelopes,mailing,14.4304104256444,0,0,1
gtc,envelopes,rectangle,14.0278143743053,0,0,0
gtc,envelopes,repeating,14.0278143743053,1,0,0
gtc,envelopes,ck,13.6930346456356,4,0,2
gtc,envelopes,letdown,13.6930346456356,1,0,0
gtc,envelopes,check-out,12.9333462994546,0,0,0
gtc,envelopes,sturdier,12.7331258486956,1,0,0
gtc,envelopes,secured,12.3844247409143,1,0,0
gtc,envelopes,disheartening,12.3844247409143,0,1,0
gtc,bought,heb,2246.93259802042,112,66,9
gtc,bought,of,2120.03470833506,2185,1049,219
gtc,bought,was,1839.52480525058,1725,921,154
gtc,bought,but,1782.46051222505,1344,624,98
gtc,bought,this,1744.99124983931,1949,820,178
gtc,bought,it_was,1697.26931875478,0,0,0
gtc,bought,had,1638.26755240606,848,493,81
gtc,bought,at,1428.12626392581,2803,1271,256
gtc,bought,them,1424.026540522,826,387,67
gtc,bought,just,1422.15388945397,866,407,60
gtc,bought,to,1412.54902220471,2835,1246,249
gtc,crumb,sharp,29.7262769364752,8,3,0
gtc,crumb,crust,28.6656387541443,10,3,0
gtc,crumb,tray,28.5610466944054,2,2,1
gtc,crumb,brush,28.4672281877138,2,1,0
gtc,crumb,slice,27.4086475907825,13,2,1
gtc,crumb,toaster,26.6481344210915,5,2,0
gtc,crumb,edges,24.8571344143711,6,1,1
gtc,crumb,unevenly,24.519869083073,2,0,0
gtc,crumb,gtc,21.7462068721652,0,0,0
gtc,crumb,toasts,20.9279620805755,2,0,0
gtc,crumb,cake,17.2103265849873,10,0,0
gtc,crumb,pie,16.6085485294461,33,14,1
gtc,crumb,tender,16.2423478672281,5,1,0
gtc,crumb,bread,15.8193147280253,75,15,4
gtc,led,conclusion,23.5539417671971,5,2,0
gtc,led,gtc,21.7462068721652,0,1,0
gtc,led,me,19.6954224454239,3561,1462,277
gtc,led,stars,17.4878832045943,27,6,0
gtc,led,out,16.9396014618687,1522,746,129
gtc,led,to,15.7578535494395,3761,1578,324
gtc,led,sincerely,14.9535358445719,2,1,0
gtc,led,that,14.7758253696375,1796,885,128
gtc,led,down,14.6227815216407,164,77,10
gtc,led,believe,14.2130455113947,80,35,5
gtc,led,which,13.8743266649544,320,160,16
gtc,led,known,12.9852503314614,24,10,2
gtc,led,states,12.9458087892272,11,12,0
gtc,led,disappointed,12.7778122462332,91,146,11
gtc,led,however,12.7778122462332,73,33,7
gtc,black,of,366.998221462127,365,152,31
gtc,black,beans,348.397231107112,62,14,4
gtc,black,purchased,279.448991701938,77,46,8
gtc,black,bacon,279.012256813701,57,7,4
gtc,black,spots,259.887553637382,26,17,4
gtc,black,heb,249.056842240505,16,7,2
gtc,black,on,241.934081542306,468,176,43
gtc,black,opened,222.680019182619,50,28,7
gtc,black,forest,219.206206895411,5,4,0
gtc,black,mold,208.279025148135,32,20,6
gtc,black,in_the,196.288498491514,0,0,0
gtc,on,to,3467.6350484509,41565,9215,3229
gtc,on,of,3238.02890240634,28872,6741,2237
gtc,on,that,3184.57311976887,14635,4306,943
gtc,on,time,2977.68521993514,11844,2732,1285
gtc,on,was,2591.89153627539,16955,5595,1361
gtc,on,not,2515.80320593994,14479,5616,1507
gtc,on,but,2328.4935261216,13394,4143,922
gtc,on,or,2256.27467333013,44691,9646,3532
gtc,on,be,2167.2135148379,24914,6184,1637
gtc,on,put,2086.87680582097,2367,731,182
gtc,slice,of,165.144765503239,536,148,34
gtc,slice,slices,144.647865339648,326,80,24
gtc,slice,thin,111.970229384024,230,71,15
gtc,slice,cut,110.281717605423,62,35,4
gtc,slice,cheese,102.427742031869,159,36,14
gtc,slice,sandwich,97.8525050296448,101,16,8
gtc,slice,sliced,95.179650046397,412,96,41
gtc,slice,toast,89.4552672249265,57,6,1
gtc,slice,just,74.1936252671294,182,45,12
gtc,slice,one,73.0821675178595,249,76,18
gtc,slice,on,72.1484332988039,726,174,54
gtc,tape,plastic,55.4450950920582,9,3,2
gtc,tape,seal,52.1464215749875,7,5,1
gtc,tape,taped,44.625566452276,6,10,2
gtc,tape,to,36.9939790116623,53,23,5
gtc,tape,security,35.8395834136754,2,0,1
gtc,tape,secure,33.5478804027662,4,1,0
gtc,tape,open,31.5456471187063,12,5,0
gtc,tape,bought,31.3320941035636,10,6,1
gtc,tape,strip,31.1065620556474,3,0,1
gtc,tape,tampered,29.3781366059557,2,1,0
gtc,tape,not,27.9266060469672,18,19,1