{
  "nodes": [
    {"id": "Jorah", "group": 0},
    {"id": "Balon", "group": 0},
    {"id": "Loras", "group": 0},
    {"id": "Barristan", "group": 0},
    {"id": "Gregor", "group": 0},
    {"id": "Hound", "group": 0},
    {"id": "Blackfish", "group": 0},
    {"id": "Tyrion", "group": 1},
    {"id": "Jaime", "group": 1},
    {"id": "Littlefinger", "group": 1},
    {"id": "Bronn", "group": 1},
    {"id": "Varys", "group": 1},
    {"id": "Aemon", "group": 2},
    {"id": "Pycelle", "group": 2},
    {"id": "Dothraki", "group": 3},
    {"id": "Hizdahr", "group": 3},
    {"id": "Daenerys", "group": 3},
    {"id": "Drogo", "group": 3},
    {"id": "Sam", "group": 4},
    {"id": "Theon", "group": 4},
    {"id": "Asha", "group": 4},
    {"id": "Bran", "group": 4},
    {"id": "Jon", "group": 4},
    {"id": "Melisandre", "group": 5},
    {"id": "Ramsay", "group": 6},
    {"id": "Walder", "group": 6},
    {"id": "Sansa", "group": 7},
    {"id": "Catelyn", "group": 7},
    {"id": "Robb", "group": 7},
    {"id": "Brienne", "group": 7},
    {"id": "Arya", "group": 7},
    {"id": "Eddard", "group": 7},
    {"id": "Mance", "group": 8},
    {"id": "Tommen", "group": 9},
    {"id": "Renly", "group": 9},
    {"id": "Joffrey", "group": 9},
    {"id": "Robert", "group": 9},
    {"id": "Lysa", "group": 9},
    {"id": "Cersei", "group": 9},
    {"id": "Margaery", "group": 9},
    {"id": "Stannis", "group": 10},
    {"id": "Tywin", "group": 10},
    {"id": "Davos", "group": 11}   ],      
  "links": [ 
    {"source": "Jon", "target": "Tyrion", "value": 166},
    {"source": "Jon", "target": "Arya", "value": 181},
    {"source": "Jon", "target": "Jaime", "value": 79},
    {"source": "Jon", "target": "Bran", "value": 284},
    {"source": "Jon", "target": "Sansa", "value": 77},
    {"source": "Jon", "target": "Eddard", "value": 301},
    {"source": "Jon", "target": "Catelyn", "value": 107},
    {"source": "Jon", "target": "Stannis", "value": 309},
    {"source": "Jon", "target": "Robb", "value": 263},
    {"source": "Jon", "target": "Robert", "value": 213},
    {"source": "Jon", "target": "Sam", "value": 601},
    {"source": "Jon", "target": "Theon", "value": 60},
    {"source": "Jon", "target": "Aemon", "value": 302},
    {"source": "Jon", "target": "Lysa", "value": 79},
    {"source": "Jon", "target": "Mance", "value": 362},
    {"source": "Jon", "target": "Melisandre", "value": 154},
    {"source": "Tyrion", "target": "Jaime", "value": 348},
    {"source": "Tyrion", "target": "Bran", "value": 74},
    {"source": "Tyrion", "target": "Sansa", "value": 346},
    {"source": "Tyrion", "target": "Eddard", "value": 105},
    {"source": "Tyrion", "target": "Cersei", "value": 487},
    {"source": "Tyrion", "target": "Catelyn", "value": 160},
    {"source": "Tyrion", "target": "Stannis", "value": 191},
    {"source": "Tyrion", "target": "Robb", "value": 101},
    {"source": "Tyrion", "target": "Robert", "value": 151},
    {"source": "Tyrion", "target": "Joffrey", "value": 389},
    {"source": "Tyrion", "target": "Tywin", "value": 358},
    {"source": "Tyrion", "target": "Littlefinger", "value": 163},
    {"source": "Tyrion", "target": "Hound", "value": 76},
    {"source": "Tyrion", "target": "Jorah", "value": 76},
    {"source": "Tyrion", "target": "Varys", "value": 244},
    {"source": "Tyrion", "target": "Renly", "value": 85},
    {"source": "Tyrion", "target": "Lysa", "value": 105},
    {"source": "Tyrion", "target": "Bronn", "value": 405},
    {"source": "Tyrion", "target": "Tommen", "value": 89},
    {"source": "Tyrion", "target": "Balon", "value": 60},
    {"source": "Tyrion", "target": "Pycelle", "value": 105},
    {"source": "Tyrion", "target": "Gregor", "value": 72},
    {"source": "Arya", "target": "Bran", "value": 142},
    {"source": "Arya", "target": "Sansa", "value": 477},
    {"source": "Arya", "target": "Eddard", "value": 200},
    {"source": "Arya", "target": "Robb", "value": 149},
    {"source": "Arya", "target": "Robert", "value": 63},
    {"source": "Arya", "target": "Theon", "value": 62},
    {"source": "Arya", "target": "Joffrey", "value": 145},
    {"source": "Arya", "target": "Tywin", "value": 59},
    {"source": "Arya", "target": "Hound", "value": 208},
    {"source": "Jaime", "target": "Sansa", "value": 93},
    {"source": "Jaime", "target": "Eddard", "value": 136},
    {"source": "Jaime", "target": "Cersei", "value": 366},
    {"source": "Jaime", "target": "Catelyn", "value": 161},
    {"source": "Jaime", "target": "Stannis", "value": 60},
    {"source": "Jaime", "target": "Robb", "value": 129},
    {"source": "Jaime", "target": "Robert", "value": 198},
    {"source": "Jaime", "target": "Joffrey", "value": 122},
    {"source": "Jaime", "target": "Brienne", "value": 311},
    {"source": "Jaime", "target": "Tywin", "value": 202},
    {"source": "Jaime", "target": "Hound", "value": 65},
    {"source": "Jaime", "target": "Varys", "value": 56},
    {"source": "Jaime", "target": "Renly", "value": 102},
    {"source": "Jaime", "target": "Tommen", "value": 104},
    {"source": "Jaime", "target": "Loras", "value": 117},
    {"source": "Jaime", "target": "Gregor", "value": 61},
    {"source": "Jaime", "target": "Blackfish", "value": 103},
    {"source": "Daenerys", "target": "Jorah", "value": 427},
    {"source": "Daenerys", "target": "Barristan", "value": 253},
    {"source": "Daenerys", "target": "Dothraki", "value": 324},
    {"source": "Daenerys", "target": "Drogo", "value": 467},
    {"source": "Daenerys", "target": "Hizdahr", "value": 183},
    {"source": "Bran", "target": "Sansa", "value": 99},
    {"source": "Bran", "target": "Eddard", "value": 187},
    {"source": "Bran", "target": "Catelyn", "value": 147},
    {"source": "Bran", "target": "Robb", "value": 538},
    {"source": "Bran", "target": "Robert", "value": 55},
    {"source": "Bran", "target": "Theon", "value": 191},
    {"source": "Bran", "target": "Walder", "value": 93},
    {"source": "Sansa", "target": "Eddard", "value": 177},
    {"source": "Sansa", "target": "Cersei", "value": 174},
    {"source": "Sansa", "target": "Catelyn", "value": 100},
    {"source": "Sansa", "target": "Robb", "value": 136},
    {"source": "Sansa", "target": "Robert", "value": 123},
    {"source": "Sansa", "target": "Joffrey", "value": 567},
    {"source": "Sansa", "target": "Brienne", "value": 78},
    {"source": "Sansa", "target": "Littlefinger", "value": 196},
    {"source": "Sansa", "target": "Hound", "value": 157},
    {"source": "Sansa", "target": "Lysa", "value": 123},
    {"source": "Sansa", "target": "Loras", "value": 85},
    {"source": "Sansa", "target": "Margaery", "value": 118},
    {"source": "Eddard", "target": "Cersei", "value": 137},
    {"source": "Eddard", "target": "Catelyn", "value": 278},
    {"source": "Eddard", "target": "Stannis", "value": 121},
    {"source": "Eddard", "target": "Robb", "value": 140},
    {"source": "Eddard", "target": "Robert", "value": 614},
    {"source": "Eddard", "target": "Theon", "value": 118},
    {"source": "Eddard", "target": "Joffrey", "value": 117},
    {"source": "Eddard", "target": "Tywin", "value": 82},
    {"source": "Eddard", "target": "Littlefinger", "value": 233},
    {"source": "Eddard", "target": "Hound", "value": 59},
    {"source": "Eddard", "target": "Barristan", "value": 76},
    {"source": "Eddard", "target": "Varys", "value": 152},
    {"source": "Eddard", "target": "Renly", "value": 114},
    {"source": "Eddard", "target": "Pycelle", "value": 113},
    {"source": "Cersei", "target": "Stannis", "value": 113},
    {"source": "Cersei", "target": "Robert", "value": 242},
    {"source": "Cersei", "target": "Joffrey", "value": 259},
    {"source": "Cersei", "target": "Tywin", "value": 145},
    {"source": "Cersei", "target": "Littlefinger", "value": 55},
    {"source": "Cersei", "target": "Varys", "value": 96},
    {"source": "Cersei", "target": "Bronn", "value": 58},
    {"source": "Cersei", "target": "Tommen", "value": 222},
    {"source": "Cersei", "target": "Loras", "value": 78},
    {"source": "Cersei", "target": "Margaery", "value": 152},
    {"source": "Cersei", "target": "Pycelle", "value": 94},
    {"source": "Catelyn", "target": "Stannis", "value": 73},
    {"source": "Catelyn", "target": "Robb", "value": 442},
    {"source": "Catelyn", "target": "Robert", "value": 75},
    {"source": "Catelyn", "target": "Theon", "value": 61},
    {"source": "Catelyn", "target": "Brienne", "value": 152},
    {"source": "Catelyn", "target": "Tywin", "value": 69},
    {"source": "Catelyn", "target": "Littlefinger", "value": 86},
    {"source": "Catelyn", "target": "Walder", "value": 136},
    {"source": "Catelyn", "target": "Renly", "value": 145},
    {"source": "Catelyn", "target": "Lysa", "value": 169},
    {"source": "Catelyn", "target": "Blackfish", "value": 112},
    {"source": "Stannis", "target": "Robb", "value": 73},
    {"source": "Stannis", "target": "Robert", "value": 210},
    {"source": "Stannis", "target": "Sam", "value": 78},
    {"source": "Stannis", "target": "Joffrey", "value": 139},
    {"source": "Stannis", "target": "Davos", "value": 282},
    {"source": "Stannis", "target": "Tywin", "value": 120},
    {"source": "Stannis", "target": "Renly", "value": 311},
    {"source": "Stannis", "target": "Tommen", "value": 60},
    {"source": "Stannis", "target": "Mance", "value": 58},
    {"source": "Stannis", "target": "Melisandre", "value": 156},
    {"source": "Robb", "target": "Theon", "value": 210},
    {"source": "Robb", "target": "Joffrey", "value": 109},
    {"source": "Robb", "target": "Tywin", "value": 94},
    {"source": "Robb", "target": "Walder", "value": 156},
    {"source": "Robb", "target": "Renly", "value": 74},
    {"source": "Robb", "target": "Blackfish", "value": 88},
    {"source": "Robert", "target": "Joffrey", "value": 133},
    {"source": "Robert", "target": "Tywin", "value": 88},
    {"source": "Robert", "target": "Littlefinger", "value": 162},
    {"source": "Robert", "target": "Barristan", "value": 69},
    {"source": "Robert", "target": "Varys", "value": 75},
    {"source": "Robert", "target": "Renly", "value": 195},
    {"source": "Robert", "target": "Lysa", "value": 90},
    {"source": "Robert", "target": "Pycelle", "value": 73},
    {"source": "Sam", "target": "Aemon", "value": 286},
    {"source": "Theon", "target": "Walder", "value": 57},
    {"source": "Theon", "target": "Asha", "value": 99},
    {"source": "Theon", "target": "Balon", "value": 92},
    {"source": "Theon", "target": "Ramsay", "value": 255},
    {"source": "Joffrey", "target": "Tywin", "value": 84},
    {"source": "Joffrey", "target": "Littlefinger", "value": 80},
    {"source": "Joffrey", "target": "Hound", "value": 151},
    {"source": "Joffrey", "target": "Varys", "value": 75},
    {"source": "Joffrey", "target": "Renly", "value": 88},
    {"source": "Joffrey", "target": "Tommen", "value": 169},
    {"source": "Joffrey", "target": "Margaery", "value": 113},
    {"source": "Brienne", "target": "Renly", "value": 109},
    {"source": "Davos", "target": "Melisandre", "value": 136},
    {"source": "Tywin", "target": "Gregor", "value": 58},
    {"source": "Littlefinger", "target": "Varys", "value": 145},
    {"source": "Littlefinger", "target": "Renly", "value": 62},
    {"source": "Littlefinger", "target": "Lysa", "value": 161},
    {"source": "Littlefinger", "target": "Pycelle", "value": 70},
    {"source": "Hound", "target": "Gregor", "value": 61},
    {"source": "Jorah", "target": "Dothraki", "value": 112},
    {"source": "Jorah", "target": "Drogo", "value": 98},
    {"source": "Barristan", "target": "Hizdahr", "value": 102},
    {"source": "Varys", "target": "Renly", "value": 56},
    {"source": "Varys", "target": "Pycelle", "value": 83},
    {"source": "Renly", "target": "Loras", "value": 89},
    {"source": "Asha", "target": "Balon", "value": 58},
    {"source": "Tommen", "target": "Margaery", "value": 116},
    {"source": "Loras", "target": "Margaery", "value": 92},
    {"source": "Dothraki", "target": "Drogo", "value": 139}  ]
    }