rank,topic,negative,neutral,positive
24,dog food,215,50,282
29,heb brand,235,58,358
28,heb texas,208,54,253
25,potato salad,195,56,291
27,purchased heb,215,53,335
23,taste like,177,57,287
26,would like,235,61,325
10,best product,394,276,2833
4,central market,463,311,2953
20,chicken breast,387,255,2817
11,easy prepare,402,332,2751
12,family love,460,328,2810
1,good product,429,358,3332
2,great flavor,460,330,2824
5,great product,440,298,3305
19,heb product,448,314,2766
3,hill country,436,360,2708
8,hot dog,400,303,3403
18,ice cream,516,396,4018
17,look forward,393,286,3244
6,look like,421,305,2741
14,love heb,480,332,2842
15,name brand,462,388,2898
13,olive oil,448,306,3262
7,peanut butter,451,304,3144
9,right amount,438,340,3041
16,summer day,407,288,2496