substance;cas;Fonction retenue;Précision sur la fonction retenue;Autres fonctions
(e)-5-decen-1-yl acetate;38421-90-8;Insecticide - Médiateur chimique;;
(e,z)-2,13-octadecadienyl acetate;86252-65-5;Insecticide - Médiateur chimique;;
(e,z)-3,13-octadecadienyl acetate;53120-26-6;Insecticide - Médiateur chimique;;
(e,z)-3,8-tetradecadien-1-yl acetate;163041-87-0;Insecticide - Médiateur chimique;;
(e,z,z)-3,8,11-tetradecatrien-1-yl acetate;163041-94-9;Insecticide - Médiateur chimique;;
(z)-11-hexadecenal;53939-28-9;Insecticide - Médiateur chimique;;
(z)-13-octadecenal;58594-45-9;Insecticide - Médiateur chimique;;
(z)-8-dodecenol;40642-40-8;Insecticide - Médiateur chimique;;
(z)-9-dodecenylacetate;16974-11-1;Insecticide - Médiateur chimique;;
(z)-9-hexadecenal;56219-04-6;Insecticide - Médiateur chimique;;
(z,z)-3,13-octadecadienyl acetate;53120-27-7;Insecticide - Médiateur chimique;;
1 iso thiazolinon chloromethyl;55965-84-9;SA non phyto - Désinfectant - Biocide;;
1,3-dichloropropene;542-75-6;Nématicide;Appliqué par fumigation;"Bactéricide - Virucide
Insecticide"
1,4-dimethylnaphtalene;571-58-4;Régulateur de croissance;;
1,5-diaminopentane;462-94-2;Insecticide - Médiateur chimique;;Autre usage - Répulsif
1-dodecanol;112-53-8;Insecticide - Médiateur chimique;;
1-methylcyclopropene (1-mcp);3100-04-7;Régulateur de croissance;;
1-tetradecanol;112-72-1;Insecticide - Médiateur chimique;;
2 phenyl-phenol;90-43-7;Fongicide;;
2,4-d;94-75-7;Herbicide;;
2,4-db;94-82-6;Herbicide;;
2,4-mcpa;94-74-6;Herbicide;;
2,4-mcpb;94-81-5;Herbicide;;
2-methyl-1-naphtylacetamide;85-07-4;Régulateur de croissance;;
6-benzyladenine;1214-39-7;Régulateur de croissance;;
8-hydroxiquinoline;148-24-3;Fongicide;;Bactéricide - Virucide
abamectine;71751-41-2;Insecticide;;"Insecticide - Acaricide
Nématicide"
acequinocyl;57960-19-7;Insecticide - Acaricide;;
acetamipride;135410-20-7;Insecticide;;
acetate d'ammonium;631-61-8;Insecticide - Médiateur chimique;;
acetate de e-8-dodecenyle;38363-29-0;Insecticide - Médiateur chimique;;
acetate de tetradecyle;638-59-5;Insecticide - Médiateur chimique;;
acetate de z-8-dodecenyle;28079-04-1;Insecticide - Médiateur chimique;;
acetochlore;34256-82-1;Herbicide;;
acibenzolar-s-methyl;135158-54-2;Fongicide;;Insecticide
acide 2,5-dichlorobenzoique;50-79-3;Régulateur de croissance;;Fongicide
acide 2-methyl-1-naphtylacetique;;Régulateur de croissance;;
acide acetique;64-19-7;Herbicide;;
acide alkylbenzene sulfonique lineaire;68584-22-5;SA non phyto - Désinfectant - Biocide;;
acide alpha naphtylacetique (ana);86-87-3;Régulateur de croissance;;
acide benzoique;65-85-0;SA non phyto - Désinfectant - Biocide;;"Fongicide
Bactéricide - Virucide
Insecticide"
acide b-indole acetique (aia);87-51-4;Régulateur de croissance;;
acide b-indole butyrique (aib);133-32-4;Régulateur de croissance;;
acide blue 9;2650-18-2;Autre usage – Adjuvant;;
acide citrique;77-92-9;Autre usage – Adjuvant;Utilisé contre le feu bactérien en tant qu'adjuvant, en association avec l'AMM 2110079;
acide decanoique;334-48-5;Herbicide - Antimousse;;
acide formique;64-18-6;SA non phyto - Divers;Conservation d'ensilage;
acide gibberellique;77-06-5;Régulateur de croissance;;
acide gras sous forme de sel d'amine;;Insecticide;;
acide halauxifene;943832-60-8;Herbicide;;
acide hydroxyacetique;79-14-1;SA non phyto - Désinfectant - Biocide;;
acide malique;6915-15-7;SA non phyto - Désinfectant - Biocide;;
acide nonanoique;112-05-0;Herbicide;;
acide octanoique;124-07-2;Herbicide - Antimousse;;
acide oleique;112-80-1;Autre usage – Adjuvant;Adjuvant pour fongicide ou pour herbicide;
acide pelargonique;112-05-0;Herbicide;;
acide peracetique;79-21-0;SA non phyto - Désinfectant - Biocide;;
acide phosphoreux;10294-56-1;Fongicide;;
acide phosphorique;7664-38-2;Autre usage - Répulsif;;Fongicide
acide propionique;79-09-4;SA non phyto - Divers;Conservation d'ensilage;"Fongicide
Bactéricide - Virucide
Autre usage – Adjuvant"
acide sorbique;110-44-1;SA non phyto - Désinfectant - Biocide;;
acide sulfamique;5329-14-6;SA non phyto - Désinfectant - Biocide;;
acide sulfurique;7664-93-9;SA non phyto - Divers;Conservation d'ensilage;Herbicide
acides gras c14-22 et c14-22 insatures, methyl ester, sulfates, sels de sodium;84776-43-2;Autre usage – Adjuvant;Adjuvant pour fongicide ou pour insecticide;
acides gras, c14-c18 et c16-c18 insatures;67701-06-8;Autre usage – Adjuvant;Adjuvant pour fongicide ou pour herbicide;
aclonifen;74070-46-5;Herbicide;;
acrinathrine;101007-06-1;Insecticide;;Insecticide - Acaricide
adoxophyes orana granulovirus;;Insecticide;;
adoxophyes orana granulovirus souche bv-0001;;Insecticide;;
alcool denature;64-17-5;SA non phyto - Divers;"Usage de type ""Mastic"" (protection des plaies des arbres et/ou greffe)";"
Bactéricide - Virucide"
alcool ethylique;64-17-5;SA non phyto - Désinfectant - Biocide;;"Bactéricide - Virucide
Autre usage - Répulsif"
alcool gras ethoxyle;24938-91-8;Autre usage – Adjuvant;Adjuvant;
alcool isodecylique;61827-42-7;Autre usage – Adjuvant;Adjuvant pour bouillie herbicide;
alcool isopropylique;67-63-0;SA non phyto - Désinfectant - Biocide;;
alcools gras;85566-12-7;Autre usage – Coformulant / Phytoprotecteur / Synergiste;Synergiste (en association avec le chlorprophame);
alcools terpeniques;98-55-5;Autre usage – Adjuvant;Adjuv. Regul. Croiss. | Adjuvant pour bouillie fongicide | Adjuvant pour bouillie insecticide | Adjuvant pour bouillie herbicide;
alkyl amine;61790-57-6;SA non phyto - Désinfectant - Biocide;;
alkyl phenol polyethoxyle;;SA non phyto - Divers;Dans la BNV-D, substance active répertoriée uniquement dans l’AMM n°2020284 (AEXALT), dégraissant utilisé en industrie agro-alimentaire ;
alpha naphtyl acetamide (nad);86-86-2;Régulateur de croissance;;
alpha oleines sulfonate de sodium;68439-57-6;Autre usage – Adjuvant;;
alphachloralose;15879-93-3;Rodenticide - Taupicide;;Autre usage - Répulsif
alpha-chloralose;15879-93-3;Rodenticide - Taupicide;;Autre usage - Répulsif
alphamethrine;67375-30-8;Insecticide;;
ametoctradine;865318-97-4;Fongicide;;
amidosulfuron;120923-37-7;Herbicide;;
amine grasse de suif ethoxylee;61791-26-2;Autre usage – Adjuvant;Adjuvant pour bouillie herbicide;
aminopropyl dodecylamine;2372-82-9;SA non phyto - Désinfectant - Biocide;;
aminopyralid;150114-71-9;Herbicide;;
aminotriazole;61-82-5;Herbicide;;
amisulbrom;348635-87-0;Fongicide;;
amitrole;61-82-5;Herbicide;;
ammonium quaternaire;68424-95-3;SA non phyto - Désinfectant - Biocide;;
ampelomyces quisqualis;;Fongicide;;
ampelomyces quisqualis souche aq10;;Fongicide;;
anthraquinone;84-65-1;Autre usage - Répulsif;;
arsenic du dimethylarsinate de sodium;124-65-2;Insecticide;;
asulame;2302-17-2;Herbicide;;
aureobasidium pullulans souche dsm 14940;67891-88-7;Bactéricide - Virucide;;Fongicide
aureobasidium pullulans souche dsm 14941;67891-88-7;Bactéricide - Virucide;;Fongicide
azadirachtine;11141-17-6;Insecticide;;
azametiphos;35575-96-3;Insecticide;;
azimsulfuron;120162-55-2;Herbicide;;
azocyclotin;41083-11-8;Insecticide - Acaricide;;
azoxystrobine;131860-33-8;Fongicide;;
bacillus amyloliquefaciens souche fzb24;NC;Fongicide;;
bacillus amyloliquefaciens souche mbi 600;NC;Fongicide;;
bacillus amyloliquefaciens subsp plantarum d747;;Fongicide;;
bacillus firmus i-1582;;Nématicide;;
bacillus pumilus souche qst 2808;;Fongicide;;
bacillus subtilis;68038-70-0;Fongicide;;
bacillus subtilis souche qst 713;68038-70-0;Fongicide;;
bacillus thuringiensis serotype 3a 3b;68038-71-1;Insecticide;;
bacillus thuringiensis serotype h 14;68038-71-1;Insecticide;;
bacillus thuringiensis serotype h 7;68038-71-1;Insecticide;;
bacillus thuringiensis sérotype h 7;68038-71-1;Insecticide;;
bacillus thuringiensis sp. tenebrionis;68038-71-1;Insecticide;;
bacillus thuringiensis ssp aizawai souche abts-1857;68038-71-1;Insecticide;;
bacillus thuringiensis ssp kurstaki;68038-71-1;Insecticide;;
bacillus thuringiensis ssp kurstaki souche abts-351;68038-71-1;Insecticide;;
bacillus thuringiensis ssp kurstaki souche eg 2348;68038-71-1;Insecticide;;
bacillus thuringiensis ssp kurstaki souche sa-11;68038-71-1;Insecticide;;
beauveria bassiana souche 203;63428-82-0;Insecticide;;
beauveria bassiana souche atcc 74040;63428-82-0;Insecticide;;
beauveria bassiana souche gha;63428-82-0;Insecticide;;
beauveria bassiana souche npp111b005;63428-82-0;Insecticide;;
beauveria bassiana souche npp111b005;;Insecticide;;
beflubutamide;113614-08-7;Herbicide;;
benalaxyl;71626-11-4;Fongicide;;
benalaxyl-m;98243-83-5;Fongicide;;
benfluraline;1861-40-1;Herbicide;;
benfuracarbe;82560-54-1;Insecticide;;
benoxacor;98730-04-2;Autre usage – Coformulant / Phytoprotecteur / Synergiste;Phytoprotecteur (en association avec le métolachlore, herbicide);
bensulfuron methyl;83055-99-6;Herbicide;;
bentazone;25057-89-0;Herbicide;;
benthiavalicarbe;177406-68-7;Fongicide;;
benzoate de denatonium;3734-33-6;Autre usage - Répulsif;;
benzoate de sodium;532-32-1;SA non phyto - Désinfectant - Biocide;;
benzobicyclon;156963-66-5;Herbicide;;
benzovindiflupyr;1072957-71-1;Fongicide;;
betacyfluthrine;68359-37-5;Insecticide;;
bicarbonate de potassium;298-14-6;Fongicide;;
bifenazate;149877-41-8;Insecticide - Acaricide;;
bifenox;42576-02-3;Herbicide;;
bifenthrine;82657-04-3;Insecticide;;Insecticide - Acaricide
bioallethrine;584-79-2;Insecticide;;
bis ( 3 - aminopropyl ) dodecylamine;2372-82-9;SA non phyto - Désinfectant - Biocide;;
bis (aminopropyl) laurylamine;2372-82-9;SA non phyto - Désinfectant - Biocide;;
bisulfate de sodium;7681-36-1;SA non phyto - Divers;Conservation d'ensilage;
bitertanol;55179-31-2;Fongicide;;
bixafen;581809-46-3;Fongicide;;
bore de solubore;12280-03-4;SA non phyto - Désinfectant - Biocide;;
boscalid;188425-85-6;Fongicide;;
brai;65996-93-2;SA non phyto - Divers;"Usage de type ""Mastic"" (protection des plaies des arbres et/ou greffe)";
brodifacoum;56073-10-0;Rodenticide - Taupicide;Rodenticide;
bromadiolone;28772-56-7;Rodenticide - Taupicide;;
bromoxynil;1689-84-5;Herbicide;;
bromoxynil octanoate;1689-99-2;Herbicide;;
bromuconazole;116255-48-2;Fongicide;;
bromure de lauryl dimethyl benzyl ammonium;7281-04-1;SA non phyto - Désinfectant - Biocide;;Autre usage – Adjuvant
bromure de methyle;74-83-9;Fongicide;Appliqué par fumigation;"Insecticide
Nématicide
Herbicide"
bupirimate;41483-43-6;Fongicide;;
buprofezine;69327-76-0;Insecticide;;Insecticide - Acaricide
butoxyde de piperonyle;51-03-6;Autre usage – Coformulant / Phytoprotecteur / Synergiste;Synergiste (utilisé avec des insecticides le plus souvent sur récoltes stockées);
butraline;33629-47-9;Herbicide;;Régulateur de croissance
candida oleophila souche o;;Fongicide;;
captane;133-06-2;Fongicide;;
carbaryl;63-25-2;Insecticide;;Régulateur de croissance
carbendazime;10605-21-7;Fongicide;;
carbetamide;16118-49-3;Herbicide;;
carbofuran;1563-66-2;Insecticide;;Nématicide
carbonate d'ammonium;506-87-6;Insecticide;;
carbosulfan;55285-14-8;Insecticide;;
carboxine;5234-68-4;Fongicide;;
carfentrazone ethyl;128639-02-1;Herbicide;;
cerevisane;68876-77-7;Fongicide;Stimulation des défenses naturelles;
cerevisane;;Fongicide;Stimulation des défenses naturelles;
chlorantraniliprole;500008-45-7;Insecticide;;
chlorate de sodium;7775-09-9;Herbicide;;
chlorhydrate de poly biguanide;32289-58-0;SA non phyto - Désinfectant - Biocide;;
chlorhydrate de poly hexamethylene biguanidine;27083-27-8;SA non phyto - Désinfectant - Biocide;;
chlorhydrate de poly(hexamethylene biguanide);27083-27-8;SA non phyto - Désinfectant - Biocide;;
chlorhydrate de poly-imino-imido biguanidine;91403-50-8;SA non phyto - Désinfectant - Biocide;;
chloridazone;1698-60-8;Herbicide;;
chlormephos;24934-91-6;Insecticide;;
chlormequat chlorure;999-81-5;Régulateur de croissance;;
chlorophacinone;3691-35-8;Rodenticide - Taupicide;;
chlorophylline (sels cuprosodiques);11006-34-1;Fongicide;;
chlorothalonil;1897-45-6;Fongicide;;
chlorotoluron;15545-48-9;Herbicide;;
chlorprophame;101-21-3;Herbicide;Désherbant utilisé en maraîchage, anti-germinatif (pommes de terre);Régulateur de croissance
chlorpyriphos-ethyl;2921-88-2;Insecticide;;Insecticide - Acaricide
chlorpyriphos-methyl;5598-13-0;Insecticide;;Insecticide - Acaricide
chlorsulfuron;64902-72-3;Herbicide;;
chlorthal;2136-79-0;Herbicide;;
chlortoluron;15545-48-9;Herbicide;;
chlorure d'alkyl dimethyl ammonium;68424-85-1;SA non phyto - Désinfectant - Biocide;;
chlorure d'alkyl dimethyl benzyl ammonium;68424-85-1;SA non phyto - Désinfectant - Biocide;;
chlorure de benzalkonium;68424-85-1;SA non phyto - Désinfectant - Biocide;;
chlorure de choline;67-48-1;Autre usage – Coformulant / Phytoprotecteur / Synergiste;Coformulant (en association avec le chlormequat chlorure, régulateur de croissance);
chlorure de didecyl ammonium;7173-51-5;SA non phyto - Désinfectant - Biocide;;
chlorure de didecyl dimethyl ammonium;7173-51-5;SA non phyto - Désinfectant - Biocide;;
chlorure de didecyldimethylbenzylammonium;68424-85-1;SA non phyto - Désinfectant - Biocide;;
chlorure de dimethyl dialkyl ammonium;7173-51-5;SA non phyto - Désinfectant - Biocide;;
chlorure de dimethyl ethyl ammonium;7173-51-5;SA non phyto - Désinfectant - Biocide;;
chlorure de lauryl dimethyl benzyl ammonium;7173-51-5;SA non phyto - Désinfectant - Biocide;;
chlorure de n coco dimethyl benzyl ammonium;;SA non phyto - Désinfectant - Biocide;;
chlorure de sodium;7647-14-5;Herbicide;;
chlorure d'iode;7553-56-2;SA non phyto - Désinfectant - Biocide;;
chlorures n-alkyl dimethyl benzyl ammonium;68424-85-1;SA non phyto - Désinfectant - Biocide;;
chlorures n-alkyl dimethyl ethyl benzyl ammonium;85409-23-0;SA non phyto - Désinfectant - Biocide;;
cinidon-ethyl;142891-20-1;Herbicide;;
cintofen;130561-48-7;Régulateur de croissance;;
cire;;SA non phyto - Divers;"Usage de type ""Glu"" (barrière mécanique contre les insectes) / ""Mastic"" (protection des plaies des arbres et/ou greffe)";
cire d'abeille;;SA non phyto - Divers;"Usage de type ""Glu"" (barrière mécanique contre les insectes) / ""Mastic"" (protection des plaies des arbres et/ou greffe)";
cires de petrole;;SA non phyto - Divers;"Usage de type ""Glu"" (barrière mécanique contre les insectes)";
cires microcristallines;;SA non phyto - Divers;"Usage de type ""Glu"" (barrière mécanique contre les insectes)";
clethodime;99129-21-2;Herbicide;;
clodinafop-propargyl;105512-06-9;Herbicide;;
clofentezine;74115-24-5;Insecticide - Acaricide;;
clomazone;81777-89-1;Herbicide;;
clonostachys rosea j1446 (anciennement gliocladium catenulatum);;Fongicide;;
clopyralid;1702-17-6;Herbicide;;
clopyralid (sous forme de sel de monoethanolamine);57754-85-5;Herbicide;;
cloquintocet-mexyl;99607-70-2;Autre usage – Coformulant / Phytoprotecteur / Synergiste;Phytoprotecteur (utilisé avec le clodinafop-propargyl, herbicide);
clothianidine;210880-92-5;Insecticide;;
colophane;8050-09-7;SA non phyto - Divers;"Usage de type ""Glu"" (barrière mécanique contre les insectes)";
colophane traitee au maleate;;SA non phyto - Divers;"Usage de type ""Mastic"" (protection des plaies des arbres et/ou greffe)";
composes de l'ion ammonium quaternaire, benzylalkyl en c12-c18 dimethyles, chlorures;68391-01-5;SA non phyto - Désinfectant - Biocide;;
composition complexe;;Autre usage - Répulsif;;
coniothyrium minitans souche con/m/91-08;;Fongicide;;
cos-oga;;Fongicide;;
cresol;95-48-7;Autre usage - Répulsif;;SA non phyto - Désinfectant - Biocide
cresyl;95-48-7;Autre usage - Répulsif;;SA non phyto - Désinfectant - Biocide
cuivre de l'hydroxyde de cuivre;20427-59-2;Fongicide;;Bactéricide - Virucide
cuivre de l'oxychlorure de cuivre;1332-40-7;Fongicide;;
cuivre de l'oxychlorure de cuivre;1332-65-6;Fongicide;;
cuivre de l'oxyde cuivreux;1317-39-1;Fongicide;;
cuivre du carbonate de cuivre;12069-69-1;Fongicide;;
cuivre du sulfate de cuivre;7758-98-7;Fongicide;;
cuivre du sulfate de cuivre;8011-63-0;Fongicide;;
cuivre du sulfate tetracuivrique et tricalcique;8011-63-0;Fongicide;;
cuivre du sulfate tribasique;12527-76-3;Fongicide;;
cuivre du tallate de cuivre;71789-22-8;Autre usage – Adjuvant;;Fongicide
cyanamide de calcium;156-62-7;Herbicide - Antimousse;;"Fongicide
Régulateur de croissance"
cyanamide hydrogene;420-04-2;Régulateur de croissance;;
cyantraniliprole;736994-63-1;Insecticide;;
cyazofamide;120116-88-3;Fongicide;;
cycloxydime;101205-02-1;Herbicide;;
cydia pomonella granulosis, isolat m (cpvg m);;Insecticide;;
cydia pomonella granulovirus;;Insecticide;;
cydia pomonella granulovirus, isolat r5 (cpgv-r5);;Insecticide;;
cyflufenamid;180409-60-3;Fongicide;;
cyfluthrine;68359-37-5;Insecticide;;
cyhalofop butyl;122008-85-9;Herbicide;;
cyhexatin;13121-70-5;Insecticide - Acaricide;;
cymoxanil;57966-95-7;Fongicide;;
cypermethrine;52315-07-8;Insecticide;;
cyproconazole;94361-06-5;Fongicide;;
cyprodinyl;121552-61-2;Fongicide;;
cyprosulfamide;221667-31-8;Autre usage – Coformulant / Phytoprotecteur / Synergiste;Phytoprotecteur (utilisé avec le thiencarbazone-methyl, herbicide);
cyromazine;66215-27-8;Insecticide;;Insecticide - Acaricide
daminozide;1596-84-5;Régulateur de croissance;;
dazomet;533-74-4;Nématicide;Appliqué par fumigation;"Fongicide
Herbicide
Insecticide"
decane-1-ol;112-30-1;Régulateur de croissance;;
deltamethrine;52918-63-5;Insecticide;;
derives d'acides gras vegetaux;;Autre usage – Adjuvant;;
desmediphame;13684-56-5;Herbicide;;
di aminopropyl laurylamine;2372-82-9;SA non phyto - Désinfectant - Biocide;;
di-1-p-menthene;34363-01-4;Autre usage – Coformulant / Phytoprotecteur / Synergiste;Anti-transpirant;
diazinon;333-41-5;Insecticide;;Insecticide - Acaricide
dicamba;1918-00-9;Herbicide;;
dicamba dimethylammonium;2300-66-5;Herbicide;;
dichlobenil;1194-65-6;Herbicide;;
dichlormide;37764-25-3;Autre usage – Coformulant / Phytoprotecteur / Synergiste;Phytoprotecteur (utilisé avec herbicide);
dichloro isocyanurate de sodium dihydrate;51580-86-0;SA non phyto - Désinfectant - Biocide;;
dichloroisocyanurate de sodium;2893-78-9;SA non phyto - Désinfectant - Biocide;;
dichlorprop-p;15165-67-0;Herbicide;;
dichlorvos;62-73-7;Insecticide;Appliqué par fumigation;Insecticide - Acaricide
diclofop methyl;51338-27-3;Herbicide;;
dicofol;115-32-2;Insecticide - Acaricide;;
difenacoum;56073-07-5;Rodenticide - Taupicide;Rodenticide;
difenoconazole;119446-68-3;Fongicide;;
difethialone;104653-34-1;Rodenticide - Taupicide;;
diflubenzuron;35367-38-5;Insecticide;;
diflufenicanil;83164-33-4;Herbicide;;
dimethachlore;50563-36-5;Herbicide;;
dimethenamide;87674-68-8;Herbicide;;
dimethenamide-p (dmta-p);163515-14-8;Herbicide;;
dimethoate;60-51-5;Insecticide;;Insecticide - Acaricide
dimethomorphe;110488-70-5;Fongicide;;
dimethyl polysiloxane;63148-62-9;Autre usage – Coformulant / Phytoprotecteur / Synergiste;Coformulant;
dimoxystrobine;149961-52-4;Fongicide;;
dinocap;39300-45-3;Fongicide;;Insecticide - Acaricide
dioxyde de carbone;124-38-9;Rodenticide - Taupicide;;Insecticide - Acaricide
diphenylamine;122-39-4;Régulateur de croissance;Traitement contre l'échaudure des pommes;"Fongicide
Insecticide"
diquat;85-00-7;Herbicide;;
disodium phosphate;7558-79-4;Autre usage – Adjuvant;;
disulfure de dimethyle (dmds);624-92-0;Nématicide;Appliqué par fumigation;"Fongicide
Herbicide
Insecticide"
dithianon;3347-22-6;Fongicide;;
diuron;330-54-1;Herbicide;;
dodemorphe acetate;31717-87-0;Fongicide;;
dodine;2439-10-3;Fongicide;;
e,z-8-dodecen-1-yl acetate + z-8-dodecen-1-ol;;Insecticide - Médiateur chimique;;
e/z8 acetate de dodecenyle;37338-40-2;Insecticide - Médiateur chimique;;
e/z9-dodecenyl acetate;16974-34-8;Insecticide - Médiateur chimique;;
e-5-decen-1-ol;56578-18-8;Insecticide - Médiateur chimique;;
e7,e/z9-dodecadienyl acetate + n-dodecanyl acetate;;Insecticide - Médiateur chimique;;
e7,z9-dodecadienylacetate;54364-62-4;Insecticide - Médiateur chimique;;
e8,e10-dodecadiene-1-ol;33956-49-9;Insecticide - Médiateur chimique;;
e8,e10-dodecadiene-1-ol + tetradecylacetate;;Insecticide - Médiateur chimique;;
e8,e10-dodécadiène-1-ol + tétradécylacétate;;Insecticide - Médiateur chimique;;
edta;60-00-4;SA non phyto - Désinfectant - Biocide;Dans la BNV-D, substance active répertoriée uniquement dans l’AMM n°9500402 (PHAGOGERMYL 4), désinfectant de surfaces;Autre usage – Adjuvant
emamectine benzoate;155569-91-8;Insecticide;;
engrais divers;;SA non phyto - Divers;;
epoxiconazole;133855-98-8;Fongicide;;
esfenvalerate;66230-04-4;Insecticide;;
essence de girofle;;Fongicide;;"Herbicide
Insecticide
Rodenticide"
esters de colophane et de diethylene glycol;68153-38-8;Autre usage – Adjuvant;Adjuvant pour bouillie fongicide | Adjuvant pour bouillie insecticide;
esters de phosphate d'alcools gras polyoxyalkyles;68649-29-6;SA non phyto - Désinfectant - Biocide;;Autre usage – Adjuvant
esters methyliques d'acides gras;61788-59-8;Autre usage – Adjuvant;Adjuvant pour bouillie herbicide | Adjuvant pour bouillie fongicide;
esters methyliques d'acides gras c16-c18 et c18 insatures;67762-38-3;Autre usage – Adjuvant;Adjuvant pour bouillie herbicide;
esters methyliques d'acides gras, c14-c18 et c16-c18 insatures;67762-26-9;Autre usage – Adjuvant;Adjuvant pour bouillie fongicide | Adjuvant pour bouillie herbicide;
ethanol;64-17-5;SA non phyto - Désinfectant - Biocide;;
ethephon;16672-87-0;Régulateur de croissance;;
ether d'alkyl aryl polyglycol;61827-42-7;Autre usage – Adjuvant;;
ethofumesate;26225-79-6;Herbicide;;
ethoprophos;13194-48-4;Nématicide;;Insecticide
ethoxyquine;91-53-2;Fongicide;;
ethylene;74-85-1;Régulateur de croissance;;
etofenprox;80844-07-1;Insecticide;;
etoxazole;153233-91-1;Insecticide - Acaricide;;
eugenol;97-53-0;Fongicide;;
extrait d'ail;8008-99-9;Nématicide;;"Insecticide
Répulsif"
extrait de bois de quassia (variete picrasma);;Insecticide;;
extrait de fenugrec;;Fongicide;;
extrait de pyrethre vegetal;8003-34-7;Insecticide;;Insecticide - Acaricide
famoxadone;131807-57-3;Fongicide;;
farine de sang;;Autre usage - Répulsif;;
fenamidone;161326-34-7;Fongicide;;
fenazaquin;120928-09-8;Insecticide - Acaricide;;
fenbuconazole;114369-43-6;Fongicide;;
fenbutatin oxyde;13356-08-6;Insecticide - Acaricide;;
fenhexamid;126833-17-8;Fongicide;;
fenitrothion;122-14-5;Insecticide;;
fenoxaprop-p-ethyl;71283-80-2;Herbicide;;
fenoxycarbe;72490-01-8;Insecticide;;
fenpicoxamide;517875-34-2;Fongicide;;
fenpropidine;67306-00-7;Fongicide;;
fenpropimorphe;67564-91-4;Fongicide;;
fenpyrazamine;473798-59-3;Fongicide;;
fenpyroximate;111812-58-9;Insecticide - Acaricide;;
fer sous forme de sulfate de fer;7720-78-7;Herbicide - Antimousse;;
fipronil;120068-37-3;SA non phyto - Désinfectant - Biocide;;Insecticide
flazasulfuron;104040-78-0;Herbicide;;
fleur de chaux (chaux eteinte);1305-62-0;SA non phyto - Divers;"Usage de type ""Glu"" (barrière mécanique contre les insectes)";Insecticide, Herbicide, Fongicide
flonicamide;158062-67-0;Insecticide;;
florasulame;145701-23-1;Herbicide;;
florpyrauxifen-benzyl;1390661-72-9;Herbicide;;
fluazifop-p-butyl;79241-46-6;Herbicide;;
fluazinam;79622-59-6;Fongicide;;
fludioxonil;131341-86-1;Fongicide;;
flufenacet;142459-58-3;Herbicide;;
flufenoxuron;101463-69-8;Insecticide;;Insecticide - Acaricide
flumioxazine;103361-09-7;Herbicide;;
fluopicolide;239110-15-7;Fongicide;;
fluopyram;658066-35-4;Fongicide;;
fluorure de sulfuryle;2699-79-8;Insecticide;Appliqué par fumigation (notamment sur cultures stockées);"Fongicide
Nématicide
Rodenticide"
fluoxastrobine;361377-29-9;Fongicide;;
flupyrsulfuron-methyl;144740-54-5;Herbicide;;
fluquinconazole;136426-54-5;Fongicide;;
flurochloridone;61213-25-0;Herbicide;;
fluroxypyr;69377-81-7;Herbicide;;
fluroxypyr-meptyl;81406-37-3;Herbicide;;
flurprimidol;56425-91-3;Régulateur de croissance;;
flurtamone;96525-23-4;Herbicide;;
flusilazole;85509-19-9;Fongicide;;
flutolanil;66332-96-5;Fongicide;;
flutriafol;76674-21-0;Fongicide;;
fluxapyroxad;907204-31-3;Fongicide;;
folpel;133-07-3;Fongicide;;
foramsulfuron;173159-57-4;Herbicide;;
forchlorfenuron;68157-60-8;Régulateur de croissance;;
formaldehyde;50-00-0;SA non phyto - Désinfectant - Biocide;;"Fongicide
Bactéricide - Virucide"
formetanate-chlorhydrate;23422-53-9;Insecticide;;
formiate d'ammonium;540-69-2;SA non phyto - Divers;Conservation d'ensilage;
formiate de calcium;544-17-2;SA non phyto - Divers;Conservation d'ensilage;
fosetyl;15845-66-6;Fongicide;;
fosetyl-aluminium;39148-24-8;Fongicide;;
fosthiazate;98886-44-3;Nématicide;;Insecticide
gamma-cyhalothrine;76703-62-3;Insecticide;;
geraniol;106-24-1;Fongicide;;
gibberellines (a4+a7);8030-53-3;Régulateur de croissance;;
gliocladium catenulatum j 1446;;Fongicide;;
glufosinate ammonium;77182-82-2;Herbicide;;
glutaraldehyde;111-30-8;SA non phyto - Désinfectant - Biocide;;"Fongicide
Bactéricide - Virucide"
glyoxal;107-22-2;SA non phyto - Désinfectant - Biocide;;
glyphosate;1071-83-6;Herbicide;;
gomme manille;;SA non phyto - Divers;"Usage de type ""Glu"" (barrière mécanique contre les insectes)";
goudron vegetal;8011-48-1;SA non phyto - Divers;"Usage de type ""Mastic"" (protection des plaies des arbres et/ou greffe)";
goudrons de pin;8011-48-1;SA non phyto - Divers;"Usage de type ""Mastic"" (protection des plaies des arbres et/ou greffe)";
graisse de mouton;;Autre usage - Répulsif;;
halauxifen-methyl;943831-98-9;Herbicide;;
halosulfuron-methyle;100784-20-1;Herbicide;;
haloxyfop-r;72619-32-0;Herbicide;;
heptamaloxyloglucan;870721-81-6;SA non phyto - Divers;Protection contre le gel (vignes);
heptamethyltrisiloxane modifie polyalkylenoxide;27306-78-1;Autre usage – Adjuvant;;
hexazinone;51235-04-2;Herbicide;;
hexythiazox;78587-05-0;Insecticide - Acaricide;;
huile animale;;Autre usage - Répulsif;;
huile blanche de petrole;9206-23-56;Insecticide - Acaricide;;Autre usage – Adjuvant
huile blanche paraffinique;8042-47-5;Insecticide - Acaricide;;Autre usage – Adjuvant
huile de colza;8002-13-9;Insecticide;;
huile de colza esterifiee;85586-25-0;Autre usage – Adjuvant;Adjuvant pour bouillie herbicide | Adjuvant pour bouillie insecticide;
huile de girofle;84961-50-8;Fongicide;;"Herbicide
Insecticide
Rodenticide"
huile de paraffine;64742-46-7;Insecticide - Acaricide;;Autre usage – Adjuvant
huile de paraffine;97862-82-3;Insecticide - Acaricide;;Autre usage – Adjuvant
huile de petrole;64742-55-8;Insecticide - Acaricide;;Autre usage – Adjuvant
huile de pin;8002-09-3;Autre usage - Répulsif;Dans la BNV-D, substance active répertoriée unqiuement dans l'AMM n°8000374 (FCH 675), répulsif (sur cervidés, lapin et lièvre);"Herbicide
Adjuvant"
huile de poisson;;Autre usage - Répulsif;;
huile de resine;8050-18-8;SA non phyto - Divers;"Usage de type ""Glu"" (barrière mécanique contre les insectes) / ""Mastic"" (protection des plaies des arbres et/ou greffe)";
huile de ricin;8001-79-4;SA non phyto - Divers;"Usage de type ""Glu"" (barrière mécanique contre les insectes)";
huile de vaseline;8042-47-5;Insecticide - Acaricide;;Autre usage – Adjuvant
huile d'os;8001-85-2;Autre usage - Répulsif;;
huile essentielle de girofle;84961-50-2;Autre usage - Répulsif;;
huile essentielle de girofle;84961-50-8;Fongicide;;"Herbicide
Insecticide
Rodenticide"
huile essentielle de menthe verte;8008-79-5;Régulateur de croissance;;
huile essentielle d'orange douce;8028-48-6;Régulateur de croissance;Anti-germinatif (pommes de terre);"Insecticide
Acaricide
Fongicide"
huile minerale blanche;8042-47-5;Insecticide - Acaricide;;Autre usage – Adjuvant
huile minerale paraffinique;8042-47-5;Insecticide - Acaricide;;Autre usage – Adjuvant
huile vegetale;;SA non phyto - Divers;"Usage de type ""Mastic"" (protection des plaies des arbres et/ou greffe)";
huiles empyreumatiques;;Autre usage - Répulsif;;
hydramethylnon;67485-29-4;Insecticide;;
hydrazide maleique;123-33-1;Régulateur de croissance;;
hydrolysat de proteines;;Insecticide - Médiateur chimique;;
hydroxyde de potassium;1310-58-3;SA non phyto - Désinfectant - Biocide;;
hydroxyde de sodium;1310-73-2;SA non phyto - Désinfectant - Biocide;;
hymexazol;10004-44-1;Fongicide;;
hypochlorite de sodium;7681-52-9;SA non phyto - Désinfectant - Biocide;;Fongicide
imazalil;35554-44-0;Fongicide;;
imazamox;114311-32-9;Herbicide;;
imazaquine;81335-37-7;Régulateur de croissance;;Herbicide
imidaclopride;138261-41-3;Insecticide;;
indoxacarbe;173584-44-6;Insecticide;;
iodosulfuron-methyl-sodium;144550-36-7;Herbicide;;
ioxynil;1689-83-4;Herbicide;;
ioxynil octanoate;3861-47-0;Herbicide;;
ipconazole;125225-28-7;Fongicide;;
iprodione;36734-19-7;Fongicide;;
iprovalicarbe;140923-17-7;Fongicide;;
isofetamide;875915-78-9;Fongicide;;
isoproturon;34123-59-6;Herbicide;;
isoxaben;82558-50-7;Herbicide;;
isoxadifen-ethyl;163520-33-0;Autre usage – Coformulant / Phytoprotecteur / Synergiste;Phytoprotecteur (utilisé avec foramsulfuron et tembotrione, herbicides);
isoxaflutole;141112-29-0;Herbicide;;
kaolin;1332-58-7;Insecticide;;
kieselguhr;;Insecticide - Acaricide;;
kresoxim-methyl;143390-89-0;Fongicide;;
lactobacillus buchneri;;SA non phyto - Divers;Conservation d'ensilage;
lactobacillus plantarum;;SA non phyto - Divers;Conservation d'ensilage;
lambda-cyhalothrine;91465-08-6;Insecticide;;
laminarine;9008-22-4;Fongicide;;Bactéricide - Virucide
latex synthetique;52831-07-9;Autre usage – Adjuvant;;
lauryl dipropylene triamine;2372-82-9;SA non phyto - Désinfectant - Biocide;;
lauryl propylene diamine;2372-82-9;SA non phyto - Désinfectant - Biocide;;
lauryl sulfate de sodium;151-21-3;SA non phyto - Désinfectant - Biocide;Dans la BNV-D, substance active répetoriée uniquement dans l'AMM n°8800344 (D39 VEGETAL);
lecanicillium muscarium souche ve6;67892-35-7;Insecticide;;
lecithine de soja;8002-43-5;Autre usage – Adjuvant;;
lenacile;2164-08-1;Herbicide;;
liant cellulosique;;Autre usage – Adjuvant;Adjuvant pour bouillie fongicide | Adjuvant pour bouillie insecticide;
linuron;330-55-2;Herbicide;;
lufenuron;103055-07-8;Insecticide;;Insecticide - Acaricide
magnesium peroxyphtalate;;SA non phyto - Désinfectant - Biocide;;
malathion;121-75-5;Insecticide;;Insecticide - Acaricide
maltodextrine;9050-36-6;Insecticide;;
mancozebe;8018-01-7;Fongicide;;
mandipropamide;374726-62-2;Fongicide;;
manebe;12427-38-2;Fongicide;;
mecoprop (mcpp);7085-19-0;Herbicide;;
mecoprop-p (mcpp-p);16484-77-8;Herbicide;;
mefenpyr-diethyl;135590-91-9;Autre usage – Coformulant / Phytoprotecteur / Synergiste;Phytoprotecteur (utilisé avec fenoxaprop-P-ethyl et iodosulfuron, herbicides);
mefentrifluconazole;1417782-03-6;Fongicide;;
mefluidide (sel de diethanolamine);53780-36-2;Régulateur de croissance;;
mepanipyrim;110235-47-7;Fongicide;;
mepiquat-chlorure;24307-26-4;Régulateur de croissance;;
meptyldinocap;131-72-6;Fongicide;;
mesosulfuron-methyl;208465-21-8;Herbicide;;
mesotrione;104206-82-8;Herbicide;;
metalaxyl;57837-19-1;Fongicide;;
metalaxyl-m;70630-17-0;Fongicide;;
metaldehyde;108-62-3;Molluscicide;;
metamitrone;41394-05-2;Herbicide;;
metam-sodium;137-42-8;Nématicide;Appliqué par fumigation;"Fongicide
Herbicide
Insecticide"
metarhizium anisopliae;;Insecticide;;
metarhizium anisopliae var. anisopliae souche f52;;Insecticide;;
metarhizium brunneum souche ma 43;;Insecticide;;
metazachlore;67129-08-2;Herbicide;;
metconazole;125116-23-6;Fongicide;;
methabenzthiazuron;18691-97-9;Herbicide;;
methanol;67-56-1;Autre usage - Répulsif;;
methiocarbe;2032-65-7;Molluscicide;;"Insecticide
Répulsif"
methomyl;16752-77-5;Insecticide;;
methoxyfenozide;161050-58-4;Insecticide;;
methyl-butenol;115-18-4;Insecticide - Médiateur chimique;;
metirame;9006-42-2;Fongicide;;
metirame-zinc;9006-42-2;Fongicide;;
metobromuron;3060-89-7;Herbicide;;
metosulam;139528-85-1;Herbicide;;
metrafenone;220899-03-6;Fongicide;;
metribuzine;21087-64-9;Herbicide;;
metschnikowia fructicola souche nrrl y-27328;;Fongicide;;
metsulfuron-methyl;74223-64-6;Herbicide;;
milbemectine;51596-10-2;Insecticide - Acaricide;;Nématicide
molinate;2212-67-1;Herbicide;;
mouillant;;Autre usage – Adjuvant;Adjuvant pour bouillie fongicide | Adjuvant pour bouillie insecticide;
myclobutanil;88671-89-0;Fongicide;;
napropamide;15299-99-7;Herbicide;;
n-hexadecylacetate;629-70-9;Insecticide - Médiateur chimique;;
nicosulfuron;111991-09-4;Herbicide;;
nitrate de baryum;10022-31-8;Rodenticide - Taupicide;;
nitrate de potassium;7757-79-1;Rodenticide - Taupicide;;
nitrite de sodium;7632-00-0;SA non phyto - Divers;Conservation d'ensilage;
n-n bis (3 aminopropyl) dodecylamine;2372-82-9;SA non phyto - Désinfectant - Biocide;;
n-phosphonomethyl glycine;1071-83-6;Herbicide;;
npv ha (nucleopolyhedrovirus d'helicoverpa armigera);;Insecticide;;
n-sodium-n-chloro-para-toluenesulfonamide;127-65-1;SA non phyto - Désinfectant - Biocide;;
n-tetradecylacetate (14ac);;Insecticide - Médiateur chimique;;
nucleopolyhedrovirus;;Insecticide;;
nucleopolyhedrovirus de spodoptera littoralis;;Insecticide;;
octylphenol octaglycol ether;9036-19-5;Autre usage – Adjuvant;Adjuvant pour bouillie fongicide | Adjuvant pour bouillie insecticide | Adjuvant pour bouillie herbicide;
oligomeres terpeniques;70750-57-1;Autre usage – Adjuvant;Adjuvant pour bouillie fongicide | Adjuvant pour bouillie insecticide;
ortho benzyl para chlorophenate de sodium;3184-65-4;SA non phyto - Désinfectant - Biocide;Dans la BNV-D, substance active répetoriée uniquement dans l'AMM n°8800344 (D39 VEGETAL);
orthophenylphenate de sodium;132-27-4;SA non phyto - Désinfectant - Biocide;Dans la BNV-D, substance active répetoriée uniquement dans l'AMM n°8800344 (D39 VEGETAL);
orthophenylphenol;90-43-7;SA non phyto - Désinfectant - Biocide;;
oryzalin;19044-88-3;Herbicide;;
oxadiargyl;39807-15-3;Herbicide;;
oxadiazon;19666-30-9;Herbicide;;
oxamyl;23135-22-0;Nématicide;;Insecticide - Acaricide
oxathiapiproline;1003318-67-9;Fongicide;;
oxydemeton-methyl;301-12-2;Insecticide;;
oxyfluorfene;42874-03-3;Herbicide;;
paclobutrazol;76738-62-0;Régulateur de croissance;;
paecilomyces fumosoroseus;;Insecticide;;
paecilomyces fumosoroseus apopka souche 97;;Insecticide;;
paecilomyces lilacinus souche 251;;Nématicide;;
para tertiaire amyl phenate de sodium;31366-95-7;SA non phyto - Désinfectant - Biocide;Dans la BNV-D, substance active répetoriée uniquement dans l'AMM n°8800344 (D39 VEGETAL);
paraffine;8002-74-2;Insecticide - Acaricide;"Usage de type ""Mastic"" (protection des plaies des arbres et/ou greffe)";
parahydroxyphenylsalicylamide;526-18-1;SA non phyto - Désinfectant - Biocide;;
pediococcus pentosaceus;;SA non phyto - Divers;Conservation d'ensilage;
penconazole;66246-88-6;Fongicide;;
pencycuron;66063-05-6;Fongicide;;
pendimethaline;40487-42-1;Herbicide;;
penoxsulame;219714-96-2;Herbicide;;
pentapotassium bis(peroxymonosulfate) bis(sulfate);70693-62-8;SA non phyto - Désinfectant - Biocide;;
penthiopyrad;183675-82-3;Fongicide;;
permanganate de potassium;7722-64-7;SA non phyto - Désinfectant - Biocide;;
permethrine;52645-53-1;Insecticide;;
peroxyde d'hydrogene;7722-84-1;SA non phyto - Désinfectant - Biocide;;"Fongicide
Bactéricide - Virucide"
pethoxamide;106700-29-2;Herbicide;;
phenmediphame;13684-63-4;Herbicide;;
phlebiopsis gigantea;;Fongicide;;
phlebiopsis gigantea souche vra 1835;;Fongicide;;
phosalone;2310-17-0;Insecticide;;Insecticide - Acaricide
phosmet;732-11-6;Insecticide;;Insecticide - Acaricide
phosphate ferrique;10045-86-0;Molluscicide;;
phosphate ferrique dihydrate;14567-75-0;Molluscicide;;
phosphonate de disodium;13708-85-5;Fongicide;;
phosphonate de potassium;13492-26-7;Fongicide;Stimulation des défenses naturelles;
phosphure d'aluminium;20859-73-8;Insecticide;Appliqué par fumigation (notamment sur cultures stockées);Rodenticide - Taupicide
phosphure de calcium;1305-99-3;Rodenticide - Taupicide;;
phosphure de magnesium;12057-74-8;Insecticide;Appliqué par fumigation (notamment sur cultures stockées);
phosphure de zinc;1314-84-7;Rodenticide - Taupicide;;
phoxime;14816-18-3;Insecticide;;
piclorame;1918-02-1;Herbicide;;
picolinafen;137641-05-5;Herbicide;;
picoxystrobine;117428-22-5;Fongicide;;
pinoxaden;243973-20-8;Herbicide;;
piperonyl;51-03-6;Autre usage – Coformulant / Phytoprotecteur / Synergiste;Synergiste (utilisé avec des insecticides le plus souvent sur récoltes stockées);
poivre;;Autre usage - Répulsif;;
poix;61789-60-4;SA non phyto - Divers;"Usage de type ""Mastic"" (protection des plaies des arbres et/ou greffe)";
poly hexamethylene biguanide;27083-27-8;SA non phyto - Désinfectant - Biocide;;
polybutene;9003-29-6;SA non phyto - Divers;"Usage de type ""Glu"" (barrière mécanique contre les insectes)";
polyhexamethylene diguanide chlorhydrate;32289-58-0;SA non phyto - Désinfectant - Biocide;;
polyisobutene;115-11-7;SA non phyto - Divers;"Usage de type ""Glu"" (barrière mécanique contre les insectes)";
polymere carboxyl sulfone cationique;8061-53-8;SA non phyto - Divers;Dans la BNV-D, substance active répertoriée uniquement dans l'AMM n°1030003 (OSIRYL), Matière Fertilisante/Additif agronomique;
polymere complexe d'ethylene et de propylene;;Autre usage – Adjuvant;Adjuvant pour bouillie herbicide;
polymere d'amine gras;68213-26-3;Autre usage – Adjuvant;;
polyoxyethylene amine;107-21-1;Autre usage – Adjuvant;Adjuvant pour bouillie herbicide;
polysorbate 20;9005-64-5;Autre usage – Adjuvant;;
polysulfure de calcium;1344-81-6;Fongicide;;
poudre de corne;;Autre usage - Répulsif;;
prochloraze;67747-09-5;Fongicide;;
prochloraze-manganese;75747-77-2;Fongicide;;
procymidone;32809-16-8;Fongicide;;
profoxydim;139001-49-3;Herbicide;;
prohexadione-calcium;127277-53-6;Régulateur de croissance;;
propachlore;1918-16-7;Herbicide;;
propamocarbe;24579-73-5;Fongicide;;
propamocarbe hcl;25606-41-1;Fongicide;;
propanil;709-98-8;Herbicide;;
propaquizafop;111479-05-1;Herbicide;;
propargite;2312-35-8;Insecticide - Acaricide;;
propiconazole;60207-90-1;Fongicide;;
propinebe;9016-72-2;Fongicide;;
propionate d'ammonium (sel acide);17496-08-1;SA non phyto - Divers;Conservation d'ensilage;
propoxycarbazone sodium;181274-15-7;Herbicide;;
propyzamide;23950-58-5;Herbicide;;
proquinazid;189278-12-4;Fongicide;;
prosulfocarbe;52888-80-9;Herbicide;;
prosulfuron;94125-34-5;Herbicide;;
prothioconazole;178928-70-6;Fongicide;;
pseudomonas chlororaphis souche ma 342;;Fongicide;;
pymetrozine;123312-89-0;Insecticide;;
pyraclostrobine;175013-18-0;Fongicide;;
pyraflufen-ethyl;129630-19-9;Herbicide;;
pyrethres naturels;8003-34-7;Insecticide;;Insecticide - Acaricide
pyrethrines;8003-34-7;Insecticide;;Insecticide - Acaricide
pyridabene;96489-71-3;Insecticide;;Insecticide - Acaricide
pyridalyl;179101-81-6;Insecticide;;
pyridate;55512-33-9;Herbicide;;
pyrimethanil;53112-28-0;Fongicide;;
pyrimicarbe;23103-98-2;Insecticide;;
pyrimiphos-methyl;29232-93-7;Insecticide;Appliqué par fumigation;Insecticide - Acaricide
pyriofenone;688046-61-9;Fongicide;;
pyriproxyfene;95737-68-1;Insecticide;;
pyroxsulame;422556-08-9;Herbicide;;
pythium oligandrum;;Fongicide;;
pythium oligandrum souche m1;;Fongicide;;
quinmerac;90717-03-6;Herbicide;;
quinoclamine;2797-51-5;Herbicide - Antimousse;;
quinoxyfene;124495-18-7;Fongicide;;
quizalofop-p-ethyl;100646-51-3;Herbicide;;
resines (colophane);8050-09-7;SA non phyto - Divers;"Usage de type ""Glu"" (barrière mécanique contre les insectes) / ""Mastic"" (protection des plaies des arbres et/ou greffe)";
rhizobium japonicum;;SA non phyto - Divers;Inoculation de rhizobium dans des légumineuses pour faciliter la fixation d'azote atmosphérique;
rhizobium melilotti;;SA non phyto - Divers;Inoculation de rhizobium dans des légumineuses pour faciliter la fixation d'azote atmosphérique;
rimsulfuron;122931-48-0;Herbicide;;
rotenone;83-79-4;Insecticide;;Insecticide - Acaricide
s-6-verbenol;18881-04-4;Insecticide - Médiateur chimique;;
sable quartzeux;;Autre usage - Répulsif;;
saccharomyces cerevisiae;;Fongicide;;
saccharomyces cerevisiae souche las02;;Fongicide;;
sedaxane;874967-67-6;Fongicide;;
sel de potassium de l'hydrazide maleique;51542-52-0;Régulateur de croissance;;
sels de potassium d'acides gras;10124-65-9;Insecticide;;"Herbicide
Fongicide
Autre usage - Répulsif
Autre usage – Adjuvant"
sels de potassium d'acides gras (c8-c18);67701-09-1;Insecticide;;
silthiofam;175217-20-6;Fongicide;;
s-metolachlore;87392-12-9;Herbicide;;
sorbate de potassium;24634-61-5;SA non phyto - Désinfectant - Biocide;;
soufre;7704-34-9;Fongicide;;
soufre pour pulverisation (micronise);7704-34-9;Fongicide;;
soufre sublime;7704-34-9;Fongicide;;
soufre triture;7704-34-9;Fongicide;;
soufre triture ventile;7704-34-9;Fongicide;;
spinetoram;935545-74-7;Insecticide;;
spinosad;168316-95-8;Insecticide;;
spirodiclofen;148477-71-8;Insecticide - Acaricide;;
spiromesifen;283594-90-1;Insecticide;;
spirotetramat;203313-25-1;Insecticide;;
spiroxamine;118134-30-8;Fongicide;;
spores de beauveria bassiana 147;;Insecticide;;
spores de beauveria tenella 96;;Insecticide;;
streptococcus faecium;;SA non phyto - Divers;Conservation d'ensilage;
streptomyces griseoviridis k61;;Fongicide;;
streptomyces k61 (anciennement streptomyces griseoviridis);;Fongicide;;
suif;61789-97-7;SA non phyto - Divers;"Usage de type ""Mastic"" (protection des plaies des arbres et/ou greffe)";
sulcotrione;99105-77-8;Herbicide;;
sulfate d'ammonium;7783-20-2;Autre usage – Adjuvant;Adjuvant pour bouillie herbicide;
sulfate de fer (sulfate ferreux heptahydrate);7782-63-0;Herbicide - Antimousse;;
sulfate de fer monohydrate;17375-41-6;Herbicide - Antimousse;;
sulfate double d'oxyquinoleine et de potassium;15077-57-3;Fongicide;;
sulfosate;81591-81-3;Herbicide;;
sulfosulfuron;141776-32-1;Herbicide;;
tau-fluvalinate;102851-06-9;Insecticide;;Insecticide - Acaricide
tebuconazole;107534-96-3;Fongicide;;
tebufenozide;112410-23-8;Insecticide;;
tebufenpyrad;119168-77-3;Insecticide - Acaricide;;
teflubenzuron;83121-18-0;Insecticide;;
tefluthrine;79538-32-2;Insecticide;;
tembotrione;335104-84-2;Herbicide;;
temephos;3383-96-8;Insecticide;;
terbuthylazine;5915-41-3;Herbicide;;
terebenthine;8006-64-2;SA non phyto - Divers;"Usage de type ""Mastic"" (protection des plaies des arbres et/ou greffe)";
terpenes d'huile essentielle d'orange;;Insecticide - Médiateur chimique;Attractif pour abeilles;
tetraconazole;112281-77-3;Fongicide;;
thiabendazole;148-79-8;Fongicide;;
thiaclopride;111988-49-9;Insecticide;;Molluscicide
thiamethoxam;153719-23-4;Insecticide;;
thiencarbazone-methyl;317815-83-1;Herbicide;;
thifensulfuron-methyle;79277-27-3;Herbicide;;
thiocyanate d'ammonium;1761-95-4;Autre usage – Coformulant / Phytoprotecteur / Synergiste;Synergiste (utilisé avec l'aminotriazole, herbicide);
thiocyanate d'ammonium;1762-95-4;Autre usage – Coformulant / Phytoprotecteur / Synergiste;Synergiste (utilisé avec l'aminotriazole, herbicide);
thiodicarbe;59669-26-0;Molluscicide;;Insecticide
thiophanate-methyl;23564-05-8;Fongicide;;
thirame;137-26-8;Fongicide;;
thymol;89-83-8;Fongicide;;"Insecticide
Désinfectant - Biocide"
tolclofos-methyl;57018-04-9;Fongicide;;
triacetate de guazatine;115044-19-4;Fongicide;;
triadimenol;55219-65-3;Fongicide;;
triallate;2303-17-5;Herbicide;;
triazoxide;72459-58-6;Fongicide;;
tribenuron-methyle;101200-48-0;Herbicide;;
trichoderma asperellum icc012;;Fongicide;;
trichoderma asperellum t25;;Fongicide;;
trichoderma asperellum t34;;Fongicide;;
trichoderma asperellum tv1;;Fongicide;;
trichoderma atroviride;;Fongicide;;
trichoderma atroviride souche l-1237;;Fongicide;;
trichoderma atroviride souche sc1;;Fongicide;;
trichoderma atroviride t11;;Fongicide;;
trichoderma gamsii icc080;;Fongicide;;
trichoderma harzianum;;Fongicide;;
trichoderma harzianum souche t22;;Fongicide;;
trichogramma brassicae;;Insecticide;;
triclopyr;55335-06-3;Herbicide;;
triethanolamine;102-71-6;Autre usage – Adjuvant;Adjuvant pour bouillie herbicide;
trifloxystrobine;141517-21-7;Fongicide;;
trifluraline;1582-09-8;Herbicide;;
triflusulfuron-methyl;126535-15-7;Herbicide;;
triglyceride ethoxyle;;Autre usage – Adjuvant;;
trimethylamine hydrochloride;593-81-7;Insecticide - Médiateur chimique;;
trinexapac-ethyl;95266-40-3;Régulateur de croissance;;
triticonazole;131983-72-7;Fongicide;;
tritosulfuron;142469-14-5;Herbicide;;
valifenalate;283159-90-0;Fongicide;;
verticillium lecanii (spores);67892-35-7;Insecticide;;
virus de la granulose;;Insecticide;;
virus de la mosaique du pepino isolat vc1;;Bactéricide - Virucide;;
virus de la mosaique du pepino isolat vx1;;Bactéricide - Virucide;;
virus de la mosaique du pepino souche ch2 isolat 1906;;Bactéricide - Virucide;;
virus zymv-wk;;Bactéricide - Virucide;;
z/e-11 hexadecenal;53939-28-9;Insecticide - Médiateur chimique;;
z-11-tetradecenyl acetate;20711-10-8;Insecticide - Médiateur chimique;;
z-9-tetradecenyl acetate;16725-53-4;Insecticide - Médiateur chimique;;
zetacypermethrine;52315-07-8;Insecticide;;
zinc (sulfate de zinc);7446-19-7;SA non phyto - Divers;Préservation de la qualité des fruits (rugosité);
zirame;137-30-4;Fongicide;;Autre usage - Répulsif
zoxamide;156052-68-5;Fongicide;;
