<!-- Generator: Adobe Illustrator 24.3.0, SVG Export Plug-In  -->
<svg version="1.1" xmlns="http://www.w3.org/2000/svg" xmlns:xlink="http://www.w3.org/1999/xlink" x="0px" y="0px" width="34.2px"
	 height="34.2px" viewBox="0 0 34.2 34.2" style="overflow:visible;enable-background:new 0 0 34.2 34.2;" xml:space="preserve">
<style type="text/css">
	.st0{fill:#F21947;}
</style>
<defs>
</defs>
<g>
	<g>
		<path class="st0" d="M34.2,15.39V28.5c0,3.15-2.55,5.7-5.7,5.7H5.7c-3.15,0-5.7-2.55-5.7-5.7V5.7C0,2.55,2.55,0,5.7,0h13.11
			c0.79,0,1.42,0.64,1.42,1.42s-0.64,1.42-1.42,1.42H5.7c-1.57,0-2.85,1.28-2.85,2.85v22.8c0,1.57,1.28,2.85,2.85,2.85h22.8
			c1.57,0,2.85-1.28,2.85-2.85V15.39c0-0.79,0.64-1.42,1.42-1.42C33.56,13.96,34.2,14.6,34.2,15.39z M12.79,13.48L25.16,1.11
			c1.5-1.43,3.85-1.43,5.35,0l2.58,2.58c1.47,1.48,1.47,3.87,0,5.35l-2.16,2.16l0,0L20.72,21.41c-1.07,1.07-2.52,1.67-4.03,1.67
			h-0.11L12.6,23c-0.76-0.02-1.38-0.63-1.4-1.4l-0.09-3.98C11.09,16.07,11.69,14.58,12.79,13.48z M27.18,3.12l-1.16,1.15l3.9,3.9
			l1.15-1.15c0.36-0.36,0.36-0.95,0-1.32L28.5,3.12C28.13,2.77,27.55,2.77,27.18,3.12L27.18,3.12z M13.96,17.57l0.05,2.61l2.61,0.05
			c0.77,0.01,1.52-0.29,2.07-0.83l9.21-9.2l-3.89-3.9L14.8,15.5C14.25,16.04,13.95,16.79,13.96,17.57z"/>
	</g>
</g>
</svg>
