<!-- Generator: Adobe Illustrator 24.3.0, SVG Export Plug-In  -->
<svg version="1.1" xmlns="http://www.w3.org/2000/svg" xmlns:xlink="http://www.w3.org/1999/xlink" x="0px" y="0px" width="19.08px"
	 height="17.49px" viewBox="0 0 19.08 17.49" style="overflow:visible;enable-background:new 0 0 19.08 17.49;"
	 xml:space="preserve">
<style type="text/css">
	.st0{fill:#F21947;}
</style>
<defs>
</defs>
<g>
	<g>
		<path class="st0" d="M17.38,10.02c-0.01,0.01-0.03,0.02-0.04,0.03l-7.24,7.2c-0.15,0.15-0.35,0.24-0.56,0.24s-0.42-0.09-0.57-0.24
			l-7.24-7.2C-0.56,7.77-0.58,4.06,1.7,1.76l0.03-0.03c2.12-2.1,5.45-2.31,7.81-0.5c2.36-1.81,5.69-1.6,7.8,0.5
			C19.64,4.01,19.66,7.72,17.38,10.02z"/>
	</g>
</g>
</svg>
