{
  "files": {
    "main.css": "/static/css/main.a0db3ea1.chunk.css",
    "main.js": "/build/main.ed5d0561.js",
    "runtime-main.js": "/build/bundle.b50e26a4.js",
    "build/2.b6d7d6f4.js": "/build/2.b6d7d6f4.js",
    "build/2.b6d7d6f4.js.LICENSE.txt": "/build/2.b6d7d6f4.js.LICENSE.txt",
    "index.html": "/index.html",
    "static/css/main.a0db3ea1.chunk.css.map": "/static/css/main.a0db3ea1.chunk.css.map",
    "static/media/avatar.a087a561.png": "/static/media/avatar.a087a561.png",
    "static/media/card_1.b1844ee5.jpg": "/static/media/card_1.b1844ee5.jpg",
    "static/media/card_3.608e2b77.png": "/static/media/card_3.608e2b77.png"
  },
  "entrypoints": [
    "build/bundle.b50e26a4.js",
    "build/2.b6d7d6f4.js",
    "static/css/main.a0db3ea1.chunk.css",
    "build/main.ed5d0561.js"
  ]
}