module gitlab.com/ers-go/apps/api-time

go 1.22.0

require (
	buf.build/gen/go/bufbuild/protovalidate/protocolbuffers/go v1.32.0-20240212200630-3014d81c3a48.1
	google.golang.org/grpc v1.61.0
	google.golang.org/protobuf v1.32.0
)

require (
	github.com/golang/protobuf v1.5.3 // indirect
	golang.org/x/net v0.21.0 // indirect
	golang.org/x/sys v0.17.0 // indirect
	golang.org/x/text v0.14.0 // indirect
	google.golang.org/genproto/googleapis/rpc v0.0.0-20240213162025-012b6fc9bca9 // indirect
)
