C:\Users\ernesto.gonzalezr\Desktop\MVC_Spring\springmvc\springmvcapp\src\main\java\com\softtek\academy\javaweb\dao\PersonRepository.java
C:\Users\ernesto.gonzalezr\Desktop\MVC_Spring\springmvc\springmvcapp\src\main\java\com\softtek\academy\javaweb\service\PersonService.java
C:\Users\ernesto.gonzalezr\Desktop\MVC_Spring\springmvc\springmvcapp\src\main\java\com\softtek\academy\javaweb\service\PersonServiceImpl.java
C:\Users\ernesto.gonzalezr\Desktop\MVC_Spring\springmvc\springmvcapp\src\main\java\com\softtek\academy\javaweb\configuration\FrontConfiguration.java
C:\Users\ernesto.gonzalezr\Desktop\MVC_Spring\springmvc\springmvcapp\src\main\java\com\softtek\academy\javaweb\controller\PersonController.java
C:\Users\ernesto.gonzalezr\Desktop\MVC_Spring\springmvc\springmvcapp\src\main\java\com\softtek\academy\javaweb\beans\Person.java
C:\Users\ernesto.gonzalezr\Desktop\MVC_Spring\springmvc\springmvcapp\src\main\java\com\softtek\academy\javaweb\dao\PersonDAO.java
C:\Users\ernesto.gonzalezr\Desktop\MVC_Spring\springmvc\springmvcapp\src\main\java\com\softtek\academy\javaweb\init\AppInitializer.java
C:\Users\ernesto.gonzalezr\Desktop\MVC_Spring\springmvc\springmvcapp\src\main\java\com\softtek\academy\javaweb\configuration\JDBCConfiguration.java
