Inicio
    Variable ronda es Numerico Entero
    Variable bolsaCPU es Numerico Entero
    Variable bolsaJugador es Numerico Entero
    Variable victoriasJugador es Numerico Entero
    Variable victoriasCPU es Numerico Entero
    Variable apuestaJugador es Numerico Entero
    Variable apuestaCPU es Numerico Entero
    Variable tiro es Numerico Entero
    Variable respuesta es Numerico Entero
    
    bolsaCPU = 500
    bolsaJugador = 500
    victoriasJugador = 0
    victoriasCPU = 0
    Escribir "Este programa sirve para jugar volados"

    for(ronda = 1; ronda <= 3; ronda++)
        Escribir "Ingresa tu apuesta(min. 20, max. 100)"
        Leer apuestaJugador

        while apuestaJugador < 20 OR apuestaJugador > 100
            Escribir "Ingresa una apuesta valida(min. 20, max. 100)"
            Leer apuestaJugador
        end-while

        apuestaCPU = random(20, 100)
        Escribir "La apuesta del CPU es de ", apuestaCPU
        Escribir "¿El siguiente tiro sera? 1. Aguila 2. Sol"
        Leer respuesta

        while respuesta != 1 OR respueta != 2
            Escribir "Ingresa una respuesta valida: "
            Leer respuesta
        end-while

        tiro = random(1,2)

        Si tiro == 1
            Escribir "El tiro fue Aguila"
        Si-no 
            Escribir "El tiro fue Sol"
        Fin-si

        Si tiro == respuesta
            bolsaJugador = bolsaJugador + apuestaCPU
            bolsaCPU = bolsaCPU - apuestaCPU
            victoriasJugador = victoriasJugador + 1
        Si-no
            bolsaCPU = bolsaCPU + apuestaJugador
            bolsaJugador = bolsaJugador - apuestaJugador
            victoriasCPU = victoriasCPU + 1
        Fin-si
    end-for

    Escribir "Bolsa Jugador: ", bolsaJugador
    Escribir "Bolsa CPU: ", bolsaCPU

    Si victoriasJugador > victoriasCPU
        Escribir "GANASTE!!!!"
    Si-no
        Escribir "PERDISTE, gano el CPU"
    Fin-si
Fin