[
  {
      "id": "el1",
      "name": "Запечённые мидии",
      "img": "./img/el1.jpg",
      "price": 520
  },
  {
      "id": "el2",
      "name": "Запечённые мидии острые",
      "img": "./img/el2.jpg",
      "price": 530
  },
  {
      "id": "el3",
      "name": "Цезарь с курицей",
      "img": "./img/el3.jpg",
      "price": 450
  },
  {
      "id": "el4",
      "name": "Цезарь с креветками",
      "img": "./img/el4.jpg",
      "price": 510
  },
  {
      "id": "el5",
      "name": "Цезарь с Кайсо",
      "img": "./img/el5.jpg",
      "price": 250
  },
  {
      "id": "el6",
      "name": "Цезарь Кайсо с креветкой темпура",
      "img": "./img/el6.jpg",
      "price": 350
  },
  {
      "id": "el7",
      "name": "Тар-тар с лососем",
      "img": "./img/el7.jpg",
      "price": 750
  },
  {
      "id": "el8",
      "name": "Тар-тар с тунцом",
      "img": "./img/el8.jpg",
      "price": 750
  },
  {
      "id": "el9",
      "name": "Фреш боул с морепродуктами",
      "img": "./img/el9.jpg",
      "price": 640
  },
  {
      "id": "el10",
      "name": "Фреш боул с жареной дорада",
      "img": "./img/el10.jpg",
      "price": 680
  }
]