Name,Sex,WeightClassKg,BodyweightKg,BirthYear,Division,Team,Squat1Kg,Squat2Kg,Squat3Kg,Best3SquatKg,Bench1Kg,Bench2Kg,Bench3Kg,Best3BenchKg,Deadlift1Kg,Deadlift2Kg,Deadlift3Kg,Best3DeadliftKg,TotalKg,Place,Event,Equipment,BirthDate
Verena Haberl,F,76.00,71.80,1987,Open,East End Barbell Club Podersdorf,100,105,112.5,112.5,50,52.5,57.5,57.5,105,115,120,120,290,3,SBD,Raw,1987-11-09
Vanessa Unger,F,63.00,62.20,1991,Open,East End Barbell Club Podersdorf,112.5,120,125,125,72.5,75,77.5,77.5,115,125,135,135,337.5,2,SBD,Raw,1991-12-19
Blessing Catena,F,63.00,62.40,2003,Open,East End Barbell Club Podersdorf,135,140,147.5,147.5,60,65,-67.5,65,140,150,157.5,157.5,370,1,SBD,Raw,2003-03-24
Lena Scholz,F,69.00,68.00,1994,Open,East End Barbell Club Podersdorf,-100,105,112.5,112.5,-52.5,-52.5,55,55,110,115,120,120,287.5,3,SBD,Raw,1994-11-25
Christel Besenböck,F,76.00,75.10,2000,Open,Tschak Prak PL Eisenstadt,112.5,122.5,130,130,65,70,72.5,72.5,155,165,-175,165,367.5,2,SBD,Raw,2000-06-06
Barbara Rossi,F,84.00,83.30,1999,Open,Tschak Prak PL Eisenstadt,115,122.5,-125,122.5,72.5,77.5,-80,77.5,135,150,-157.5,150,350,1,SBD,Raw,1999-09-19
Victoria Moser,F,76.00,74.80,1997,Open,Tschak Prak PL Eisenstadt,110,120,130,130,85,90,-96,90,140,150,160,160,380,1,SBD,Raw,1997-12-27
Marlene Allmer,F,69.00,65.10,1998,Open,Tschak Prak PL Eisenstadt,107.5,115,120,120,67.5,-70,-70,67.5,145,155,-160,155,342.5,1,SBD,Raw,1998-02-04
Sigrid Caha,F,69.00,66.30,1991,Open,East End Barbell Club Podersdorf,100,105,-110,105,57.5,60,-62.5,60,110,112.5,115,115,280,4,SBD,Raw,1991-10-24
Martina Schmidl,F,57.00,52.30,1988,Open,East End Barbell Club Podersdorf,72.5,77.5,-82.5,77.5,45,47.5,50,50,77.5,82.5,87.5,87.5,215,1,SBD,Raw,1988-05-05
Nadine Ruttner,F,69.00,67.80,2001,Open,Tschak Prak PL Eisenstadt,92.5,102.5,112.5,112.5,50,55,60,60,95,105,115,115,287.5,2,SBD,Raw,2001-04-20
Joel Christopher Catena,M,74.00,68.50,1996,Open,East End Barbell Club Podersdorf,200,215,225,225,145,152.5,160,160,210,230,-260,230,615,1,SBD,Raw,1996-01-15
Godor Szabolcs,M,93.00,92.30,1997,Open,Tschak Prak PL Eisenstadt,205,225,235,235,130,140,-147.5,140,202.5,222.5,235,235,610,2,SBD,Raw,1997-04-10
Lukas Straßgürtl,M,83.00,82.80,1999,Open,Tschak Prak PL Eisenstadt,165,175,180,180,102.5,110,-115,110,210,225,240,240,530,2,SBD,Raw,1999-02-16
Christoph Kornfehl,M,83.00,81.70,2003,Open,East End Barbell Club Podersdorf,190,197.5,-205.5,197.5,122.5,130,-135,130,200,210,-220,210,537.5,1,SBD,Raw,2003-02-16
Daniel Jovicic,M,93.00,91.00,2000,Open,East End Barbell Club Podersdorf,180,190,200,200,115,120,-125,120,-210,215,-225,215,535,3,SBD,Raw,2000-08-21
Michael Ungerböck,M,105.00,94.90,1999,Open,Tschak Prak PL Eisenstadt,195,205,215,215,112.5,120,-125,120,205,220,-230,220,555,2,SBD,Raw,1999-05-21
Matthias Hillinger,M,93.00,91.00,1995,Open,East End Barbell Club Podersdorf,240,250,-260,250,155,162.5,167.5,167.5,270,290,300,300,717.5,1,SBD,Raw,1995-09-29
Thomas Jost,M,105.00,93.40,1992,Open,East End Barbell Club Podersdorf,262.5,275,285,285,180,190,196,196,275,290,-305,290,771,1,SBD,Raw,1992-07-25
Nikolaos Scharf,M,120+,120.10,1980,Open,East End Barbell Club Podersdorf,165,172.5,177.5,177.5,-122.5,122.5,-127.5,122.5,-170,172.5,-200,172.5,472.5,2,SBD,Raw,1980-06-18
Fabian Senftner,M,120.00,105.10,1998,Open,East End Barbell Club Podersdorf,250,265,-280,265,160,162.5,165,165,270,290,300,300,730,2,SBD,Raw,1998-09-04
Dietmar Hackstock,M,93.00,91.40,1968,Open,Tschak Prak PL Eisenstadt,135,150,157.5,157.5,87.5,95,-100,95,120,,,120,372.5,6,SBD,Raw,1968-01-29
Tim Barta,M,93.00,90.80,2006,Open,East End Barbell Club Podersdorf,132.5,140,150,150,72.5,80,-85,80,135,145,155,155,385,5,SBD,Raw,2006-01-14
Simon Steiner,M,120.00,108.50,1995,Open,East End Barbell Club Podersdorf,215,225,230,230,135,142.5,-147.5,142.5,225,235,-245,235,607.5,4,SBD,Raw,1995-05-16
Andre Sandal,M,93.00,87.60,1999,Open,Tschak Prak PL Eisenstadt,135,150,165,165,120,127.5,137.5,137.5,140,160,180,180,482.5,4,SBD,Raw,1999-02-02
Vincent Moser,M,120.00,110.90,1999,Open,Tschak Prak PL Eisenstadt,260,275,290,290,175,185,192.5,192.5,290,305,-317.5,305,787.5,1,SBD,Raw,1999-06-05
Alexander Renner,M,120+,150.60,1999,Open,Tschak Prak PL Eisenstadt,280,300,310,310,228,240.5,250,250,310,335,355.5,355.5,915.5,1,SBD,Raw,1999-08-15
Daniel Kacsits,M,83.00,82.40,1990,Open,Tschak Prak PL Eisenstadt,155,162.5,167.5,167.5,100,105,-107.5,105,170,180,190,190,462.5,3,SBD,Raw,1990-03-06
