Division,WeightClassKg,Place,Name,Team,BodyweightKg,Best3SquatKg,Best3BenchKg,Best3DeadliftKg,TotalKg,Equipment,Event,Sex,BirthDate
Girls,47.85,1,Addy Diaz DeLeon,Water Valley,47.45,90.72,54.43,99.79,244.94,Unlimited,SBD,F,
Girls,47.85,2,Micah Shyrock,Andrews,46.99,77.11,36.29,95.25,208.65,Unlimited,SBD,F,
Girls,56.02,1,Angel Bowerman,Water Valley,55.43,97.52,36.29,97.52,231.33,Unlimited,SBD,F,
Girls,56.02,2,Neela Driver,Andrews,55.79,90.72,36.29,97.52,224.53,Unlimited,SBD,F,
Girls,56.02,3,Isabella Rodriguez,Andrews,55.7,79.38,36.29,95.25,210.92,Unlimited,SBD,F,
Girls,56.02,4,Analucia Arguello,Andrews,55.52,92.99,36.29,77.11,206.38,Unlimited,SBD,F,
Girls,60.1,1,Janaye Coston,Water Valley,58.69,99.79,43.09,99.79,242.67,Unlimited,SBD,F,
Girls,60.1,2,Juanita Cuellar,Big Spring,59.96,77.11,43.09,113.4,233.6,Unlimited,SBD,F,
Girls,67.36,1,McKenna De La Rosa,Midland Greenwood,65.14,86.18,45.36,99.79,231.33,Unlimited,SBD,F,
Girls,67.36,2,Arielle Viera,Big Spring,66.86,88.45,47.63,95.25,231.33,Unlimited,SBD,F,
Girls,67.36,3,Adyson Micheletti,Midland Greenwood,65.5,90.72,40.82,90.72,222.26,Unlimited,SBD,F,
Girls,75.07,1,Allison Hillhouse,Big Spring,72.48,106.59,54.43,117.93,278.96,Unlimited,SBD,F,
Girls,75.07,2,Hazel Rangel,Big Spring,69.85,97.52,61.23,104.33,263.08,Unlimited,SBD,F,
Girls,75.07,3,Elena Bentley,Midland Greenwood,72.12,92.99,31.75,113.4,238.14,Unlimited,SBD,F,
Girls,75.07,DQ,Tara Porter,Big Spring,74.84,,,,,Unlimited,SBD,F,
Girls,75.07,DQ,Kianna Olivas,Andrews,74.03,,,,,Unlimited,SBD,F,
Girls,82.33,1,Ashley Sears,Water Valley,76.84,90.72,38.56,104.33,233.6,Unlimited,SBD,F,
Girls,90.04,1,Dayanara Vasquez,Andrews,86.09,136.08,70.31,136.08,342.46,Unlimited,SBD,F,
Girls,90.04,2,Rilee Gonzales,Big Spring,84.41,117.93,61.23,117.93,297.1,Unlimited,SBD,F,
Girls,90.04,3,Khloe Martinez,Andrews,83.46,97.52,49.9,108.86,256.28,Unlimited,SBD,F,
Girls,90.04,4,Daliyah O'Hara,Big Spring,89.54,86.18,58.97,102.06,247.21,Unlimited,SBD,F,
Girls,100.02,1,Alliana Chavarria,Big Spring,93.17,129.27,65.77,117.93,312.98,Unlimited,SBD,F,
Girls,100.02,2,Kaitlin Underdown,Midland Greenwood,91.9,90.72,68.04,113.4,272.16,Unlimited,SBD,F,
Girls,110,1,Cloey Hughes,Andrews,107.32,124.74,58.97,102.06,285.76,Unlimited,SBD,F,
Girls,110,DQ,Alexsandra Gallegos,Andrews,107.5,104.33,,,,Unlimited,SBD,F,
