Place,Name,Sex,BirthDate,Age,Country,State,Equipment,Division,BodyweightKg,WeightClassKg,Squat1Kg,Squat2Kg,Squat3Kg,Squat4Kg,Best3SquatKg,Bench1Kg,Bench2Kg,Bench3Kg,Bench4Kg,Best3BenchKg,Deadlift1Kg,Deadlift2Kg,Deadlift3Kg,Deadlift4Kg,Best3DeadliftKg,TotalKg,Event
1,Abby Rice,F,2002-06-08,21,USA,NC,Raw,J-T,71.6,75,115,122.5,-127.5,,122.5,70,75,-80,,75,130,135,142.5,,142.5,340,SBD
1,Erin Newman,F,1981-03-20,43,USA,NC,Raw,M1-T,80.2,82.5,87.5,97.5,102.5,,102.5,47.5,52.5,-60,,52.5,120,130,135,,135,290,SBD
NS,Crystal Rhoades,F,1963-09-03,60,USA,NC,Raw,M5-T,,,,,,,,,,,,,,,,,,,SBD
1,Pam Fisher,F,1959-04-05,65,USA,NC,Raw,M6-T,48.7,52,52.5,60,65,,65,30,35,37.5,,37.5,92.5,102.5,107.5,110,107.5,210,SBD
1,Shannon Mitchell,F,1995-11-08,28,USA,NC,Raw,N-X,59.87,60,-57.5,60,-65,,60,25,-30,30,,30,-70,75,77.5,,77.5,167.5,SBD
1,Charlee Marshall,F,1989-07-05,34,USA,NC,Raw,N-X,81.5,82.5,110,117.5,122.5,,122.5,62.5,67.5,-72.5,,67.5,115,125,130,,130,320,SBD
1,Shannon Mitchell,F,1995-11-08,28,USA,NC,Raw,O-T,59.87,60,-57.5,60,-65,,60,25,-30,30,,30,-70,75,77.5,,77.5,167.5,SBD
1,Isabella Tully,F,1998-09-13,25,USA,NC,Raw,O-T,61.9,67.5,-67.5,-70,72.5,,72.5,25,30,-37.5,,30,92.5,97.5,-100,,97.5,200,SBD
1,Courtney Fox #2,F,2000-05-01,24,USA,NC,Raw,O-T,71.1,75,125,135,142.5,,142.5,57.5,60,-62.5,,60,137.5,145,150,,150,352.5,SBD
1,Charlee Marshall,F,1989-07-05,34,USA,NC,Raw,O-T,81.5,82.5,110,117.5,122.5,,122.5,62.5,67.5,-72.5,,67.5,115,125,130,,130,320,SBD
2,Erin Newman,F,1981-03-20,43,USA,NC,Raw,O-T,80.2,82.5,87.5,97.5,102.5,,102.5,47.5,52.5,-60,,52.5,120,130,135,,135,290,SBD
1,Amy Portillo,F,1997-02-21,27,USA,NC,Raw,O-T,109.2,110,167.5,175,180,,180,55,57.5,60,,60,157.5,165,-175,,165,405,SBD
1,Jessica Loden,F,1988-07-04,35,USA,NC,Raw,S-T,67.3,67.5,115,120,-122.5,,120,72.5,-77.5,-77.5,,72.5,132.5,137.5,-140,,137.5,330,SBD
NS,Tiffany Stone,F,1979-08-28,44,USA,NC,Sleeves,M1-T,,,,,,,,,,,,,,,,,,,SBD
1,Ian Roland,M,2003-10-11,20,USA,NC,Raw,J-T,74.6,75,170,182.5,192.5,,192.5,105,112.5,-120,,112.5,220,227.5,-237.5,,227.5,532.5,SBD
1,Josiah Gregory,M,2003-03-14,21,USA,NC,Raw,J-T,78.3,82.5,175,182.5,187.5,,187.5,-115,120,125,,125,212.5,227.5,-240,,227.5,540,SBD
2,Zack Cox #2,M,2004-03-31,20,USA,NC,Raw,J-T,81.73,82.5,165,172.5,182.5,,182.5,130,135,137.5,,137.5,205,212.5,217.5,,217.5,537.5,SBD
1,Hunter R Pugh,M,2002-11-14,21,USA,NC,Raw,J-T,85.4,90,172.5,180,187.5,,187.5,145,150,155,,155,215,225,-232.5,,225,567.5,SBD
1,Jamie Salley,M,1984-04-17,40,USA,NC,Raw,M1-T,74.5,75,130,142.5,150,,150,95,105,-112.5,,105,172.5,182.5,190,,190,445,SBD
1,Corey McManus,M,1976-09-28,47,USA,NC,Raw,M2-T,88.8,90,245,250,255,-262.5,255,185,-187.5,187.5,,187.5,245,252.5,-255,,252.5,695,SBD
1,Gary Spencer,M,1976-11-05,47,USA,NC,Raw,M2-T,90.8,100,150,160,165,,165,115,125,-127.5,,125,182.5,195,205,,205,495,SBD
1,Hunter R Pugh,M,2002-11-14,21,USA,NC,Raw,MPF-T,85.4,90,172.5,180,187.5,,187.5,145,150,155,,155,215,225,-232.5,,225,567.5,SBD
2,Jeffrey Spencer,M,1995-05-16,29,USA,NC,Raw,MPF-T,85.2,90,185,187.5,192.5,,192.5,120,130,-135,,130,212.5,220,227.5,,227.5,550,SBD
1,Tate Manning,M,2008-01-24,16,USA,NC,Raw,O-T,66.6,67.5,172.5,190,-200,,190,130,137.5,-142.5,,137.5,185,192.5,202.5,,202.5,530,SBD
1,Vaughn Ross,M,1995-11-05,28,USA,NC,Raw,O-T,73.7,75,145,155,165,,165,102.5,107.5,110,,110,230,245,265,,265,540,SBD
1,Francisco Hernandez Martinez,M,2004-09-10,19,USA,NC,Raw,O-T,88.8,90,222.5,235,240,,240,125,132.5,137.5,,137.5,220,237.5,256,,256,633.5,SBD
1,Ke Collington,M,1984-02-10,40,USA,NC,Raw,O-U,59.6,60,70,92.5,100,,100,152.5,160,167.5,-170,167.5,102.5,140,142.5,,142.5,410,SBD
1,Kerry Hutchins,M,1992-02-13,32,USA,NC,Raw,O-U,89,90,247.5,265,-272.5,,265,192.5,207.5,215,220,215,-265,265,,,265,745,SBD
NS,Natanael Borrero,M,2009-09-16,14,USA,NC,Raw,T1-X,67.5,67.5,,,,,,,,,,,,,,,,,SBD
1,Hayden Salley,M,2009-07-25,14,USA,NC,Raw,T1-X,75.12,82.5,95,102.5,110,,110,57.5,65,70,,70,117.5,125,135,,135,315,SBD
1,Caleb Heaton,M,2009-08-12,14,USA,NC,Raw,T1-X,90,90,152.5,162.5,172.5,182.5,172.5,107.5,115,-122.5,,115,155,182.5,197.5,,197.5,485,SBD
1,Tate Manning,M,2008-01-24,16,USA,NC,Raw,T2-X,66.6,67.5,172.5,190,-200,,190,130,137.5,-142.5,,137.5,185,192.5,202.5,,202.5,530,SBD
1,Dustin Spencer,M,2008-01-28,16,USA,NC,Raw,T2-X,88.5,90,180,-190,190,,190,110,115,117.5,,117.5,215,225,-232.5,,225,532.5,SBD
1,Seth Roper,M,2006-04-16,18,USA,NC,Raw,T3-X,74.83,75,215,225,232.5,,232.5,117.5,125,-127.5,,125,207.5,222.5,230,,230,587.5,SBD
1,Landon Casstevens,M,2005-07-12,18,USA,NC,Raw,T3-X,79.6,82.5,157.5,170,182.5,,182.5,97.5,105,-107.5,,105,192.5,210,215,,215,502.5,SBD
1,Francisco Hernandez Martinez,M,2004-09-10,19,USA,NC,Raw,T3-X,88.8,90,222.5,235,240,,240,125,132.5,137.5,,137.5,220,237.5,256,,256,633.5,SBD
DQ,Jeff Guller,M,1941-08-04,82,USA,NC,Multi-ply,M9-U,77.2,82.5,-162.5,162.5,-170,,162.5,-97.5,-97.5,-97.5,,,-120,120,,,120,,SBD
1,Ross Roberts,M,1985-06-03,38,USA,NC,Raw,S-U,87,90,,,,,,125,135,145,,145,217.5,230,-246,,230,375,BD
1,Jeff Guller,M,1941-08-04,82,USA,NC,Multi-ply,M9-U,77.2,82.5,-162.5,162.5,-170,,162.5,,,,,,-120,120,,,120,282.5,SD
1,Brien Carella,M,1976-05-18,48,USA,NC,Raw,M2-T,73.5,75,,,,,,125,-137.5,-140,,125,,,,,,125,B
1,Robert Heaton,M,1975-09-02,48,USA,NC,Raw,M2-T,97,100,,,,,,145,160,-170,,160,,,,,,160,B
1,Ke Collington,M,1984-02-10,40,USA,NC,Raw,O-U,59.6,60,,,,,,152.5,160,167.5,-170,167.5,,,,,,167.5,B
1,Kerry Hutchins,M,1992-02-13,32,USA,NC,Raw,O-U,89,90,,,,,,192.5,207.5,215,220,215,,,,,,215,B
1,Jake Simmons,M,2008-09-28,15,USA,NC,Raw,T1-X,87.9,90,,,,,,112.5,117.5,120,122.5,120,,,,,,120,B
1,William Howard,M,1983-09-02,40,USA,NC,Multi-ply,M1-U,85.18,90,,,,,,275,300,-320,,300,,,,,,300,B
NS,Zack Viers,M,1997-03-06,27,USA,SC,Multi-ply,O-U,82.5,82.5,,,,,,,,,,,,,,,,,B
1,William Howard,M,1983-09-02,40,USA,NC,Multi-ply,O-U,85.18,90,,,,,,275,300,-320,,300,,,,,,300,B
1,Kris Manning,M,1973-02-10,51,USA,NC,Raw,M3-T,89.6,90,,,,,,,,,,,165,172.5,185,,185,185,D
NS,Scott Jelleyman,M,1981-06-01,42,USA,NC,Raw,M1-U,,,,,,,,,,,,,,,,,,,SBD
1,James Justice,M,1971-01-02,53,USA,KY,Raw,M3-T,107.3,110,227.5,237.5,245,,245,140,142.5,,,142.5,232.5,245,-250,,245,632.5,SBD
NS,Taylor Matthews,M,1988-01-26,36,USA,NC,Raw,MPF-U,,,,,,,,,,,,,,,,,,,SBD
NS,Guarionex Baez,M,1981-09-29,42,USA,NC,Raw,N-X,,,,,,,,,,,,,,,,,,,SBD
1,Alec Chaves,M,1993-04-25,31,USA,NC,Raw,O-T,108.4,110,232.5,-247.5,-247.5,,232.5,155,-165,-165,,155,270,282.5,295,,295,682.5,SBD
2,James Justice,M,1971-01-02,53,USA,KY,Raw,O-T,107.3,110,227.5,237.5,245,,245,140,142.5,,,142.5,232.5,245,-250,,245,632.5,SBD
3,AJ Busari,M,1990-09-25,33,USA,NC,Raw,O-T,102.5,110,210,222.5,230,,230,-140,-140,140,,140,232.5,252.5,-265,,252.5,622.5,SBD
4,Robert Lee,M,1997-10-07,26,USA,NC,Raw,O-T,102.15,110,205,-227.5,-227.5,,205,-125,-125,125,,125,272.5,-287.5,-300,,272.5,602.5,SBD
NS,Guarionex Baez,M,1981-09-29,42,USA,NC,Raw,O-U,,,,,,,,,,,,,,,,,,,SBD
NS,Scott Jelleyman,M,1981-06-01,42,USA,NC,Raw,O-U,,,,,,,,,,,,,,,,,,,SBD
NS,Taylor Matthews,M,1988-01-26,36,USA,NC,Raw,O-U,,,,,,,,,,,,,,,,,,,SBD
1,Casey Woodie,M,1987-02-01,37,USA,NC,Raw,O-U,109.04,110,265,290,297.5,,297.5,205,220,227.5,-237.5,227.5,307.5,320,-337.5,,320,845,SBD
NS,Taylor Matthews,M,1988-01-26,36,USA,NC,Raw,S-U,,,,,,,,,,,,,,,,,,,SBD
1,Casey Woodie,M,1987-02-01,37,USA,NC,Raw,S-U,109.04,110,265,290,297.5,,297.5,205,220,227.5,-237.5,227.5,307.5,320,-337.5,,320,845,SBD
1,Tatyn Skidmore,M,2010-05-07,14,USA,KY,Raw,T1-X,141.1,140+,160,182.5,195,,195,105,-120,120,,120,-165,165,180,,180,495,SBD
1,El-Monstro Martinez,M,1984-03-12,40,USA,NC,Sleeves,MPF-U,132.5,140,220,237.5,245,,245,127.5,137.5,-142.5,,137.5,265,277.5,280,,280,662.5,SBD
1,El-Monstro Martinez,M,1984-03-12,40,USA,NC,Sleeves,O-U,132.5,140,220,237.5,245,,245,127.5,137.5,-142.5,,137.5,265,277.5,280,,280,662.5,SBD
1,El-Monstro Martinez,M,1984-03-12,40,USA,NC,Sleeves,M1-U,132.5,140,220,237.5,245,,245,127.5,137.5,-142.5,,137.5,265,277.5,280,,280,662.5,SBD
1,James Justice,M,1971-01-02,53,USA,KY,Wraps,M3-T,107.3,110,185,250,277.5,,277.5,135,140,145,,145,227.5,-247.5,,,227.5,650,SBD
NS,Curtis Rabon,M,1963-05-12,61,USA,NC,Wraps,M5-U,,,,,,,,,,,,,,,,,,,SBD
1,Mike Gabriel,M,1990-04-11,34,USA,NC,Wraps,MPF-T,109.77,110,215,225,-230,,225,165,170,-175,,170,227.5,242.5,-247.5,,242.5,637.5,SBD
1,Keven Painter,M,1989-09-30,34,USA,NC,Wraps,MPF-T,138.6,140,295,320,325,,325,210,-227.5,,,210,230,-250,,,230,765,SBD
1,Dustin Pruitt,M,1992-11-20,31,USA,NC,Wraps,MPF-U,94.3,100,257.5,275,285,,285,157.5,162.5,-170,,162.5,232.5,242.5,250,,250,697.5,SBD
1,James Justice,M,1971-01-02,53,USA,KY,Wraps,O-T,107.3,110,185,250,277.5,,277.5,135,140,145,,145,227.5,-247.5,,,227.5,650,SBD
NS,Curtis Rabon,M,1963-05-12,61,USA,NC,Wraps,O-U,,,,,,,,,,,,,,,,,,,SBD
1,Dustin Pruitt,M,1992-11-20,31,USA,NC,Wraps,O-U,94.3,100,257.5,275,285,,285,157.5,162.5,-170,,162.5,232.5,242.5,250,,250,697.5,SBD
1,Tom Bowman,M,1955-12-03,68,USA,GA,Multi-ply,M6-U,110.67,125,250,280,,,280,55,67.5,77.5,,77.5,215,227.5,,,227.5,585,SBD
1,Tate Richards,M,1998-02-24,26,USA,NC,Multi-ply,O-U,110,110,310,-337.5,-345,,310,247.5,272.5,-285,,272.5,-275,275,-287.5,,275,857.5,SBD
1,Robert Lee,M,1997-10-07,26,USA,NC,Raw,O-T,102.15,110,205,-227.5,-227.5,,205,,,,,,272.5,-287.5,-300,,272.5,477.5,SD
1,Chad Church,M,1977-06-13,46,USA,NC,Raw,M2-U,98.4,100,,,,,,200,205,210,215,210,,,,,,210,B
NS,Chad Clark,M,1972-08-24,51,USA,VA,Raw,M3-U,98.4,100,,,,,,,,,,,,,,,,,B
1,George Rollins,M,1982-01-29,42,USA,SC,Multi-ply,P-X,92.7,100,,,,,,185,-197.5,-197.5,,185,,,,,,185,B
1,Oliver C George,M,1967-02-03,57,USA,VA,Raw,M4-T,110.7,125,,,,,,,,,,,-182.5,182.5,210,,210,210,D
1,Oliver C George,M,1967-02-03,57,USA,VA,Raw,MPF-T,110.7,125,,,,,,,,,,,-182.5,182.5,210,,210,210,D
1,Oliver C George,M,1967-02-03,57,USA,VA,Raw,O-T,110.7,125,,,,,,,,,,,-182.5,182.5,210,,210,210,D
