<svg width="15" height="15" viewBox="0 0 15 15" fill="none" xmlns="http://www.w3.org/2000/svg">
<path d="M7.26673 0.399902L13.8661 1.34324L14.8087 7.94324L8.68073 14.0712C8.55571 14.1962 8.38617 14.2664 8.2094 14.2664C8.03262 14.2664 7.86308 14.1962 7.73806 14.0712L1.13806 7.47124C1.01308 7.34622 0.942871 7.17668 0.942871 6.9999C0.942871 6.82313 1.01308 6.65359 1.13806 6.52857L7.26673 0.399902ZM9.15206 6.05724C9.2759 6.18103 9.4229 6.27922 9.58469 6.3462C9.74647 6.41318 9.91986 6.44764 10.095 6.4476C10.2701 6.44757 10.4434 6.41305 10.6052 6.34602C10.767 6.27898 10.9139 6.18074 11.0377 6.0569C11.1615 5.93307 11.2597 5.78606 11.3267 5.62428C11.3937 5.46249 11.4281 5.2891 11.4281 5.114C11.4281 4.9389 11.3935 4.76552 11.3265 4.60376C11.2595 4.442 11.1612 4.29503 11.0374 4.17124C10.9136 4.04744 10.7666 3.94925 10.6048 3.88227C10.443 3.81529 10.2696 3.78084 10.0945 3.78087C9.74086 3.78093 9.40174 3.92147 9.15173 4.17157C8.90172 4.42167 8.7613 4.76084 8.76136 5.11447C8.76142 5.4681 8.90196 5.80723 9.15206 6.05724Z" fill="currentColor"/>
</svg>
