attrs==23.2.0
certifi==2024.2.2
charset-normalizer==3.3.2
exceptiongroup==1.2.0
fake-useragent==1.5.1
h11==0.14.0
idna==3.6
importlib-resources==6.4.0
outcome==1.3.0.post0
packaging==24.0
pyperclip==1.8.2
PySocks==1.7.1
python-decouple==3.8
python-dotenv==1.0.1
requests==2.31.0
selenium==4.19.0
sniffio==1.3.1
sortedcontainers==2.4.0
trio==0.25.0
trio-websocket==0.11.1
typing-extensions==4.11.0
undetected-chromedriver==3.5.5
urllib3==2.2.1
webdriver-manager==4.0.1
websockets==12.0
wsproto==1.2.0
zipp==3.18.1
