dbConnect\RetrieveData.class
dbConnect\SDOToShpGui$SdoToShpListener.class
esriShapeFile\Sdo2Shape.class
dbConnect\SDOToShpGui$ShowFolderListener.class
dbConnect\SDOToShpGui.class
dbConnect\SDOToShpGui$helpListener.class
dbConnect\SDOToShpGui$showLogsListener.class
dbConnect\DebugLog.class
