┌ Warning: You appear to be using MPI.jl with the default MPI binary on a cluster.
│ We recommend using the system-provided MPI, see the Configuration section of the MPI.jl docs.
└ @ MPI ~/.julia/packages/MPI/b7MVG/deps/deps.jl:15
┌ Warning: You appear to be using MPI.jl with the default MPI binary on a cluster.
│ We recommend using the system-provided MPI, see the Configuration section of the MPI.jl docs.
└ @ MPI ~/.julia/packages/MPI/b7MVG/deps/deps.jl:15
┌ Warning: You appear to be using MPI.jl with the default MPI binary on a cluster.
│ We recommend using the system-provided MPI, see the Configuration section of the MPI.jl docs.
└ @ MPI ~/.julia/packages/MPI/b7MVG/deps/deps.jl:15
┌ Warning: You appear to be using MPI.jl with the default MPI binary on a cluster.
│ We recommend using the system-provided MPI, see the Configuration section of the MPI.jl docs.
└ @ MPI ~/.julia/packages/MPI/b7MVG/deps/deps.jl:15
┌ Warning: You appear to be using MPI.jl with the default MPI binary on a cluster.
│ We recommend using the system-provided MPI, see the Configuration section of the MPI.jl docs.
└ @ MPI ~/.julia/packages/MPI/b7MVG/deps/deps.jl:15
┌ Warning: You appear to be using MPI.jl with the default MPI binary on a cluster.
│ We recommend using the system-provided MPI, see the Configuration section of the MPI.jl docs.
└ @ MPI ~/.julia/packages/MPI/b7MVG/deps/deps.jl:15
┌ Warning: You appear to be using MPI.jl with the default MPI binary on a cluster.
│ We recommend using the system-provided MPI, see the Configuration section of the MPI.jl docs.
└ @ MPI ~/.julia/packages/MPI/b7MVG/deps/deps.jl:15
┌ Warning: You appear to be using MPI.jl with the default MPI binary on a cluster.
│ We recommend using the system-provided MPI, see the Configuration section of the MPI.jl docs.
└ @ MPI ~/.julia/packages/MPI/b7MVG/deps/deps.jl:15
┌ Warning: You appear to be using MPI.jl with the default MPI binary on a cluster.
│ We recommend using the system-provided MPI, see the Configuration section of the MPI.jl docs.
└ @ MPI ~/.julia/packages/MPI/b7MVG/deps/deps.jl:15
┌ Warning: You appear to be using MPI.jl with the default MPI binary on a cluster.
│ We recommend using the system-provided MPI, see the Configuration section of the MPI.jl docs.
└ @ MPI ~/.julia/packages/MPI/b7MVG/deps/deps.jl:15
┌ Warning: You appear to be using MPI.jl with the default MPI binary on a cluster.
│ We recommend using the system-provided MPI, see the Configuration section of the MPI.jl docs.
└ @ MPI ~/.julia/packages/MPI/b7MVG/deps/deps.jl:15
┌ Warning: You appear to be using MPI.jl with the default MPI binary on a cluster.
│ We recommend using the system-provided MPI, see the Configuration section of the MPI.jl docs.
└ @ MPI ~/.julia/packages/MPI/b7MVG/deps/deps.jl:15
┌ Warning: You appear to be using MPI.jl with the default MPI binary on a cluster.
│ We recommend using the system-provided MPI, see the Configuration section of the MPI.jl docs.
└ @ MPI ~/.julia/packages/MPI/b7MVG/deps/deps.jl:15
┌ Warning: You appear to be using MPI.jl with the default MPI binary on a cluster.
│ We recommend using the system-provided MPI, see the Configuration section of the MPI.jl docs.
└ @ MPI ~/.julia/packages/MPI/b7MVG/deps/deps.jl:15
┌ Warning: You appear to be using MPI.jl with the default MPI binary on a cluster.
│ We recommend using the system-provided MPI, see the Configuration section of the MPI.jl docs.
└ @ MPI ~/.julia/packages/MPI/b7MVG/deps/deps.jl:15
┌ Warning: You appear to be using MPI.jl with the default MPI binary on a cluster.
│ We recommend using the system-provided MPI, see the Configuration section of the MPI.jl docs.
└ @ MPI ~/.julia/packages/MPI/b7MVG/deps/deps.jl:15
┌ Warning: You appear to be using MPI.jl with the default MPI binary on a cluster.
│ We recommend using the system-provided MPI, see the Configuration section of the MPI.jl docs.
└ @ MPI ~/.julia/packages/MPI/b7MVG/deps/deps.jl:15
┌ Warning: You appear to be using MPI.jl with the default MPI binary on a cluster.
│ We recommend using the system-provided MPI, see the Configuration section of the MPI.jl docs.
└ @ MPI ~/.julia/packages/MPI/b7MVG/deps/deps.jl:15
┌ Warning: You appear to be using MPI.jl with the default MPI binary on a cluster.
│ We recommend using the system-provided MPI, see the Configuration section of the MPI.jl docs.
└ @ MPI ~/.julia/packages/MPI/b7MVG/deps/deps.jl:15
┌ Warning: You appear to be using MPI.jl with the default MPI binary on a cluster.
│ We recommend using the system-provided MPI, see the Configuration section of the MPI.jl docs.
└ @ MPI ~/.julia/packages/MPI/b7MVG/deps/deps.jl:15
┌ Warning: You appear to be using MPI.jl with the default MPI binary on a cluster.
│ We recommend using the system-provided MPI, see the Configuration section of the MPI.jl docs.
└ @ MPI ~/.julia/packages/MPI/b7MVG/deps/deps.jl:15
┌ Warning: You appear to be using MPI.jl with the default MPI binary on a cluster.
│ We recommend using the system-provided MPI, see the Configuration section of the MPI.jl docs.
└ @ MPI ~/.julia/packages/MPI/b7MVG/deps/deps.jl:15
┌ Warning: You appear to be using MPI.jl with the default MPI binary on a cluster.
│ We recommend using the system-provided MPI, see the Configuration section of the MPI.jl docs.
└ @ MPI ~/.julia/packages/MPI/b7MVG/deps/deps.jl:15
┌ Warning: You appear to be using MPI.jl with the default MPI binary on a cluster.
│ We recommend using the system-provided MPI, see the Configuration section of the MPI.jl docs.
└ @ MPI ~/.julia/packages/MPI/b7MVG/deps/deps.jl:15
┌ Warning: You appear to be using MPI.jl with the default MPI binary on a cluster.
│ We recommend using the system-provided MPI, see the Configuration section of the MPI.jl docs.
└ @ MPI ~/.julia/packages/MPI/b7MVG/deps/deps.jl:15
┌ Warning: You appear to be using MPI.jl with the default MPI binary on a cluster.
│ We recommend using the system-provided MPI, see the Configuration section of the MPI.jl docs.
└ @ MPI ~/.julia/packages/MPI/b7MVG/deps/deps.jl:15
┌ Warning: You appear to be using MPI.jl with the default MPI binary on a cluster.
│ We recommend using the system-provided MPI, see the Configuration section of the MPI.jl docs.
└ @ MPI ~/.julia/packages/MPI/b7MVG/deps/deps.jl:15
┌ Warning: You appear to be using MPI.jl with the default MPI binary on a cluster.
│ We recommend using the system-provided MPI, see the Configuration section of the MPI.jl docs.
└ @ MPI ~/.julia/packages/MPI/b7MVG/deps/deps.jl:15
srun: Job step aborted: Waiting up to 32 seconds for job step to finish.
slurmstepd: error: *** STEP 2155785.0 ON iris-017 CANCELLED AT 2020-12-01T20:19:55 DUE TO TIME LIMIT ***
slurmstepd: error: *** JOB 2155785 ON iris-017 CANCELLED AT 2020-12-01T20:19:55 DUE TO TIME LIMIT ***

signal (15): Terminated
in expression starting at /mnt/irisgpfs/projects/tcp/epillon/FSSH/Param/C_4/main_2d.jl:133

signal (15): Terminated
in expression starting at /mnt/irisgpfs/projects/tcp/epillon/FSSH/Param/C_4/main_2d.jl:133

signal (15): Terminated
in expression starting at /mnt/irisgpfs/projects/tcp/epillon/FSSH/Param/C_4/main_2d.jl:133

signal (15): Terminated
in expression starting at /mnt/irisgpfs/projects/tcp/epillon/FSSH/Param/C_4/main_2d.jl:133

signal (15): Terminated
in expression starting at /mnt/irisgpfs/projects/tcp/epillon/FSSH/Param/C_4/main_2d.jl:133

signal (15): Terminated
in expression starting at /mnt/irisgpfs/projects/tcp/epillon/FSSH/Param/C_4/main_2d.jl:133

signal (15): Terminated
in expression starting at /mnt/irisgpfs/projects/tcp/epillon/FSSH/Param/C_4/main_2d.jl:133

signal (15): Terminated
in expression starting at /mnt/irisgpfs/projects/tcp/epillon/FSSH/Param/C_4/main_2d.jl:133

signal (15): Terminated
in expression starting at /mnt/irisgpfs/projects/tcp/epillon/FSSH/Param/C_4/main_2d.jl:133

signal (15): Terminated
in expression starting at /mnt/irisgpfs/projects/tcp/epillon/FSSH/Param/C_4/main_2d.jl:133

signal (15): Terminated
in expression starting at /mnt/irisgpfs/projects/tcp/epillon/FSSH/Param/C_4/main_2d.jl:133

signal (15): Terminated
in expression starting at /mnt/irisgpfs/projects/tcp/epillon/FSSH/Param/C_4/main_2d.jl:133

signal (15): Terminated
in expression starting at /mnt/irisgpfs/projects/tcp/epillon/FSSH/Param/C_4/main_2d.jl:133

signal (15): Terminated
in expression starting at /mnt/irisgpfs/projects/tcp/epillon/FSSH/Param/C_4/main_2d.jl:133

signal (15): Terminated
in expression starting at /mnt/irisgpfs/projects/tcp/epillon/FSSH/Param/C_4/main_2d.jl:133

signal (15): Terminated
in expression starting at /mnt/irisgpfs/projects/tcp/epillon/FSSH/Param/C_4/main_2d.jl:133

signal (15): Terminated
in expression starting at /mnt/irisgpfs/projects/tcp/epillon/FSSH/Param/C_4/main_2d.jl:133

signal (15): Terminated
in expression starting at /mnt/irisgpfs/projects/tcp/epillon/FSSH/Param/C_4/main_2d.jl:133

signal (15): Terminated
in expression starting at /mnt/irisgpfs/projects/tcp/epillon/FSSH/Param/C_4/main_2d.jl:133
_evaluate at /home/users/epillon/.julia/packages/Dierckx/UZGsb/src/Dierckx.jl:279
unknown function (ip: 0x2aaac0479e0f)
unknown function (ip: 0xffffffffffffffff)
Allocations: 38073285711 (Pool: 38073270276; Big: 15435); GC: 21994

signal (15): Terminated
in expression starting at /mnt/irisgpfs/projects/tcp/epillon/FSSH/Param/C_4/main_2d.jl:133

signal (15): Terminated
in expression starting at /mnt/irisgpfs/projects/tcp/epillon/FSSH/Param/C_4/main_2d.jl:133

signal (15): Terminated
in expression starting at /mnt/irisgpfs/projects/tcp/epillon/FSSH/Param/C_4/main_2d.jl:133

signal (15): Terminated
in expression starting at /mnt/irisgpfs/projects/tcp/epillon/FSSH/Param/C_4/main_2d.jl:133

signal (15): Terminated
in expression starting at /mnt/irisgpfs/projects/tcp/epillon/FSSH/Param/C_4/main_2d.jl:133

signal (15): Terminated
in expression starting at /mnt/irisgpfs/projects/tcp/epillon/FSSH/Param/C_4/main_2d.jl:133

signal (15): Terminated
in expression starting at /mnt/irisgpfs/projects/tcp/epillon/FSSH/Param/C_4/main_2d.jl:133
jl_lookup_generic_ at /buildworker/worker/package_linux64/build/src/gf.c:2242 [inlined]
jl_apply_generic at /buildworker/worker/package_linux64/build/src/gf.c:2301
update_density_coefficients at /mnt/irisgpfs/projects/tcp/epillon/FSSH/Param/C_4/particle_methods_2d.jl:46
run_dynamics at /mnt/irisgpfs/projects/tcp/epillon/FSSH/Param/C_4/particle_methods_2d.jl:206
main at /mnt/irisgpfs/projects/tcp/epillon/FSSH/Param/C_4/main_2d.jl:81
unknown function (ip: 0x2aaac4a0dd3f)
_jl_invoke at /buildworker/worker/package_linux64/build/src/gf.c:2141 [inlined]
jl_apply_generic at /buildworker/worker/package_linux64/build/src/gf.c:2305
jl_apply at /buildworker/worker/package_linux64/build/src/julia.h:1631 [inlined]
do_call at /buildworker/worker/package_linux64/build/src/interpreter.c:328
eval_value at /buildworker/worker/package_linux64/build/src/interpreter.c:417
eval_stmt_value at /buildworker/worker/package_linux64/build/src/interpreter.c:368 [inlined]
eval_body at /buildworker/worker/package_linux64/build/src/interpreter.c:778
jl_interpret_toplevel_thunk_callback at /buildworker/worker/package_linux64/build/src/interpreter.c:888
unknown function (ip: 0xfffffffffffffffe)
unknown function (ip: 0x2aaac15c8d0f)
unknown function (ip: 0xffffffffffffffff)
jl_interpret_toplevel_thunk at /buildworker/worker/package_linux64/build/src/interpreter.c:897
jl_toplevel_eval_flex at /buildworker/worker/package_linux64/build/src/toplevel.c:814
jl_parse_eval_all at /buildworker/worker/package_linux64/build/src/ast.c:873
jl_load at /buildworker/worker/package_linux64/build/src/toplevel.c:878

signal (15): Terminated
in expression starting at /mnt/irisgpfs/projects/tcp/epillon/FSSH/Param/C_4/main_2d.jl:133

signal (15): Terminated
in expression starting at /mnt/irisgpfs/projects/tcp/epillon/FSSH/Param/C_4/main_2d.jl:133
splev_ at /home/users/epillon/.julia/artifacts/4af195a529c56762113fac4823c38d0d911367a9/lib/libddierckx.so (unknown line)
splev_ at /home/users/epillon/.julia/artifacts/4af195a529c56762113fac4823c38d0d911367a9/lib/libddierckx.so (unknown line)
splev_ at /home/users/epillon/.julia/artifacts/4af195a529c56762113fac4823c38d0d911367a9/lib/libddierckx.so (unknown line)
splev_ at /home/users/epillon/.julia/artifacts/4af195a529c56762113fac4823c38d0d911367a9/lib/libddierckx.so (unknown line)
splev_ at /home/users/epillon/.julia/artifacts/4af195a529c56762113fac4823c38d0d911367a9/lib/libddierckx.so (unknown line)
_evaluate at /home/users/epillon/.julia/packages/Dierckx/UZGsb/src/Dierckx.jl:279
_evaluate at /home/users/epillon/.julia/packages/Dierckx/UZGsb/src/Dierckx.jl:279
_evaluate at /home/users/epillon/.julia/packages/Dierckx/UZGsb/src/Dierckx.jl:279
evaluate at /home/users/epillon/.julia/packages/Dierckx/UZGsb/src/Dierckx.jl:296 [inlined]
Spline1D at /home/users/epillon/.julia/packages/Dierckx/UZGsb/src/Dierckx.jl:1040
evaluate at /home/users/epillon/.julia/packages/Dierckx/UZGsb/src/Dierckx.jl:296 [inlined]
Spline1D at /home/users/epillon/.julia/packages/Dierckx/UZGsb/src/Dierckx.jl:1040
unknown function (ip: 0x2aaac4a14b07)
_evaluate at /home/users/epillon/.julia/packages/Dierckx/UZGsb/src/Dierckx.jl:279
evaluate at /home/users/epillon/.julia/packages/Dierckx/UZGsb/src/Dierckx.jl:296 [inlined]
Spline1D at /home/users/epillon/.julia/packages/Dierckx/UZGsb/src/Dierckx.jl:1040
unknown function (ip: 0x2aaac4a14b07)
evaluate at /home/users/epillon/.julia/packages/Dierckx/UZGsb/src/Dierckx.jl:296 [inlined]
Spline1D at /home/users/epillon/.julia/packages/Dierckx/UZGsb/src/Dierckx.jl:1040
unknown function (ip: 0x2aaac4a14b07)
unknown function (ip: 0x2aaac4a14b07)
_evaluate at /home/users/epillon/.julia/packages/Dierckx/UZGsb/src/Dierckx.jl:279
evaluate at /home/users/epillon/.julia/packages/Dierckx/UZGsb/src/Dierckx.jl:296 [inlined]
Spline1D at /home/users/epillon/.julia/packages/Dierckx/UZGsb/src/Dierckx.jl:1040
unknown function (ip: 0x2aaac4a14b07)
splev_ at /home/users/epillon/.julia/artifacts/4af195a529c56762113fac4823c38d0d911367a9/lib/libddierckx.so (unknown line)
splev_ at /home/users/epillon/.julia/artifacts/4af195a529c56762113fac4823c38d0d911367a9/lib/libddierckx.so (unknown line)
splev_ at /home/users/epillon/.julia/artifacts/4af195a529c56762113fac4823c38d0d911367a9/lib/libddierckx.so (unknown line)
splev_ at /home/users/epillon/.julia/artifacts/4af195a529c56762113fac4823c38d0d911367a9/lib/libddierckx.so (unknown line)
splev_ at /home/users/epillon/.julia/artifacts/4af195a529c56762113fac4823c38d0d911367a9/lib/libddierckx.so (unknown line)
splev_ at /home/users/epillon/.julia/artifacts/4af195a529c56762113fac4823c38d0d911367a9/lib/libddierckx.so (unknown line)
splev_ at /home/users/epillon/.julia/artifacts/4af195a529c56762113fac4823c38d0d911367a9/lib/libddierckx.so (unknown line)
splev_ at /home/users/epillon/.julia/artifacts/4af195a529c56762113fac4823c38d0d911367a9/lib/libddierckx.so (unknown line)
_evaluate at /home/users/epillon/.julia/packages/Dierckx/UZGsb/src/Dierckx.jl:279
evaluate at /home/users/epillon/.julia/packages/Dierckx/UZGsb/src/Dierckx.jl:296 [inlined]
Spline1D at /home/users/epillon/.julia/packages/Dierckx/UZGsb/src/Dierckx.jl:1040
unknown function (ip: 0x2aaac4a14b07)
splev_ at /home/users/epillon/.julia/artifacts/4af195a529c56762113fac4823c38d0d911367a9/lib/libddierckx.so (unknown line)
splev_ at /home/users/epillon/.julia/artifacts/4af195a529c56762113fac4823c38d0d911367a9/lib/libddierckx.so (unknown line)
_evaluate at /home/users/epillon/.julia/packages/Dierckx/UZGsb/src/Dierckx.jl:279
splev_ at /home/users/epillon/.julia/artifacts/4af195a529c56762113fac4823c38d0d911367a9/lib/libddierckx.so (unknown line)
evaluate at /home/users/epillon/.julia/packages/Dierckx/UZGsb/src/Dierckx.jl:296 [inlined]
Spline1D at /home/users/epillon/.julia/packages/Dierckx/UZGsb/src/Dierckx.jl:1040
unknown function (ip: 0x2aaac4a14b07)
splev_ at /home/users/epillon/.julia/artifacts/4af195a529c56762113fac4823c38d0d911367a9/lib/libddierckx.so (unknown line)
splev_ at /home/users/epillon/.julia/artifacts/4af195a529c56762113fac4823c38d0d911367a9/lib/libddierckx.so (unknown line)
splev_ at /home/users/epillon/.julia/artifacts/4af195a529c56762113fac4823c38d0d911367a9/lib/libddierckx.so (unknown line)
splev_ at /home/users/epillon/.julia/artifacts/4af195a529c56762113fac4823c38d0d911367a9/lib/libddierckx.so (unknown line)
splev_ at /home/users/epillon/.julia/artifacts/4af195a529c56762113fac4823c38d0d911367a9/lib/libddierckx.so (unknown line)
_evaluate at /home/users/epillon/.julia/packages/Dierckx/UZGsb/src/Dierckx.jl:279
evaluate at /home/users/epillon/.julia/packages/Dierckx/UZGsb/src/Dierckx.jl:296 [inlined]
Spline1D at /home/users/epillon/.julia/packages/Dierckx/UZGsb/src/Dierckx.jl:1040
unknown function (ip: 0x2aaac4a14b07)
_evaluate at /home/users/epillon/.julia/packages/Dierckx/UZGsb/src/Dierckx.jl:279
evaluate at /home/users/epillon/.julia/packages/Dierckx/UZGsb/src/Dierckx.jl:296 [inlined]
Spline1D at /home/users/epillon/.julia/packages/Dierckx/UZGsb/src/Dierckx.jl:1040
unknown function (ip: 0x2aaac4a14b07)
_evaluate at /home/users/epillon/.julia/packages/Dierckx/UZGsb/src/Dierckx.jl:279
evaluate at /home/users/epillon/.julia/packages/Dierckx/UZGsb/src/Dierckx.jl:296 [inlined]
Spline1D at /home/users/epillon/.julia/packages/Dierckx/UZGsb/src/Dierckx.jl:1040
unknown function (ip: 0x2aaac4a14b07)
_evaluate at /home/users/epillon/.julia/packages/Dierckx/UZGsb/src/Dierckx.jl:279
evaluate at /home/users/epillon/.julia/packages/Dierckx/UZGsb/src/Dierckx.jl:296 [inlined]
Spline1D at /home/users/epillon/.julia/packages/Dierckx/UZGsb/src/Dierckx.jl:1040
unknown function (ip: 0x2aaac4a14b07)
_evaluate at /home/users/epillon/.julia/packages/Dierckx/UZGsb/src/Dierckx.jl:279
evaluate at /home/users/epillon/.julia/packages/Dierckx/UZGsb/src/Dierckx.jl:296 [inlined]
Spline1D at /home/users/epillon/.julia/packages/Dierckx/UZGsb/src/Dierckx.jl:1040
unknown function (ip: 0x2aaac4a14b07)
_evaluate at /home/users/epillon/.julia/packages/Dierckx/UZGsb/src/Dierckx.jl:279
evaluate at /home/users/epillon/.julia/packages/Dierckx/UZGsb/src/Dierckx.jl:296 [inlined]
Spline1D at /home/users/epillon/.julia/packages/Dierckx/UZGsb/src/Dierckx.jl:1040
unknown function (ip: 0x2aaac4a14b07)
_evaluate at /home/users/epillon/.julia/packages/Dierckx/UZGsb/src/Dierckx.jl:279
_evaluate at /home/users/epillon/.julia/packages/Dierckx/UZGsb/src/Dierckx.jl:279
evaluate at /home/users/epillon/.julia/packages/Dierckx/UZGsb/src/Dierckx.jl:296 [inlined]
Spline1D at /home/users/epillon/.julia/packages/Dierckx/UZGsb/src/Dierckx.jl:1040
unknown function (ip: 0x2aaac4a14b07)
_evaluate at /home/users/epillon/.julia/packages/Dierckx/UZGsb/src/Dierckx.jl:279
evaluate at /home/users/epillon/.julia/packages/Dierckx/UZGsb/src/Dierckx.jl:296 [inlined]
Spline1D at /home/users/epillon/.julia/packages/Dierckx/UZGsb/src/Dierckx.jl:1040
unknown function (ip: 0x2aaac4a14b07)
_evaluate at /home/users/epillon/.julia/packages/Dierckx/UZGsb/src/Dierckx.jl:279
evaluate at /home/users/epillon/.julia/packages/Dierckx/UZGsb/src/Dierckx.jl:296 [inlined]
Spline1D at /home/users/epillon/.julia/packages/Dierckx/UZGsb/src/Dierckx.jl:1040
unknown function (ip: 0x2aaac4a14b07)
evaluate at /home/users/epillon/.julia/packages/Dierckx/UZGsb/src/Dierckx.jl:296 [inlined]
Spline1D at /home/users/epillon/.julia/packages/Dierckx/UZGsb/src/Dierckx.jl:1040
unknown function (ip: 0x2aaac4a14b07)
_evaluate at /home/users/epillon/.julia/packages/Dierckx/UZGsb/src/Dierckx.jl:279
evaluate at /home/users/epillon/.julia/packages/Dierckx/UZGsb/src/Dierckx.jl:296 [inlined]
Spline1D at /home/users/epillon/.julia/packages/Dierckx/UZGsb/src/Dierckx.jl:1040
unknown function (ip: 0x2aaac4a14b07)
_evaluate at /home/users/epillon/.julia/packages/Dierckx/UZGsb/src/Dierckx.jl:279
evaluate at /home/users/epillon/.julia/packages/Dierckx/UZGsb/src/Dierckx.jl:296 [inlined]
Spline1D at /home/users/epillon/.julia/packages/Dierckx/UZGsb/src/Dierckx.jl:1040
unknown function (ip: 0x2aaac4a14b07)
_jl_invoke at /buildworker/worker/package_linux64/build/src/gf.c:2135 [inlined]
jl_apply_generic at /buildworker/worker/package_linux64/build/src/gf.c:2305
_jl_invoke at /buildworker/worker/package_linux64/build/src/gf.c:2135 [inlined]
jl_apply_generic at /buildworker/worker/package_linux64/build/src/gf.c:2305
_jl_invoke at /buildworker/worker/package_linux64/build/src/gf.c:2135 [inlined]
jl_apply_generic at /buildworker/worker/package_linux64/build/src/gf.c:2305
_jl_invoke at /buildworker/worker/package_linux64/build/src/gf.c:2135 [inlined]
jl_apply_generic at /buildworker/worker/package_linux64/build/src/gf.c:2305
update_density_coefficients at /mnt/irisgpfs/projects/tcp/epillon/FSSH/Param/C_4/particle_methods_2d.jl:42
update_density_coefficients at /mnt/irisgpfs/projects/tcp/epillon/FSSH/Param/C_4/particle_methods_2d.jl:39
run_dynamics at /mnt/irisgpfs/projects/tcp/epillon/FSSH/Param/C_4/particle_methods_2d.jl:206
update_density_coefficients at /mnt/irisgpfs/projects/tcp/epillon/FSSH/Param/C_4/particle_methods_2d.jl:40
run_dynamics at /mnt/irisgpfs/projects/tcp/epillon/FSSH/Param/C_4/particle_methods_2d.jl:206
update_density_coefficients at /mnt/irisgpfs/projects/tcp/epillon/FSSH/Param/C_4/particle_methods_2d.jl:40
run_dynamics at /mnt/irisgpfs/projects/tcp/epillon/FSSH/Param/C_4/particle_methods_2d.jl:206
run_dynamics at /mnt/irisgpfs/projects/tcp/epillon/FSSH/Param/C_4/particle_methods_2d.jl:206
_jl_invoke at /buildworker/worker/package_linux64/build/src/gf.c:2135 [inlined]
jl_apply_generic at /buildworker/worker/package_linux64/build/src/gf.c:2305
main at /mnt/irisgpfs/projects/tcp/epillon/FSSH/Param/C_4/main_2d.jl:81
unknown function (ip: 0x2aaac4a0dd3f)
main at /mnt/irisgpfs/projects/tcp/epillon/FSSH/Param/C_4/main_2d.jl:81
unknown function (ip: 0x2aaac4a0dd3f)
main at /mnt/irisgpfs/projects/tcp/epillon/FSSH/Param/C_4/main_2d.jl:81
unknown function (ip: 0x2aaac4a0dd3f)
main at /mnt/irisgpfs/projects/tcp/epillon/FSSH/Param/C_4/main_2d.jl:81
unknown function (ip: 0x2aaac4a0dd3f)
_jl_invoke at /buildworker/worker/package_linux64/build/src/gf.c:2141 [inlined]
jl_apply_generic at /buildworker/worker/package_linux64/build/src/gf.c:2305
_jl_invoke at /buildworker/worker/package_linux64/build/src/gf.c:2141 [inlined]
jl_apply_generic at /buildworker/worker/package_linux64/build/src/gf.c:2305
_jl_invoke at /buildworker/worker/package_linux64/build/src/gf.c:2141 [inlined]
jl_apply_generic at /buildworker/worker/package_linux64/build/src/gf.c:2305
_jl_invoke at /buildworker/worker/package_linux64/build/src/gf.c:2141 [inlined]
jl_apply_generic at /buildworker/worker/package_linux64/build/src/gf.c:2305
update_density_coefficients at /mnt/irisgpfs/projects/tcp/epillon/FSSH/Param/C_4/particle_methods_2d.jl:39
run_dynamics at /mnt/irisgpfs/projects/tcp/epillon/FSSH/Param/C_4/particle_methods_2d.jl:206
main at /mnt/irisgpfs/projects/tcp/epillon/FSSH/Param/C_4/main_2d.jl:81
unknown function (ip: 0x2aaac4a0dd3f)
_jl_invoke at /buildworker/worker/package_linux64/build/src/gf.c:2141 [inlined]
jl_apply_generic at /buildworker/worker/package_linux64/build/src/gf.c:2305
_jl_invoke at /buildworker/worker/package_linux64/build/src/gf.c:2135 [inlined]
jl_apply_generic at /buildworker/worker/package_linux64/build/src/gf.c:2305
_jl_invoke at /buildworker/worker/package_linux64/build/src/gf.c:2135 [inlined]
jl_apply_generic at /buildworker/worker/package_linux64/build/src/gf.c:2305
update_density_coefficients at /mnt/irisgpfs/projects/tcp/epillon/FSSH/Param/C_4/particle_methods_2d.jl:42
run_dynamics at /mnt/irisgpfs/projects/tcp/epillon/FSSH/Param/C_4/particle_methods_2d.jl:206
_jl_invoke at /buildworker/worker/package_linux64/build/src/gf.c:2135 [inlined]
jl_apply_generic at /buildworker/worker/package_linux64/build/src/gf.c:2305
update_density_coefficients at /mnt/irisgpfs/projects/tcp/epillon/FSSH/Param/C_4/particle_methods_2d.jl:39
run_dynamics at /mnt/irisgpfs/projects/tcp/epillon/FSSH/Param/C_4/particle_methods_2d.jl:206
_jl_invoke at /buildworker/worker/package_linux64/build/src/gf.c:2135 [inlined]
jl_apply_generic at /buildworker/worker/package_linux64/build/src/gf.c:2305
main at /mnt/irisgpfs/projects/tcp/epillon/FSSH/Param/C_4/main_2d.jl:81
unknown function (ip: 0x2aaac4a0dd3f)
update_density_coefficients at /mnt/irisgpfs/projects/tcp/epillon/FSSH/Param/C_4/particle_methods_2d.jl:40
_jl_invoke at /buildworker/worker/package_linux64/build/src/gf.c:2135 [inlined]
jl_apply_generic at /buildworker/worker/package_linux64/build/src/gf.c:2305
_evaluate at /home/users/epillon/.julia/packages/Dierckx/UZGsb/src/Dierckx.jl:279
evaluate at /home/users/epillon/.julia/packages/Dierckx/UZGsb/src/Dierckx.jl:296 [inlined]
Spline1D at /home/users/epillon/.julia/packages/Dierckx/UZGsb/src/Dierckx.jl:1040
run_dynamics at /mnt/irisgpfs/projects/tcp/epillon/FSSH/Param/C_4/particle_methods_2d.jl:206
_jl_invoke at /buildworker/worker/package_linux64/build/src/gf.c:2141 [inlined]
jl_apply_generic at /buildworker/worker/package_linux64/build/src/gf.c:2305
_jl_invoke at /buildworker/worker/package_linux64/build/src/gf.c:2135 [inlined]
jl_apply_generic at /buildworker/worker/package_linux64/build/src/gf.c:2305
_jl_invoke at /buildworker/worker/package_linux64/build/src/gf.c:2135 [inlined]
jl_apply_generic at /buildworker/worker/package_linux64/build/src/gf.c:2305
unknown function (ip: 0x2aaac4a14b07)
_jl_invoke at /buildworker/worker/package_linux64/build/src/gf.c:2135 [inlined]
jl_apply_generic at /buildworker/worker/package_linux64/build/src/gf.c:2305
update_density_coefficients at /mnt/irisgpfs/projects/tcp/epillon/FSSH/Param/C_4/particle_methods_2d.jl:40
run_dynamics at /mnt/irisgpfs/projects/tcp/epillon/FSSH/Param/C_4/particle_methods_2d.jl:206
_jl_invoke at /buildworker/worker/package_linux64/build/src/gf.c:2135 [inlined]
jl_apply_generic at /buildworker/worker/package_linux64/build/src/gf.c:2305
main at /mnt/irisgpfs/projects/tcp/epillon/FSSH/Param/C_4/main_2d.jl:81
unknown function (ip: 0x2aaac4a0dd3f)
_jl_invoke at /buildworker/worker/package_linux64/build/src/gf.c:2141 [inlined]
jl_apply_generic at /buildworker/worker/package_linux64/build/src/gf.c:2305
update_density_coefficients at /mnt/irisgpfs/projects/tcp/epillon/FSSH/Param/C_4/particle_methods_2d.jl:39
main at /mnt/irisgpfs/projects/tcp/epillon/FSSH/Param/C_4/main_2d.jl:81
unknown function (ip: 0x2aaac4a0dd3f)
jl_apply at /buildworker/worker/package_linux64/build/src/julia.h:1631 [inlined]
do_call at /buildworker/worker/package_linux64/build/src/interpreter.c:328
_jl_invoke at /buildworker/worker/package_linux64/build/src/gf.c:2135 [inlined]
jl_apply_generic at /buildworker/worker/package_linux64/build/src/gf.c:2305
_jl_invoke at /buildworker/worker/package_linux64/build/src/gf.c:2135 [inlined]
jl_apply_generic at /buildworker/worker/package_linux64/build/src/gf.c:2305
jl_apply at /buildworker/worker/package_linux64/build/src/julia.h:1631 [inlined]
do_call at /buildworker/worker/package_linux64/build/src/interpreter.c:328
_jl_invoke at /buildworker/worker/package_linux64/build/src/gf.c:2135 [inlined]
jl_apply_generic at /buildworker/worker/package_linux64/build/src/gf.c:2305
update_density_coefficients at /mnt/irisgpfs/projects/tcp/epillon/FSSH/Param/C_4/particle_methods_2d.jl:39
run_dynamics at /mnt/irisgpfs/projects/tcp/epillon/FSSH/Param/C_4/particle_methods_2d.jl:206
update_density_coefficients at /mnt/irisgpfs/projects/tcp/epillon/FSSH/Param/C_4/particle_methods_2d.jl:39
run_dynamics at /mnt/irisgpfs/projects/tcp/epillon/FSSH/Param/C_4/particle_methods_2d.jl:206
der_surface at /mnt/irisgpfs/projects/tcp/epillon/FSSH/Param/C_4/particle_methods_2d.jl:58
der_surface at /mnt/irisgpfs/projects/tcp/epillon/FSSH/Param/C_4/particle_methods_2d.jl:54 [inlined]
time_evolution at /mnt/irisgpfs/projects/tcp/epillon/FSSH/Param/C_4/particle_methods_2d.jl:131
run_dynamics at /mnt/irisgpfs/projects/tcp/epillon/FSSH/Param/C_4/particle_methods_2d.jl:204
_jl_invoke at /buildworker/worker/package_linux64/build/src/gf.c:2135 [inlined]
jl_apply_generic at /buildworker/worker/package_linux64/build/src/gf.c:2305
update_density_coefficients at /mnt/irisgpfs/projects/tcp/epillon/FSSH/Param/C_4/particle_methods_2d.jl:39
run_dynamics at /mnt/irisgpfs/projects/tcp/epillon/FSSH/Param/C_4/particle_methods_2d.jl:206
_jl_invoke at /buildworker/worker/package_linux64/build/src/gf.c:2135 [inlined]
jl_apply_generic at /buildworker/worker/package_linux64/build/src/gf.c:2305
run_dynamics at /mnt/irisgpfs/projects/tcp/epillon/FSSH/Param/C_4/particle_methods_2d.jl:206
main at /mnt/irisgpfs/projects/tcp/epillon/FSSH/Param/C_4/main_2d.jl:81
unknown function (ip: 0x2aaac4a0dd3f)
_jl_invoke at /buildworker/worker/package_linux64/build/src/gf.c:2141 [inlined]
jl_apply_generic at /buildworker/worker/package_linux64/build/src/gf.c:2305
update_density_coefficients at /mnt/irisgpfs/projects/tcp/epillon/FSSH/Param/C_4/particle_methods_2d.jl:40
run_dynamics at /mnt/irisgpfs/projects/tcp/epillon/FSSH/Param/C_4/particle_methods_2d.jl:206
main at /mnt/irisgpfs/projects/tcp/epillon/FSSH/Param/C_4/main_2d.jl:81
unknown function (ip: 0x2aaac4a0dd3f)
_jl_invoke at /buildworker/worker/package_linux64/build/src/gf.c:2141 [inlined]
jl_apply_generic at /buildworker/worker/package_linux64/build/src/gf.c:2305
update_density_coefficients at /mnt/irisgpfs/projects/tcp/epillon/FSSH/Param/C_4/particle_methods_2d.jl:39
run_dynamics at /mnt/irisgpfs/projects/tcp/epillon/FSSH/Param/C_4/particle_methods_2d.jl:206
jl_apply at /buildworker/worker/package_linux64/build/src/julia.h:1631 [inlined]
do_call at /buildworker/worker/package_linux64/build/src/interpreter.c:328
update_density_coefficients at /mnt/irisgpfs/projects/tcp/epillon/FSSH/Param/C_4/particle_methods_2d.jl:40
run_dynamics at /mnt/irisgpfs/projects/tcp/epillon/FSSH/Param/C_4/particle_methods_2d.jl:206
update_density_coefficients at /mnt/irisgpfs/projects/tcp/epillon/FSSH/Param/C_4/particle_methods_2d.jl:40
run_dynamics at /mnt/irisgpfs/projects/tcp/epillon/FSSH/Param/C_4/particle_methods_2d.jl:206
main at /mnt/irisgpfs/projects/tcp/epillon/FSSH/Param/C_4/main_2d.jl:81
unknown function (ip: 0x2aaac4a0dd3f)
_jl_invoke at /buildworker/worker/package_linux64/build/src/gf.c:2141 [inlined]
jl_apply_generic at /buildworker/worker/package_linux64/build/src/gf.c:2305
main at /mnt/irisgpfs/projects/tcp/epillon/FSSH/Param/C_4/main_2d.jl:81
unknown function (ip: 0x2aaac4a0dd3f)
_jl_invoke at /buildworker/worker/package_linux64/build/src/gf.c:2141 [inlined]
jl_apply_generic at /buildworker/worker/package_linux64/build/src/gf.c:2305
main at /mnt/irisgpfs/projects/tcp/epillon/FSSH/Param/C_4/main_2d.jl:81
unknown function (ip: 0x2aaac4a0dd3f)
_jl_invoke at /buildworker/worker/package_linux64/build/src/gf.c:2141 [inlined]
jl_apply_generic at /buildworker/worker/package_linux64/build/src/gf.c:2305
update_density_coefficients at /mnt/irisgpfs/projects/tcp/epillon/FSSH/Param/C_4/particle_methods_2d.jl:39
run_dynamics at /mnt/irisgpfs/projects/tcp/epillon/FSSH/Param/C_4/particle_methods_2d.jl:206
_jl_invoke at /buildworker/worker/package_linux64/build/src/gf.c:2141 [inlined]
jl_apply_generic at /buildworker/worker/package_linux64/build/src/gf.c:2305
main at /mnt/irisgpfs/projects/tcp/epillon/FSSH/Param/C_4/main_2d.jl:81
unknown function (ip: 0x2aaac4a0dd3f)
_jl_invoke at /buildworker/worker/package_linux64/build/src/gf.c:2141 [inlined]
jl_apply_generic at /buildworker/worker/package_linux64/build/src/gf.c:2305
main at /mnt/irisgpfs/projects/tcp/epillon/FSSH/Param/C_4/main_2d.jl:81
unknown function (ip: 0x2aaac4a0dd3f)
_jl_invoke at /buildworker/worker/package_linux64/build/src/gf.c:2141 [inlined]
jl_apply_generic at /buildworker/worker/package_linux64/build/src/gf.c:2305
main at /mnt/irisgpfs/projects/tcp/epillon/FSSH/Param/C_4/main_2d.jl:81
unknown function (ip: 0x2aaac4a0dd3f)
_jl_invoke at /buildworker/worker/package_linux64/build/src/gf.c:2141 [inlined]
jl_apply_generic at /buildworker/worker/package_linux64/build/src/gf.c:2305
main at /mnt/irisgpfs/projects/tcp/epillon/FSSH/Param/C_4/main_2d.jl:81
unknown function (ip: 0x2aaac4a0dd3f)
_jl_invoke at /buildworker/worker/package_linux64/build/src/gf.c:2141 [inlined]
jl_apply_generic at /buildworker/worker/package_linux64/build/src/gf.c:2305
main at /mnt/irisgpfs/projects/tcp/epillon/FSSH/Param/C_4/main_2d.jl:81
unknown function (ip: 0x2aaac4a0dd3f)
_jl_invoke at /buildworker/worker/package_linux64/build/src/gf.c:2141 [inlined]
jl_apply_generic at /buildworker/worker/package_linux64/build/src/gf.c:2305
jl_apply at /buildworker/worker/package_linux64/build/src/julia.h:1631 [inlined]
do_call at /buildworker/worker/package_linux64/build/src/interpreter.c:328
main at /mnt/irisgpfs/projects/tcp/epillon/FSSH/Param/C_4/main_2d.jl:81
unknown function (ip: 0x2aaac4a0dd3f)
_jl_invoke at /buildworker/worker/package_linux64/build/src/gf.c:2141 [inlined]
jl_apply_generic at /buildworker/worker/package_linux64/build/src/gf.c:2305
eval_value at /buildworker/worker/package_linux64/build/src/interpreter.c:417
eval_value at /buildworker/worker/package_linux64/build/src/interpreter.c:417
eval_value at /buildworker/worker/package_linux64/build/src/interpreter.c:417
eval_value at /buildworker/worker/package_linux64/build/src/interpreter.c:417
jl_apply at /buildworker/worker/package_linux64/build/src/julia.h:1631 [inlined]
do_call at /buildworker/worker/package_linux64/build/src/interpreter.c:328
jl_apply at /buildworker/worker/package_linux64/build/src/julia.h:1631 [inlined]
do_call at /buildworker/worker/package_linux64/build/src/interpreter.c:328
jl_apply at /buildworker/worker/package_linux64/build/src/julia.h:1631 [inlined]
do_call at /buildworker/worker/package_linux64/build/src/interpreter.c:328
jl_apply at /buildworker/worker/package_linux64/build/src/julia.h:1631 [inlined]
do_call at /buildworker/worker/package_linux64/build/src/interpreter.c:328
eval_stmt_value at /buildworker/worker/package_linux64/build/src/interpreter.c:368 [inlined]
eval_body at /buildworker/worker/package_linux64/build/src/interpreter.c:778
eval_stmt_value at /buildworker/worker/package_linux64/build/src/interpreter.c:368 [inlined]
eval_body at /buildworker/worker/package_linux64/build/src/interpreter.c:778
eval_stmt_value at /buildworker/worker/package_linux64/build/src/interpreter.c:368 [inlined]
eval_body at /buildworker/worker/package_linux64/build/src/interpreter.c:778
jl_apply at /buildworker/worker/package_linux64/build/src/julia.h:1631 [inlined]
do_call at /buildworker/worker/package_linux64/build/src/interpreter.c:328
jl_apply at /buildworker/worker/package_linux64/build/src/julia.h:1631 [inlined]
do_call at /buildworker/worker/package_linux64/build/src/interpreter.c:328
jl_apply at /buildworker/worker/package_linux64/build/src/julia.h:1631 [inlined]
do_call at /buildworker/worker/package_linux64/build/src/interpreter.c:328
jl_apply at /buildworker/worker/package_linux64/build/src/julia.h:1631 [inlined]
do_call at /buildworker/worker/package_linux64/build/src/interpreter.c:328
jl_apply at /buildworker/worker/package_linux64/build/src/julia.h:1631 [inlined]
do_call at /buildworker/worker/package_linux64/build/src/interpreter.c:328
jl_apply at /buildworker/worker/package_linux64/build/src/julia.h:1631 [inlined]
do_call at /buildworker/worker/package_linux64/build/src/interpreter.c:328
jl_apply at /buildworker/worker/package_linux64/build/src/julia.h:1631 [inlined]
do_call at /buildworker/worker/package_linux64/build/src/interpreter.c:328
jl_apply at /buildworker/worker/package_linux64/build/src/julia.h:1631 [inlined]
do_call at /buildworker/worker/package_linux64/build/src/interpreter.c:328
eval_stmt_value at /buildworker/worker/package_linux64/build/src/interpreter.c:368 [inlined]
eval_body at /buildworker/worker/package_linux64/build/src/interpreter.c:778
jl_apply at /buildworker/worker/package_linux64/build/src/julia.h:1631 [inlined]
do_call at /buildworker/worker/package_linux64/build/src/interpreter.c:328
eval_value at /buildworker/worker/package_linux64/build/src/interpreter.c:417
eval_value at /buildworker/worker/package_linux64/build/src/interpreter.c:417
eval_value at /buildworker/worker/package_linux64/build/src/interpreter.c:417
eval_value at /buildworker/worker/package_linux64/build/src/interpreter.c:417
_jl_invoke at /buildworker/worker/package_linux64/build/src/gf.c:2135 [inlined]
jl_apply_generic at /buildworker/worker/package_linux64/build/src/gf.c:2305
jl_interpret_toplevel_thunk_callback at /buildworker/worker/package_linux64/build/src/interpreter.c:888
unknown function (ip: 0xfffffffffffffffe)
unknown function (ip: 0x2aaac15c8d0f)
unknown function (ip: 0xffffffffffffffff)
jl_interpret_toplevel_thunk_callback at /buildworker/worker/package_linux64/build/src/interpreter.c:888
unknown function (ip: 0xfffffffffffffffe)
unknown function (ip: 0x2aaac15c8d0f)
unknown function (ip: 0xffffffffffffffff)
jl_interpret_toplevel_thunk_callback at /buildworker/worker/package_linux64/build/src/interpreter.c:888
unknown function (ip: 0xfffffffffffffffe)
unknown function (ip: 0x2aaac15c8d0f)
unknown function (ip: 0xffffffffffffffff)
eval_value at /buildworker/worker/package_linux64/build/src/interpreter.c:417
eval_value at /buildworker/worker/package_linux64/build/src/interpreter.c:417
eval_value at /buildworker/worker/package_linux64/build/src/interpreter.c:417
update_density_coefficients at /mnt/irisgpfs/projects/tcp/epillon/FSSH/Param/C_4/particle_methods_2d.jl:39
eval_value at /buildworker/worker/package_linux64/build/src/interpreter.c:417
eval_value at /buildworker/worker/package_linux64/build/src/interpreter.c:417
run_dynamics at /mnt/irisgpfs/projects/tcp/epillon/FSSH/Param/C_4/particle_methods_2d.jl:206
eval_value at /buildworker/worker/package_linux64/build/src/interpreter.c:417
eval_value at /buildworker/worker/package_linux64/build/src/interpreter.c:417
eval_value at /buildworker/worker/package_linux64/build/src/interpreter.c:417
jl_interpret_toplevel_thunk_callback at /buildworker/worker/package_linux64/build/src/interpreter.c:888
unknown function (ip: 0xfffffffffffffffe)
unknown function (ip: 0x2aaac15c8d0f)
unknown function (ip: 0xffffffffffffffff)
eval_value at /buildworker/worker/package_linux64/build/src/interpreter.c:417
main at /mnt/irisgpfs/projects/tcp/epillon/FSSH/Param/C_4/main_2d.jl:81
unknown function (ip: 0x2aaac4a0dd3f)
_jl_invoke at /buildworker/worker/package_linux64/build/src/gf.c:2141 [inlined]
jl_apply_generic at /buildworker/worker/package_linux64/build/src/gf.c:2305
eval_stmt_value at /buildworker/worker/package_linux64/build/src/interpreter.c:368 [inlined]
eval_body at /buildworker/worker/package_linux64/build/src/interpreter.c:778
eval_stmt_value at /buildworker/worker/package_linux64/build/src/interpreter.c:368 [inlined]
eval_body at /buildworker/worker/package_linux64/build/src/interpreter.c:778
eval_stmt_value at /buildworker/worker/package_linux64/build/src/interpreter.c:368 [inlined]
eval_body at /buildworker/worker/package_linux64/build/src/interpreter.c:778
eval_stmt_value at /buildworker/worker/package_linux64/build/src/interpreter.c:368 [inlined]
eval_body at /buildworker/worker/package_linux64/build/src/interpreter.c:778
jl_interpret_toplevel_thunk at /buildworker/worker/package_linux64/build/src/interpreter.c:897
jl_interpret_toplevel_thunk at /buildworker/worker/package_linux64/build/src/interpreter.c:897
jl_interpret_toplevel_thunk at /buildworker/worker/package_linux64/build/src/interpreter.c:897
eval_stmt_value at /buildworker/worker/package_linux64/build/src/interpreter.c:368 [inlined]
eval_body at /buildworker/worker/package_linux64/build/src/interpreter.c:778
eval_stmt_value at /buildworker/worker/package_linux64/build/src/interpreter.c:368 [inlined]
eval_body at /buildworker/worker/package_linux64/build/src/interpreter.c:778
eval_stmt_value at /buildworker/worker/package_linux64/build/src/interpreter.c:368 [inlined]
eval_body at /buildworker/worker/package_linux64/build/src/interpreter.c:778
eval_stmt_value at /buildworker/worker/package_linux64/build/src/interpreter.c:368 [inlined]
eval_body at /buildworker/worker/package_linux64/build/src/interpreter.c:778
eval_stmt_value at /buildworker/worker/package_linux64/build/src/interpreter.c:368 [inlined]
eval_body at /buildworker/worker/package_linux64/build/src/interpreter.c:778
eval_stmt_value at /buildworker/worker/package_linux64/build/src/interpreter.c:368 [inlined]
eval_body at /buildworker/worker/package_linux64/build/src/interpreter.c:778
jl_interpret_toplevel_thunk at /buildworker/worker/package_linux64/build/src/interpreter.c:897
eval_stmt_value at /buildworker/worker/package_linux64/build/src/interpreter.c:368 [inlined]
eval_body at /buildworker/worker/package_linux64/build/src/interpreter.c:778
eval_stmt_value at /buildworker/worker/package_linux64/build/src/interpreter.c:368 [inlined]
eval_body at /buildworker/worker/package_linux64/build/src/interpreter.c:778
eval_stmt_value at /buildworker/worker/package_linux64/build/src/interpreter.c:368 [inlined]
eval_body at /buildworker/worker/package_linux64/build/src/interpreter.c:778
jl_interpret_toplevel_thunk_callback at /buildworker/worker/package_linux64/build/src/interpreter.c:888
unknown function (ip: 0xfffffffffffffffe)
unknown function (ip: 0x2aaac15c8d0f)
unknown function (ip: 0xffffffffffffffff)
jl_interpret_toplevel_thunk_callback at /buildworker/worker/package_linux64/build/src/interpreter.c:888
unknown function (ip: 0xfffffffffffffffe)
unknown function (ip: 0x2aaac15c8d0f)
unknown function (ip: 0xffffffffffffffff)
jl_interpret_toplevel_thunk_callback at /buildworker/worker/package_linux64/build/src/interpreter.c:888
unknown function (ip: 0xfffffffffffffffe)
unknown function (ip: 0x2aaac15c8d0f)
unknown function (ip: 0xffffffffffffffff)
jl_interpret_toplevel_thunk_callback at /buildworker/worker/package_linux64/build/src/interpreter.c:888
unknown function (ip: 0xfffffffffffffffe)
unknown function (ip: 0x2aaac15c8d0f)
unknown function (ip: 0xffffffffffffffff)
jl_interpret_toplevel_thunk_callback at /buildworker/worker/package_linux64/build/src/interpreter.c:888
unknown function (ip: 0xfffffffffffffffe)
unknown function (ip: 0x2aaac15c8d0f)
unknown function (ip: 0xffffffffffffffff)
jl_interpret_toplevel_thunk_callback at /buildworker/worker/package_linux64/build/src/interpreter.c:888
unknown function (ip: 0xfffffffffffffffe)
unknown function (ip: 0x2aaac15c8d0f)
unknown function (ip: 0xffffffffffffffff)
jl_interpret_toplevel_thunk_callback at /buildworker/worker/package_linux64/build/src/interpreter.c:888
unknown function (ip: 0xfffffffffffffffe)
unknown function (ip: 0x2aaac15c8d0f)
unknown function (ip: 0xffffffffffffffff)
jl_interpret_toplevel_thunk_callback at /buildworker/worker/package_linux64/build/src/interpreter.c:888
unknown function (ip: 0xfffffffffffffffe)
unknown function (ip: 0x2aaac15c8d0f)
unknown function (ip: 0xffffffffffffffff)
jl_interpret_toplevel_thunk_callback at /buildworker/worker/package_linux64/build/src/interpreter.c:888
unknown function (ip: 0xfffffffffffffffe)
unknown function (ip: 0x2aaac15c8d0f)
unknown function (ip: 0xffffffffffffffff)
jl_interpret_toplevel_thunk_callback at /buildworker/worker/package_linux64/build/src/interpreter.c:888
unknown function (ip: 0xfffffffffffffffe)
unknown function (ip: 0x2aaac15c8d0f)
unknown function (ip: 0xffffffffffffffff)
jl_interpret_toplevel_thunk_callback at /buildworker/worker/package_linux64/build/src/interpreter.c:888
unknown function (ip: 0xfffffffffffffffe)
unknown function (ip: 0x2aaac15c8d0f)
unknown function (ip: 0xffffffffffffffff)
jl_interpret_toplevel_thunk_callback at /buildworker/worker/package_linux64/build/src/interpreter.c:888
unknown function (ip: 0xfffffffffffffffe)
unknown function (ip: 0x2aaac15c8d0f)
unknown function (ip: 0xffffffffffffffff)
jl_apply at /buildworker/worker/package_linux64/build/src/julia.h:1631 [inlined]
do_call at /buildworker/worker/package_linux64/build/src/interpreter.c:328
jl_interpret_toplevel_thunk_callback at /buildworker/worker/package_linux64/build/src/interpreter.c:888
unknown function (ip: 0xfffffffffffffffe)
unknown function (ip: 0x2aaac15c8d0f)
unknown function (ip: 0xffffffffffffffff)
jl_interpret_toplevel_thunk at /buildworker/worker/package_linux64/build/src/interpreter.c:897
jl_interpret_toplevel_thunk at /buildworker/worker/package_linux64/build/src/interpreter.c:897
jl_toplevel_eval_flex at /buildworker/worker/package_linux64/build/src/toplevel.c:814
jl_toplevel_eval_flex at /buildworker/worker/package_linux64/build/src/toplevel.c:814
jl_toplevel_eval_flex at /buildworker/worker/package_linux64/build/src/toplevel.c:814
jl_interpret_toplevel_thunk at /buildworker/worker/package_linux64/build/src/interpreter.c:897
jl_interpret_toplevel_thunk at /buildworker/worker/package_linux64/build/src/interpreter.c:897
jl_toplevel_eval_flex at /buildworker/worker/package_linux64/build/src/toplevel.c:814
jl_interpret_toplevel_thunk at /buildworker/worker/package_linux64/build/src/interpreter.c:897
jl_interpret_toplevel_thunk at /buildworker/worker/package_linux64/build/src/interpreter.c:897
jl_interpret_toplevel_thunk at /buildworker/worker/package_linux64/build/src/interpreter.c:897
jl_interpret_toplevel_thunk at /buildworker/worker/package_linux64/build/src/interpreter.c:897
jl_interpret_toplevel_thunk at /buildworker/worker/package_linux64/build/src/interpreter.c:897
jl_interpret_toplevel_thunk at /buildworker/worker/package_linux64/build/src/interpreter.c:897
jl_interpret_toplevel_thunk at /buildworker/worker/package_linux64/build/src/interpreter.c:897
jl_interpret_toplevel_thunk at /buildworker/worker/package_linux64/build/src/interpreter.c:897
eval_value at /buildworker/worker/package_linux64/build/src/interpreter.c:417
jl_interpret_toplevel_thunk at /buildworker/worker/package_linux64/build/src/interpreter.c:897
