\boolfalse {citerequest}\boolfalse {citetracker}\boolfalse {pagetracker}\boolfalse {backtracker}\relax
\babel@toc {english}{}
\defcounter {refsection}{0}\relax
\addvspace {10\p@ }
\defcounter {refsection}{0}\relax
\addvspace {10\p@ }
\defcounter {refsection}{0}\relax
\addvspace {10\p@ }
\defcounter {refsection}{0}\relax
\addvspace {10\p@ }
\defcounter {refsection}{0}\relax
\addvspace {10\p@ }
\defcounter {refsection}{0}\relax
\addvspace {10\p@ }
\defcounter {refsection}{0}\relax
\addvspace {10\p@ }
\defcounter {refsection}{0}\relax
\addvspace {10\p@ }
\defcounter {refsection}{0}\relax
\addvspace {10\p@ }
