┌ Warning: The call to compilecache failed to create a usable precompiled cache file for PlotUtils [995b91a9-d308-5afd-9ec6-746e21dbc043]
│   exception = Required dependency Colors [5ae59095-9a9b-59fe-a467-6f913c188581] failed to load from a cache file.
└ @ Base loading.jl:1036
┌ Warning: The call to compilecache failed to create a usable precompiled cache file for PlotUtils [995b91a9-d308-5afd-9ec6-746e21dbc043]
│   exception = Required dependency Colors [5ae59095-9a9b-59fe-a467-6f913c188581] failed to load from a cache file.
└ @ Base loading.jl:1036
┌ Warning: The call to compilecache failed to create a usable precompiled cache file for PlotUtils [995b91a9-d308-5afd-9ec6-746e21dbc043]
│   exception = Required dependency Colors [5ae59095-9a9b-59fe-a467-6f913c188581] failed to load from a cache file.
└ @ Base loading.jl:1036
┌ Warning: The call to compilecache failed to create a usable precompiled cache file for PlotUtils [995b91a9-d308-5afd-9ec6-746e21dbc043]
│   exception = Required dependency Colors [5ae59095-9a9b-59fe-a467-6f913c188581] failed to load from a cache file.
└ @ Base loading.jl:1036
┌ Warning: The call to compilecache failed to create a usable precompiled cache file for PlotUtils [995b91a9-d308-5afd-9ec6-746e21dbc043]
│   exception = Required dependency Colors [5ae59095-9a9b-59fe-a467-6f913c188581] failed to load from a cache file.
└ @ Base loading.jl:1036
┌ Warning: The call to compilecache failed to create a usable precompiled cache file for PlotUtils [995b91a9-d308-5afd-9ec6-746e21dbc043]
│   exception = Required dependency Colors [5ae59095-9a9b-59fe-a467-6f913c188581] failed to load from a cache file.
└ @ Base loading.jl:1036
┌ Warning: The call to compilecache failed to create a usable precompiled cache file for PlotUtils [995b91a9-d308-5afd-9ec6-746e21dbc043]
│   exception = Required dependency Colors [5ae59095-9a9b-59fe-a467-6f913c188581] failed to load from a cache file.
└ @ Base loading.jl:1036
┌ Warning: The call to compilecache failed to create a usable precompiled cache file for PlotUtils [995b91a9-d308-5afd-9ec6-746e21dbc043]
│   exception = Required dependency Colors [5ae59095-9a9b-59fe-a467-6f913c188581] failed to load from a cache file.
└ @ Base loading.jl:1036
┌ Warning: The call to compilecache failed to create a usable precompiled cache file for PlotUtils [995b91a9-d308-5afd-9ec6-746e21dbc043]
│   exception = Required dependency Colors [5ae59095-9a9b-59fe-a467-6f913c188581] failed to load from a cache file.
└ @ Base loading.jl:1036
┌ Warning: The call to compilecache failed to create a usable precompiled cache file for PlotUtils [995b91a9-d308-5afd-9ec6-746e21dbc043]
│   exception = Required dependency Colors [5ae59095-9a9b-59fe-a467-6f913c188581] failed to load from a cache file.
└ @ Base loading.jl:1036
┌ Warning: The call to compilecache failed to create a usable precompiled cache file for PlotUtils [995b91a9-d308-5afd-9ec6-746e21dbc043]
│   exception = Required dependency Colors [5ae59095-9a9b-59fe-a467-6f913c188581] failed to load from a cache file.
└ @ Base loading.jl:1036
┌ Warning: The call to compilecache failed to create a usable precompiled cache file for PlotUtils [995b91a9-d308-5afd-9ec6-746e21dbc043]
│   exception = Required dependency Colors [5ae59095-9a9b-59fe-a467-6f913c188581] failed to load from a cache file.
└ @ Base loading.jl:1036
┌ Warning: The call to compilecache failed to create a usable precompiled cache file for PlotUtils [995b91a9-d308-5afd-9ec6-746e21dbc043]
│   exception = Required dependency Colors [5ae59095-9a9b-59fe-a467-6f913c188581] failed to load from a cache file.
└ @ Base loading.jl:1036
┌ Warning: The call to compilecache failed to create a usable precompiled cache file for PlotUtils [995b91a9-d308-5afd-9ec6-746e21dbc043]
│   exception = Required dependency Colors [5ae59095-9a9b-59fe-a467-6f913c188581] failed to load from a cache file.
└ @ Base loading.jl:1036
┌ Warning: The call to compilecache failed to create a usable precompiled cache file for PlotUtils [995b91a9-d308-5afd-9ec6-746e21dbc043]
│   exception = Required dependency Colors [5ae59095-9a9b-59fe-a467-6f913c188581] failed to load from a cache file.
└ @ Base loading.jl:1036
┌ Warning: The call to compilecache failed to create a usable precompiled cache file for PlotUtils [995b91a9-d308-5afd-9ec6-746e21dbc043]
│   exception = Required dependency Colors [5ae59095-9a9b-59fe-a467-6f913c188581] failed to load from a cache file.
└ @ Base loading.jl:1036
┌ Warning: The call to compilecache failed to create a usable precompiled cache file for PlotUtils [995b91a9-d308-5afd-9ec6-746e21dbc043]
│   exception = Required dependency Colors [5ae59095-9a9b-59fe-a467-6f913c188581] failed to load from a cache file.
└ @ Base loading.jl:1036
┌ Warning: The call to compilecache failed to create a usable precompiled cache file for PlotUtils [995b91a9-d308-5afd-9ec6-746e21dbc043]
│   exception = Required dependency Colors [5ae59095-9a9b-59fe-a467-6f913c188581] failed to load from a cache file.
└ @ Base loading.jl:1036
┌ Warning: The call to compilecache failed to create a usable precompiled cache file for PlotUtils [995b91a9-d308-5afd-9ec6-746e21dbc043]
│   exception = Required dependency Colors [5ae59095-9a9b-59fe-a467-6f913c188581] failed to load from a cache file.
└ @ Base loading.jl:1036
┌ Warning: The call to compilecache failed to create a usable precompiled cache file for PlotUtils [995b91a9-d308-5afd-9ec6-746e21dbc043]
│   exception = Required dependency Colors [5ae59095-9a9b-59fe-a467-6f913c188581] failed to load from a cache file.
└ @ Base loading.jl:1036
┌ Warning: The call to compilecache failed to create a usable precompiled cache file for PlotUtils [995b91a9-d308-5afd-9ec6-746e21dbc043]
│   exception = Required dependency Colors [5ae59095-9a9b-59fe-a467-6f913c188581] failed to load from a cache file.
└ @ Base loading.jl:1036
┌ Warning: The call to compilecache failed to create a usable precompiled cache file for PlotUtils [995b91a9-d308-5afd-9ec6-746e21dbc043]
│   exception = Required dependency Colors [5ae59095-9a9b-59fe-a467-6f913c188581] failed to load from a cache file.
└ @ Base loading.jl:1036
┌ Warning: The call to compilecache failed to create a usable precompiled cache file for PlotUtils [995b91a9-d308-5afd-9ec6-746e21dbc043]
│   exception = Required dependency Colors [5ae59095-9a9b-59fe-a467-6f913c188581] failed to load from a cache file.
└ @ Base loading.jl:1036
┌ Warning: The call to compilecache failed to create a usable precompiled cache file for PlotUtils [995b91a9-d308-5afd-9ec6-746e21dbc043]
│   exception = Required dependency Colors [5ae59095-9a9b-59fe-a467-6f913c188581] failed to load from a cache file.
└ @ Base loading.jl:1036
┌ Warning: The call to compilecache failed to create a usable precompiled cache file for PlotUtils [995b91a9-d308-5afd-9ec6-746e21dbc043]
│   exception = Required dependency Colors [5ae59095-9a9b-59fe-a467-6f913c188581] failed to load from a cache file.
└ @ Base loading.jl:1036
┌ Warning: The call to compilecache failed to create a usable precompiled cache file for PlotUtils [995b91a9-d308-5afd-9ec6-746e21dbc043]
│   exception = Required dependency Colors [5ae59095-9a9b-59fe-a467-6f913c188581] failed to load from a cache file.
└ @ Base loading.jl:1036
┌ Warning: The call to compilecache failed to create a usable precompiled cache file for PlotUtils [995b91a9-d308-5afd-9ec6-746e21dbc043]
│   exception = Required dependency Colors [5ae59095-9a9b-59fe-a467-6f913c188581] failed to load from a cache file.
└ @ Base loading.jl:1036
┌ Warning: The call to compilecache failed to create a usable precompiled cache file for PlotUtils [995b91a9-d308-5afd-9ec6-746e21dbc043]
│   exception = Required dependency Colors [5ae59095-9a9b-59fe-a467-6f913c188581] failed to load from a cache file.
└ @ Base loading.jl:1036
┌ Warning: Module PlotUtils with build ID 7899676786217122 is missing from the cache.
│ This may mean PlotUtils [995b91a9-d308-5afd-9ec6-746e21dbc043] does not support precompilation but is imported by a module that does.
└ @ Base loading.jl:1011
┌ Warning: Module PlotUtils with build ID 7899676859273443 is missing from the cache.
│ This may mean PlotUtils [995b91a9-d308-5afd-9ec6-746e21dbc043] does not support precompilation but is imported by a module that does.
└ @ Base loading.jl:1011
┌ Warning: Module PlotUtils with build ID 7899676740218294 is missing from the cache.
│ This may mean PlotUtils [995b91a9-d308-5afd-9ec6-746e21dbc043] does not support precompilation but is imported by a module that does.
└ @ Base loading.jl:1011
┌ Warning: Module PlotUtils with build ID 7899676805549738 is missing from the cache.
│ This may mean PlotUtils [995b91a9-d308-5afd-9ec6-746e21dbc043] does not support precompilation but is imported by a module that does.
└ @ Base loading.jl:1011
┌ Warning: Module PlotUtils with build ID 7899676739932166 is missing from the cache.
│ This may mean PlotUtils [995b91a9-d308-5afd-9ec6-746e21dbc043] does not support precompilation but is imported by a module that does.
└ @ Base loading.jl:1011
┌ Warning: Module PlotUtils with build ID 7899676763174504 is missing from the cache.
│ This may mean PlotUtils [995b91a9-d308-5afd-9ec6-746e21dbc043] does not support precompilation but is imported by a module that does.
└ @ Base loading.jl:1011
┌ Warning: Module PlotUtils with build ID 7899676813462272 is missing from the cache.
│ This may mean PlotUtils [995b91a9-d308-5afd-9ec6-746e21dbc043] does not support precompilation but is imported by a module that does.
└ @ Base loading.jl:1011
┌ Warning: Module PlotUtils with build ID 7899676762560016 is missing from the cache.
│ This may mean PlotUtils [995b91a9-d308-5afd-9ec6-746e21dbc043] does not support precompilation but is imported by a module that does.
└ @ Base loading.jl:1011
┌ Warning: Module PlotUtils with build ID 7899676824769819 is missing from the cache.
│ This may mean PlotUtils [995b91a9-d308-5afd-9ec6-746e21dbc043] does not support precompilation but is imported by a module that does.
└ @ Base loading.jl:1011
┌ Warning: Module PlotUtils with build ID 7899677017556376 is missing from the cache.
│ This may mean PlotUtils [995b91a9-d308-5afd-9ec6-746e21dbc043] does not support precompilation but is imported by a module that does.
└ @ Base loading.jl:1011
┌ Warning: Module PlotUtils with build ID 7899676906677719 is missing from the cache.
│ This may mean PlotUtils [995b91a9-d308-5afd-9ec6-746e21dbc043] does not support precompilation but is imported by a module that does.
└ @ Base loading.jl:1011
┌ Warning: Module PlotUtils with build ID 7899676777767619 is missing from the cache.
│ This may mean PlotUtils [995b91a9-d308-5afd-9ec6-746e21dbc043] does not support precompilation but is imported by a module that does.
└ @ Base loading.jl:1011
┌ Warning: Module PlotUtils with build ID 7899676898711791 is missing from the cache.
│ This may mean PlotUtils [995b91a9-d308-5afd-9ec6-746e21dbc043] does not support precompilation but is imported by a module that does.
└ @ Base loading.jl:1011
┌ Warning: Module PlotUtils with build ID 7899677139586340 is missing from the cache.
│ This may mean PlotUtils [995b91a9-d308-5afd-9ec6-746e21dbc043] does not support precompilation but is imported by a module that does.
└ @ Base loading.jl:1011
┌ Warning: Module PlotUtils with build ID 7899677264814560 is missing from the cache.
│ This may mean PlotUtils [995b91a9-d308-5afd-9ec6-746e21dbc043] does not support precompilation but is imported by a module that does.
└ @ Base loading.jl:1011
┌ Warning: Module PlotUtils with build ID 7899677125197413 is missing from the cache.
│ This may mean PlotUtils [995b91a9-d308-5afd-9ec6-746e21dbc043] does not support precompilation but is imported by a module that does.
└ @ Base loading.jl:1011
┌ Warning: Module PlotUtils with build ID 7899677418928490 is missing from the cache.
│ This may mean PlotUtils [995b91a9-d308-5afd-9ec6-746e21dbc043] does not support precompilation but is imported by a module that does.
└ @ Base loading.jl:1011
┌ Warning: Module PlotUtils with build ID 7899677237918669 is missing from the cache.
│ This may mean PlotUtils [995b91a9-d308-5afd-9ec6-746e21dbc043] does not support precompilation but is imported by a module that does.
└ @ Base loading.jl:1011
┌ Warning: Module PlotUtils with build ID 7899677355902995 is missing from the cache.
│ This may mean PlotUtils [995b91a9-d308-5afd-9ec6-746e21dbc043] does not support precompilation but is imported by a module that does.
└ @ Base loading.jl:1011
┌ Warning: Module PlotUtils with build ID 7899677169315982 is missing from the cache.
│ This may mean PlotUtils [995b91a9-d308-5afd-9ec6-746e21dbc043] does not support precompilation but is imported by a module that does.
└ @ Base loading.jl:1011
┌ Warning: Module PlotUtils with build ID 7899677343622108 is missing from the cache.
│ This may mean PlotUtils [995b91a9-d308-5afd-9ec6-746e21dbc043] does not support precompilation but is imported by a module that does.
└ @ Base loading.jl:1011
┌ Warning: Module PlotUtils with build ID 7899677403857648 is missing from the cache.
│ This may mean PlotUtils [995b91a9-d308-5afd-9ec6-746e21dbc043] does not support precompilation but is imported by a module that does.
└ @ Base loading.jl:1011
┌ Warning: Module PlotUtils with build ID 7899677408096251 is missing from the cache.
│ This may mean PlotUtils [995b91a9-d308-5afd-9ec6-746e21dbc043] does not support precompilation but is imported by a module that does.
└ @ Base loading.jl:1011
┌ Warning: Module PlotUtils with build ID 7899677585343632 is missing from the cache.
│ This may mean PlotUtils [995b91a9-d308-5afd-9ec6-746e21dbc043] does not support precompilation but is imported by a module that does.
└ @ Base loading.jl:1011
┌ Warning: Module PlotUtils with build ID 7899677565071448 is missing from the cache.
│ This may mean PlotUtils [995b91a9-d308-5afd-9ec6-746e21dbc043] does not support precompilation but is imported by a module that does.
└ @ Base loading.jl:1011
┌ Warning: Module PlotUtils with build ID 7899677942588338 is missing from the cache.
│ This may mean PlotUtils [995b91a9-d308-5afd-9ec6-746e21dbc043] does not support precompilation but is imported by a module that does.
└ @ Base loading.jl:1011
┌ Warning: Module PlotUtils with build ID 7899677547125946 is missing from the cache.
│ This may mean PlotUtils [995b91a9-d308-5afd-9ec6-746e21dbc043] does not support precompilation but is imported by a module that does.
└ @ Base loading.jl:1011
┌ Warning: Module PlotUtils with build ID 7899677960867885 is missing from the cache.
│ This may mean PlotUtils [995b91a9-d308-5afd-9ec6-746e21dbc043] does not support precompilation but is imported by a module that does.
└ @ Base loading.jl:1011
┌ Warning: Module PlotUtils with build ID 7899676859273443 is missing from the cache.
│ This may mean PlotUtils [995b91a9-d308-5afd-9ec6-746e21dbc043] does not support precompilation but is imported by a module that does.
└ @ Base loading.jl:1011
┌ Warning: Module PlotUtils with build ID 7899676740218294 is missing from the cache.
│ This may mean PlotUtils [995b91a9-d308-5afd-9ec6-746e21dbc043] does not support precompilation but is imported by a module that does.
└ @ Base loading.jl:1011
┌ Warning: Module PlotUtils with build ID 7899676786217122 is missing from the cache.
│ This may mean PlotUtils [995b91a9-d308-5afd-9ec6-746e21dbc043] does not support precompilation but is imported by a module that does.
└ @ Base loading.jl:1011
┌ Warning: Module PlotUtils with build ID 7899677017556376 is missing from the cache.
│ This may mean PlotUtils [995b91a9-d308-5afd-9ec6-746e21dbc043] does not support precompilation but is imported by a module that does.
└ @ Base loading.jl:1011
┌ Warning: Module PlotUtils with build ID 7899676763174504 is missing from the cache.
│ This may mean PlotUtils [995b91a9-d308-5afd-9ec6-746e21dbc043] does not support precompilation but is imported by a module that does.
└ @ Base loading.jl:1011
┌ Warning: Module PlotUtils with build ID 7899676762560016 is missing from the cache.
│ This may mean PlotUtils [995b91a9-d308-5afd-9ec6-746e21dbc043] does not support precompilation but is imported by a module that does.
└ @ Base loading.jl:1011
┌ Warning: Module PlotUtils with build ID 7899676805549738 is missing from the cache.
│ This may mean PlotUtils [995b91a9-d308-5afd-9ec6-746e21dbc043] does not support precompilation but is imported by a module that does.
└ @ Base loading.jl:1011
┌ Warning: Module PlotUtils with build ID 7899676906677719 is missing from the cache.
│ This may mean PlotUtils [995b91a9-d308-5afd-9ec6-746e21dbc043] does not support precompilation but is imported by a module that does.
└ @ Base loading.jl:1011
┌ Warning: Module PlotUtils with build ID 7899676739932166 is missing from the cache.
│ This may mean PlotUtils [995b91a9-d308-5afd-9ec6-746e21dbc043] does not support precompilation but is imported by a module that does.
└ @ Base loading.jl:1011
┌ Warning: Module PlotUtils with build ID 7899676777767619 is missing from the cache.
│ This may mean PlotUtils [995b91a9-d308-5afd-9ec6-746e21dbc043] does not support precompilation but is imported by a module that does.
└ @ Base loading.jl:1011
┌ Warning: Module PlotUtils with build ID 7899676824769819 is missing from the cache.
│ This may mean PlotUtils [995b91a9-d308-5afd-9ec6-746e21dbc043] does not support precompilation but is imported by a module that does.
└ @ Base loading.jl:1011
┌ Warning: Module PlotUtils with build ID 7899677139586340 is missing from the cache.
│ This may mean PlotUtils [995b91a9-d308-5afd-9ec6-746e21dbc043] does not support precompilation but is imported by a module that does.
└ @ Base loading.jl:1011
┌ Warning: Module PlotUtils with build ID 7899677418928490 is missing from the cache.
│ This may mean PlotUtils [995b91a9-d308-5afd-9ec6-746e21dbc043] does not support precompilation but is imported by a module that does.
└ @ Base loading.jl:1011
┌ Warning: Module PlotUtils with build ID 7899676898711791 is missing from the cache.
│ This may mean PlotUtils [995b91a9-d308-5afd-9ec6-746e21dbc043] does not support precompilation but is imported by a module that does.
└ @ Base loading.jl:1011
┌ Warning: Module PlotUtils with build ID 7899677237918669 is missing from the cache.
│ This may mean PlotUtils [995b91a9-d308-5afd-9ec6-746e21dbc043] does not support precompilation but is imported by a module that does.
└ @ Base loading.jl:1011
┌ Warning: Module PlotUtils with build ID 7899676813462272 is missing from the cache.
│ This may mean PlotUtils [995b91a9-d308-5afd-9ec6-746e21dbc043] does not support precompilation but is imported by a module that does.
└ @ Base loading.jl:1011
┌ Warning: Module PlotUtils with build ID 7899677125197413 is missing from the cache.
│ This may mean PlotUtils [995b91a9-d308-5afd-9ec6-746e21dbc043] does not support precompilation but is imported by a module that does.
└ @ Base loading.jl:1011
┌ Warning: Module PlotUtils with build ID 7899677264814560 is missing from the cache.
│ This may mean PlotUtils [995b91a9-d308-5afd-9ec6-746e21dbc043] does not support precompilation but is imported by a module that does.
└ @ Base loading.jl:1011
┌ Warning: Module PlotUtils with build ID 7899677169315982 is missing from the cache.
│ This may mean PlotUtils [995b91a9-d308-5afd-9ec6-746e21dbc043] does not support precompilation but is imported by a module that does.
└ @ Base loading.jl:1011
┌ Warning: Module PlotUtils with build ID 7899677403857648 is missing from the cache.
│ This may mean PlotUtils [995b91a9-d308-5afd-9ec6-746e21dbc043] does not support precompilation but is imported by a module that does.
└ @ Base loading.jl:1011
┌ Warning: Module PlotUtils with build ID 7899677355902995 is missing from the cache.
│ This may mean PlotUtils [995b91a9-d308-5afd-9ec6-746e21dbc043] does not support precompilation but is imported by a module that does.
└ @ Base loading.jl:1011
┌ Warning: Module PlotUtils with build ID 7899677565071448 is missing from the cache.
│ This may mean PlotUtils [995b91a9-d308-5afd-9ec6-746e21dbc043] does not support precompilation but is imported by a module that does.
└ @ Base loading.jl:1011
┌ Warning: Module PlotUtils with build ID 7899677343622108 is missing from the cache.
│ This may mean PlotUtils [995b91a9-d308-5afd-9ec6-746e21dbc043] does not support precompilation but is imported by a module that does.
└ @ Base loading.jl:1011
┌ Warning: Module PlotUtils with build ID 7899677585343632 is missing from the cache.
│ This may mean PlotUtils [995b91a9-d308-5afd-9ec6-746e21dbc043] does not support precompilation but is imported by a module that does.
└ @ Base loading.jl:1011
┌ Warning: Module PlotUtils with build ID 7899677408096251 is missing from the cache.
│ This may mean PlotUtils [995b91a9-d308-5afd-9ec6-746e21dbc043] does not support precompilation but is imported by a module that does.
└ @ Base loading.jl:1011
┌ Warning: Module PlotUtils with build ID 7899677942588338 is missing from the cache.
│ This may mean PlotUtils [995b91a9-d308-5afd-9ec6-746e21dbc043] does not support precompilation but is imported by a module that does.
└ @ Base loading.jl:1011
┌ Warning: Module PlotUtils with build ID 7899677547125946 is missing from the cache.
│ This may mean PlotUtils [995b91a9-d308-5afd-9ec6-746e21dbc043] does not support precompilation but is imported by a module that does.
└ @ Base loading.jl:1011
┌ Warning: Module PlotUtils with build ID 7899677960867885 is missing from the cache.
│ This may mean PlotUtils [995b91a9-d308-5afd-9ec6-746e21dbc043] does not support precompilation but is imported by a module that does.
└ @ Base loading.jl:1011
┌ Warning: The call to compilecache failed to create a usable precompiled cache file for Plots [91a5bcdd-55d7-5caf-9e0b-520d859cae80]
│   exception = Required dependency Colors [5ae59095-9a9b-59fe-a467-6f913c188581] failed to load from a cache file.
└ @ Base loading.jl:1036
┌ Warning: The call to compilecache failed to create a usable precompiled cache file for Plots [91a5bcdd-55d7-5caf-9e0b-520d859cae80]
│   exception = Required dependency Colors [5ae59095-9a9b-59fe-a467-6f913c188581] failed to load from a cache file.
└ @ Base loading.jl:1036
┌ Warning: The call to compilecache failed to create a usable precompiled cache file for Plots [91a5bcdd-55d7-5caf-9e0b-520d859cae80]
│   exception = Required dependency Colors [5ae59095-9a9b-59fe-a467-6f913c188581] failed to load from a cache file.
└ @ Base loading.jl:1036
┌ Warning: The call to compilecache failed to create a usable precompiled cache file for Plots [91a5bcdd-55d7-5caf-9e0b-520d859cae80]
│   exception = Required dependency Colors [5ae59095-9a9b-59fe-a467-6f913c188581] failed to load from a cache file.
└ @ Base loading.jl:1036
┌ Warning: The call to compilecache failed to create a usable precompiled cache file for Plots [91a5bcdd-55d7-5caf-9e0b-520d859cae80]
│   exception = Required dependency Colors [5ae59095-9a9b-59fe-a467-6f913c188581] failed to load from a cache file.
└ @ Base loading.jl:1036
┌ Warning: The call to compilecache failed to create a usable precompiled cache file for Plots [91a5bcdd-55d7-5caf-9e0b-520d859cae80]
│   exception = Required dependency Colors [5ae59095-9a9b-59fe-a467-6f913c188581] failed to load from a cache file.
└ @ Base loading.jl:1036
┌ Warning: The call to compilecache failed to create a usable precompiled cache file for Plots [91a5bcdd-55d7-5caf-9e0b-520d859cae80]
│   exception = Required dependency Colors [5ae59095-9a9b-59fe-a467-6f913c188581] failed to load from a cache file.
└ @ Base loading.jl:1036
┌ Warning: The call to compilecache failed to create a usable precompiled cache file for Plots [91a5bcdd-55d7-5caf-9e0b-520d859cae80]
│   exception = Required dependency Colors [5ae59095-9a9b-59fe-a467-6f913c188581] failed to load from a cache file.
└ @ Base loading.jl:1036
┌ Warning: The call to compilecache failed to create a usable precompiled cache file for Plots [91a5bcdd-55d7-5caf-9e0b-520d859cae80]
│   exception = Required dependency Colors [5ae59095-9a9b-59fe-a467-6f913c188581] failed to load from a cache file.
└ @ Base loading.jl:1036
┌ Warning: The call to compilecache failed to create a usable precompiled cache file for Plots [91a5bcdd-55d7-5caf-9e0b-520d859cae80]
│   exception = Required dependency Colors [5ae59095-9a9b-59fe-a467-6f913c188581] failed to load from a cache file.
└ @ Base loading.jl:1036
┌ Warning: The call to compilecache failed to create a usable precompiled cache file for Plots [91a5bcdd-55d7-5caf-9e0b-520d859cae80]
│   exception = Required dependency Colors [5ae59095-9a9b-59fe-a467-6f913c188581] failed to load from a cache file.
└ @ Base loading.jl:1036
┌ Warning: The call to compilecache failed to create a usable precompiled cache file for Plots [91a5bcdd-55d7-5caf-9e0b-520d859cae80]
│   exception = Required dependency Colors [5ae59095-9a9b-59fe-a467-6f913c188581] failed to load from a cache file.
└ @ Base loading.jl:1036
┌ Warning: The call to compilecache failed to create a usable precompiled cache file for Plots [91a5bcdd-55d7-5caf-9e0b-520d859cae80]
│   exception = Required dependency Colors [5ae59095-9a9b-59fe-a467-6f913c188581] failed to load from a cache file.
└ @ Base loading.jl:1036
┌ Warning: The call to compilecache failed to create a usable precompiled cache file for Plots [91a5bcdd-55d7-5caf-9e0b-520d859cae80]
│   exception = Required dependency Colors [5ae59095-9a9b-59fe-a467-6f913c188581] failed to load from a cache file.
└ @ Base loading.jl:1036
┌ Warning: The call to compilecache failed to create a usable precompiled cache file for Plots [91a5bcdd-55d7-5caf-9e0b-520d859cae80]
│   exception = Required dependency Colors [5ae59095-9a9b-59fe-a467-6f913c188581] failed to load from a cache file.
└ @ Base loading.jl:1036
┌ Warning: The call to compilecache failed to create a usable precompiled cache file for Plots [91a5bcdd-55d7-5caf-9e0b-520d859cae80]
│   exception = Required dependency Colors [5ae59095-9a9b-59fe-a467-6f913c188581] failed to load from a cache file.
└ @ Base loading.jl:1036
┌ Warning: The call to compilecache failed to create a usable precompiled cache file for Plots [91a5bcdd-55d7-5caf-9e0b-520d859cae80]
│   exception = Required dependency Colors [5ae59095-9a9b-59fe-a467-6f913c188581] failed to load from a cache file.
└ @ Base loading.jl:1036
┌ Warning: The call to compilecache failed to create a usable precompiled cache file for Plots [91a5bcdd-55d7-5caf-9e0b-520d859cae80]
│   exception = Required dependency Colors [5ae59095-9a9b-59fe-a467-6f913c188581] failed to load from a cache file.
└ @ Base loading.jl:1036
┌ Warning: The call to compilecache failed to create a usable precompiled cache file for Plots [91a5bcdd-55d7-5caf-9e0b-520d859cae80]
│   exception = Required dependency Colors [5ae59095-9a9b-59fe-a467-6f913c188581] failed to load from a cache file.
└ @ Base loading.jl:1036
┌ Warning: The call to compilecache failed to create a usable precompiled cache file for Plots [91a5bcdd-55d7-5caf-9e0b-520d859cae80]
│   exception = Required dependency Colors [5ae59095-9a9b-59fe-a467-6f913c188581] failed to load from a cache file.
└ @ Base loading.jl:1036
┌ Warning: The call to compilecache failed to create a usable precompiled cache file for Plots [91a5bcdd-55d7-5caf-9e0b-520d859cae80]
│   exception = Required dependency Colors [5ae59095-9a9b-59fe-a467-6f913c188581] failed to load from a cache file.
└ @ Base loading.jl:1036
┌ Warning: The call to compilecache failed to create a usable precompiled cache file for Plots [91a5bcdd-55d7-5caf-9e0b-520d859cae80]
│   exception = Required dependency Colors [5ae59095-9a9b-59fe-a467-6f913c188581] failed to load from a cache file.
└ @ Base loading.jl:1036
┌ Warning: The call to compilecache failed to create a usable precompiled cache file for Plots [91a5bcdd-55d7-5caf-9e0b-520d859cae80]
│   exception = Required dependency Colors [5ae59095-9a9b-59fe-a467-6f913c188581] failed to load from a cache file.
└ @ Base loading.jl:1036
┌ Warning: The call to compilecache failed to create a usable precompiled cache file for Plots [91a5bcdd-55d7-5caf-9e0b-520d859cae80]
│   exception = Required dependency Colors [5ae59095-9a9b-59fe-a467-6f913c188581] failed to load from a cache file.
└ @ Base loading.jl:1036
┌ Warning: The call to compilecache failed to create a usable precompiled cache file for Plots [91a5bcdd-55d7-5caf-9e0b-520d859cae80]
│   exception = Required dependency Colors [5ae59095-9a9b-59fe-a467-6f913c188581] failed to load from a cache file.
└ @ Base loading.jl:1036
┌ Warning: The call to compilecache failed to create a usable precompiled cache file for Plots [91a5bcdd-55d7-5caf-9e0b-520d859cae80]
│   exception = Required dependency Colors [5ae59095-9a9b-59fe-a467-6f913c188581] failed to load from a cache file.
└ @ Base loading.jl:1036
┌ Warning: The call to compilecache failed to create a usable precompiled cache file for Plots [91a5bcdd-55d7-5caf-9e0b-520d859cae80]
│   exception = Required dependency Colors [5ae59095-9a9b-59fe-a467-6f913c188581] failed to load from a cache file.
└ @ Base loading.jl:1036
┌ Warning: The call to compilecache failed to create a usable precompiled cache file for Plots [91a5bcdd-55d7-5caf-9e0b-520d859cae80]
│   exception = Required dependency Colors [5ae59095-9a9b-59fe-a467-6f913c188581] failed to load from a cache file.
└ @ Base loading.jl:1036
┌ Warning: The call to compilecache failed to create a usable precompiled cache file for PlotUtils [995b91a9-d308-5afd-9ec6-746e21dbc043]
│   exception = Required dependency Colors [5ae59095-9a9b-59fe-a467-6f913c188581] failed to load from a cache file.
└ @ Base loading.jl:1036
┌ Warning: The call to compilecache failed to create a usable precompiled cache file for PlotUtils [995b91a9-d308-5afd-9ec6-746e21dbc043]
│   exception = Required dependency Colors [5ae59095-9a9b-59fe-a467-6f913c188581] failed to load from a cache file.
└ @ Base loading.jl:1036
┌ Warning: The call to compilecache failed to create a usable precompiled cache file for PlotUtils [995b91a9-d308-5afd-9ec6-746e21dbc043]
│   exception = Required dependency Colors [5ae59095-9a9b-59fe-a467-6f913c188581] failed to load from a cache file.
└ @ Base loading.jl:1036
┌ Warning: The call to compilecache failed to create a usable precompiled cache file for PlotUtils [995b91a9-d308-5afd-9ec6-746e21dbc043]
│   exception = Required dependency Colors [5ae59095-9a9b-59fe-a467-6f913c188581] failed to load from a cache file.
└ @ Base loading.jl:1036
┌ Warning: The call to compilecache failed to create a usable precompiled cache file for PlotUtils [995b91a9-d308-5afd-9ec6-746e21dbc043]
│   exception = Required dependency Colors [5ae59095-9a9b-59fe-a467-6f913c188581] failed to load from a cache file.
└ @ Base loading.jl:1036
┌ Warning: The call to compilecache failed to create a usable precompiled cache file for PlotUtils [995b91a9-d308-5afd-9ec6-746e21dbc043]
│   exception = Required dependency Colors [5ae59095-9a9b-59fe-a467-6f913c188581] failed to load from a cache file.
└ @ Base loading.jl:1036
┌ Warning: The call to compilecache failed to create a usable precompiled cache file for PlotUtils [995b91a9-d308-5afd-9ec6-746e21dbc043]
│   exception = Required dependency Colors [5ae59095-9a9b-59fe-a467-6f913c188581] failed to load from a cache file.
└ @ Base loading.jl:1036
┌ Warning: The call to compilecache failed to create a usable precompiled cache file for PlotUtils [995b91a9-d308-5afd-9ec6-746e21dbc043]
│   exception = Required dependency Colors [5ae59095-9a9b-59fe-a467-6f913c188581] failed to load from a cache file.
└ @ Base loading.jl:1036
┌ Warning: The call to compilecache failed to create a usable precompiled cache file for PlotUtils [995b91a9-d308-5afd-9ec6-746e21dbc043]
│   exception = Required dependency Colors [5ae59095-9a9b-59fe-a467-6f913c188581] failed to load from a cache file.
└ @ Base loading.jl:1036
┌ Warning: The call to compilecache failed to create a usable precompiled cache file for PlotUtils [995b91a9-d308-5afd-9ec6-746e21dbc043]
│   exception = Required dependency Colors [5ae59095-9a9b-59fe-a467-6f913c188581] failed to load from a cache file.
└ @ Base loading.jl:1036
┌ Warning: The call to compilecache failed to create a usable precompiled cache file for PlotUtils [995b91a9-d308-5afd-9ec6-746e21dbc043]
│   exception = Required dependency Colors [5ae59095-9a9b-59fe-a467-6f913c188581] failed to load from a cache file.
└ @ Base loading.jl:1036
┌ Warning: The call to compilecache failed to create a usable precompiled cache file for PlotUtils [995b91a9-d308-5afd-9ec6-746e21dbc043]
│   exception = Required dependency Colors [5ae59095-9a9b-59fe-a467-6f913c188581] failed to load from a cache file.
└ @ Base loading.jl:1036
┌ Warning: The call to compilecache failed to create a usable precompiled cache file for PlotUtils [995b91a9-d308-5afd-9ec6-746e21dbc043]
│   exception = Required dependency Colors [5ae59095-9a9b-59fe-a467-6f913c188581] failed to load from a cache file.
└ @ Base loading.jl:1036
┌ Warning: The call to compilecache failed to create a usable precompiled cache file for PlotUtils [995b91a9-d308-5afd-9ec6-746e21dbc043]
│   exception = Required dependency Colors [5ae59095-9a9b-59fe-a467-6f913c188581] failed to load from a cache file.
└ @ Base loading.jl:1036
┌ Warning: The call to compilecache failed to create a usable precompiled cache file for PlotUtils [995b91a9-d308-5afd-9ec6-746e21dbc043]
│   exception = Required dependency Colors [5ae59095-9a9b-59fe-a467-6f913c188581] failed to load from a cache file.
└ @ Base loading.jl:1036
┌ Warning: The call to compilecache failed to create a usable precompiled cache file for PlotUtils [995b91a9-d308-5afd-9ec6-746e21dbc043]
│   exception = Required dependency Colors [5ae59095-9a9b-59fe-a467-6f913c188581] failed to load from a cache file.
└ @ Base loading.jl:1036
┌ Warning: The call to compilecache failed to create a usable precompiled cache file for PlotUtils [995b91a9-d308-5afd-9ec6-746e21dbc043]
│   exception = Required dependency Colors [5ae59095-9a9b-59fe-a467-6f913c188581] failed to load from a cache file.
└ @ Base loading.jl:1036
┌ Warning: The call to compilecache failed to create a usable precompiled cache file for PlotUtils [995b91a9-d308-5afd-9ec6-746e21dbc043]
│   exception = Required dependency Colors [5ae59095-9a9b-59fe-a467-6f913c188581] failed to load from a cache file.
└ @ Base loading.jl:1036
┌ Warning: The call to compilecache failed to create a usable precompiled cache file for PlotUtils [995b91a9-d308-5afd-9ec6-746e21dbc043]
│   exception = Required dependency Colors [5ae59095-9a9b-59fe-a467-6f913c188581] failed to load from a cache file.
└ @ Base loading.jl:1036
┌ Warning: The call to compilecache failed to create a usable precompiled cache file for PlotUtils [995b91a9-d308-5afd-9ec6-746e21dbc043]
│   exception = Required dependency Colors [5ae59095-9a9b-59fe-a467-6f913c188581] failed to load from a cache file.
└ @ Base loading.jl:1036
┌ Warning: The call to compilecache failed to create a usable precompiled cache file for PlotUtils [995b91a9-d308-5afd-9ec6-746e21dbc043]
│   exception = Required dependency Colors [5ae59095-9a9b-59fe-a467-6f913c188581] failed to load from a cache file.
└ @ Base loading.jl:1036
┌ Warning: The call to compilecache failed to create a usable precompiled cache file for PlotUtils [995b91a9-d308-5afd-9ec6-746e21dbc043]
│   exception = Required dependency Colors [5ae59095-9a9b-59fe-a467-6f913c188581] failed to load from a cache file.
└ @ Base loading.jl:1036
┌ Warning: The call to compilecache failed to create a usable precompiled cache file for PlotUtils [995b91a9-d308-5afd-9ec6-746e21dbc043]
│   exception = Required dependency Colors [5ae59095-9a9b-59fe-a467-6f913c188581] failed to load from a cache file.
└ @ Base loading.jl:1036
┌ Warning: The call to compilecache failed to create a usable precompiled cache file for PlotUtils [995b91a9-d308-5afd-9ec6-746e21dbc043]
│   exception = Required dependency Colors [5ae59095-9a9b-59fe-a467-6f913c188581] failed to load from a cache file.
└ @ Base loading.jl:1036
┌ Warning: The call to compilecache failed to create a usable precompiled cache file for PlotUtils [995b91a9-d308-5afd-9ec6-746e21dbc043]
│   exception = Required dependency Colors [5ae59095-9a9b-59fe-a467-6f913c188581] failed to load from a cache file.
└ @ Base loading.jl:1036
┌ Warning: The call to compilecache failed to create a usable precompiled cache file for PlotUtils [995b91a9-d308-5afd-9ec6-746e21dbc043]
│   exception = Required dependency Colors [5ae59095-9a9b-59fe-a467-6f913c188581] failed to load from a cache file.
└ @ Base loading.jl:1036
┌ Warning: The call to compilecache failed to create a usable precompiled cache file for PlotUtils [995b91a9-d308-5afd-9ec6-746e21dbc043]
│   exception = Required dependency Colors [5ae59095-9a9b-59fe-a467-6f913c188581] failed to load from a cache file.
└ @ Base loading.jl:1036
┌ Warning: The call to compilecache failed to create a usable precompiled cache file for PlotUtils [995b91a9-d308-5afd-9ec6-746e21dbc043]
│   exception = Required dependency Colors [5ae59095-9a9b-59fe-a467-6f913c188581] failed to load from a cache file.
└ @ Base loading.jl:1036
┌ Warning: Module PlotUtils with build ID 7899739325550748 is missing from the cache.
│ This may mean PlotUtils [995b91a9-d308-5afd-9ec6-746e21dbc043] does not support precompilation but is imported by a module that does.
└ @ Base loading.jl:1011
┌ Warning: Module PlotUtils with build ID 7899739133855864 is missing from the cache.
│ This may mean PlotUtils [995b91a9-d308-5afd-9ec6-746e21dbc043] does not support precompilation but is imported by a module that does.
└ @ Base loading.jl:1011
┌ Warning: Module PlotUtils with build ID 7899739562982825 is missing from the cache.
│ This may mean PlotUtils [995b91a9-d308-5afd-9ec6-746e21dbc043] does not support precompilation but is imported by a module that does.
└ @ Base loading.jl:1011
┌ Warning: Module PlotUtils with build ID 7899739352083563 is missing from the cache.
│ This may mean PlotUtils [995b91a9-d308-5afd-9ec6-746e21dbc043] does not support precompilation but is imported by a module that does.
└ @ Base loading.jl:1011
┌ Warning: Module PlotUtils with build ID 7899739379624092 is missing from the cache.
│ This may mean PlotUtils [995b91a9-d308-5afd-9ec6-746e21dbc043] does not support precompilation but is imported by a module that does.
└ @ Base loading.jl:1011
┌ Warning: Module PlotUtils with build ID 7899739556577394 is missing from the cache.
│ This may mean PlotUtils [995b91a9-d308-5afd-9ec6-746e21dbc043] does not support precompilation but is imported by a module that does.
└ @ Base loading.jl:1011
┌ Warning: Module PlotUtils with build ID 7899739511752142 is missing from the cache.
│ This may mean PlotUtils [995b91a9-d308-5afd-9ec6-746e21dbc043] does not support precompilation but is imported by a module that does.
└ @ Base loading.jl:1011
┌ Warning: Module PlotUtils with build ID 7899739585462937 is missing from the cache.
│ This may mean PlotUtils [995b91a9-d308-5afd-9ec6-746e21dbc043] does not support precompilation but is imported by a module that does.
└ @ Base loading.jl:1011
┌ Warning: Module PlotUtils with build ID 7899739924847307 is missing from the cache.
│ This may mean PlotUtils [995b91a9-d308-5afd-9ec6-746e21dbc043] does not support precompilation but is imported by a module that does.
└ @ Base loading.jl:1011
┌ Warning: Module PlotUtils with build ID 7899739698043324 is missing from the cache.
│ This may mean PlotUtils [995b91a9-d308-5afd-9ec6-746e21dbc043] does not support precompilation but is imported by a module that does.
└ @ Base loading.jl:1011
┌ Warning: Module PlotUtils with build ID 7899739846869055 is missing from the cache.
│ This may mean PlotUtils [995b91a9-d308-5afd-9ec6-746e21dbc043] does not support precompilation but is imported by a module that does.
└ @ Base loading.jl:1011
┌ Warning: Module PlotUtils with build ID 7899740243702741 is missing from the cache.
│ This may mean PlotUtils [995b91a9-d308-5afd-9ec6-746e21dbc043] does not support precompilation but is imported by a module that does.
└ @ Base loading.jl:1011
┌ Warning: Module PlotUtils with build ID 7899739928829248 is missing from the cache.
│ This may mean PlotUtils [995b91a9-d308-5afd-9ec6-746e21dbc043] does not support precompilation but is imported by a module that does.
└ @ Base loading.jl:1011
┌ Warning: Module PlotUtils with build ID 7899739758531306 is missing from the cache.
│ This may mean PlotUtils [995b91a9-d308-5afd-9ec6-746e21dbc043] does not support precompilation but is imported by a module that does.
└ @ Base loading.jl:1011
┌ Warning: Module PlotUtils with build ID 7899740401860102 is missing from the cache.
│ This may mean PlotUtils [995b91a9-d308-5afd-9ec6-746e21dbc043] does not support precompilation but is imported by a module that does.
└ @ Base loading.jl:1011
┌ Warning: Module PlotUtils with build ID 7899741933903040 is missing from the cache.
│ This may mean PlotUtils [995b91a9-d308-5afd-9ec6-746e21dbc043] does not support precompilation but is imported by a module that does.
└ @ Base loading.jl:1011
┌ Warning: Module PlotUtils with build ID 7899743052247118 is missing from the cache.
│ This may mean PlotUtils [995b91a9-d308-5afd-9ec6-746e21dbc043] does not support precompilation but is imported by a module that does.
└ @ Base loading.jl:1011
┌ Warning: Module PlotUtils with build ID 7899743049703146 is missing from the cache.
│ This may mean PlotUtils [995b91a9-d308-5afd-9ec6-746e21dbc043] does not support precompilation but is imported by a module that does.
└ @ Base loading.jl:1011
┌ Warning: Module PlotUtils with build ID 7899743204325575 is missing from the cache.
│ This may mean PlotUtils [995b91a9-d308-5afd-9ec6-746e21dbc043] does not support precompilation but is imported by a module that does.
└ @ Base loading.jl:1011
┌ Warning: Module PlotUtils with build ID 7899743434205395 is missing from the cache.
│ This may mean PlotUtils [995b91a9-d308-5afd-9ec6-746e21dbc043] does not support precompilation but is imported by a module that does.
└ @ Base loading.jl:1011
┌ Warning: Module PlotUtils with build ID 7899743666595656 is missing from the cache.
│ This may mean PlotUtils [995b91a9-d308-5afd-9ec6-746e21dbc043] does not support precompilation but is imported by a module that does.
└ @ Base loading.jl:1011
┌ Warning: Module PlotUtils with build ID 7899743792523103 is missing from the cache.
│ This may mean PlotUtils [995b91a9-d308-5afd-9ec6-746e21dbc043] does not support precompilation but is imported by a module that does.
└ @ Base loading.jl:1011
┌ Warning: Module PlotUtils with build ID 7899743610570313 is missing from the cache.
│ This may mean PlotUtils [995b91a9-d308-5afd-9ec6-746e21dbc043] does not support precompilation but is imported by a module that does.
└ @ Base loading.jl:1011
┌ Warning: Module PlotUtils with build ID 7899744703112501 is missing from the cache.
│ This may mean PlotUtils [995b91a9-d308-5afd-9ec6-746e21dbc043] does not support precompilation but is imported by a module that does.
└ @ Base loading.jl:1011
┌ Warning: Module PlotUtils with build ID 7899744872012345 is missing from the cache.
│ This may mean PlotUtils [995b91a9-d308-5afd-9ec6-746e21dbc043] does not support precompilation but is imported by a module that does.
└ @ Base loading.jl:1011
┌ Warning: Module PlotUtils with build ID 7899744914708383 is missing from the cache.
│ This may mean PlotUtils [995b91a9-d308-5afd-9ec6-746e21dbc043] does not support precompilation but is imported by a module that does.
└ @ Base loading.jl:1011
┌ Warning: Module PlotUtils with build ID 7899739325550748 is missing from the cache.
│ This may mean PlotUtils [995b91a9-d308-5afd-9ec6-746e21dbc043] does not support precompilation but is imported by a module that does.
└ @ Base loading.jl:1011
┌ Warning: Module PlotUtils with build ID 7899739562982825 is missing from the cache.
│ This may mean PlotUtils [995b91a9-d308-5afd-9ec6-746e21dbc043] does not support precompilation but is imported by a module that does.
└ @ Base loading.jl:1011
┌ Warning: Module PlotUtils with build ID 7899739133855864 is missing from the cache.
│ This may mean PlotUtils [995b91a9-d308-5afd-9ec6-746e21dbc043] does not support precompilation but is imported by a module that does.
└ @ Base loading.jl:1011
┌ Warning: Module PlotUtils with build ID 7899739352083563 is missing from the cache.
│ This may mean PlotUtils [995b91a9-d308-5afd-9ec6-746e21dbc043] does not support precompilation but is imported by a module that does.
└ @ Base loading.jl:1011
┌ Warning: Module PlotUtils with build ID 7899745100210992 is missing from the cache.
│ This may mean PlotUtils [995b91a9-d308-5afd-9ec6-746e21dbc043] does not support precompilation but is imported by a module that does.
└ @ Base loading.jl:1011
┌ Warning: Module PlotUtils with build ID 7899745069539901 is missing from the cache.
│ This may mean PlotUtils [995b91a9-d308-5afd-9ec6-746e21dbc043] does not support precompilation but is imported by a module that does.
└ @ Base loading.jl:1011
┌ Warning: Module PlotUtils with build ID 7899739379624092 is missing from the cache.
│ This may mean PlotUtils [995b91a9-d308-5afd-9ec6-746e21dbc043] does not support precompilation but is imported by a module that does.
└ @ Base loading.jl:1011
┌ Warning: Module PlotUtils with build ID 7899739585462937 is missing from the cache.
│ This may mean PlotUtils [995b91a9-d308-5afd-9ec6-746e21dbc043] does not support precompilation but is imported by a module that does.
└ @ Base loading.jl:1011
┌ Warning: Module PlotUtils with build ID 7899739511752142 is missing from the cache.
│ This may mean PlotUtils [995b91a9-d308-5afd-9ec6-746e21dbc043] does not support precompilation but is imported by a module that does.
└ @ Base loading.jl:1011
┌ Warning: Module PlotUtils with build ID 7899739924847307 is missing from the cache.
│ This may mean PlotUtils [995b91a9-d308-5afd-9ec6-746e21dbc043] does not support precompilation but is imported by a module that does.
└ @ Base loading.jl:1011
┌ Warning: Module PlotUtils with build ID 7899739698043324 is missing from the cache.
│ This may mean PlotUtils [995b91a9-d308-5afd-9ec6-746e21dbc043] does not support precompilation but is imported by a module that does.
└ @ Base loading.jl:1011
┌ Warning: Module PlotUtils with build ID 7899739846869055 is missing from the cache.
│ This may mean PlotUtils [995b91a9-d308-5afd-9ec6-746e21dbc043] does not support precompilation but is imported by a module that does.
└ @ Base loading.jl:1011
┌ Warning: Module PlotUtils with build ID 7899739556577394 is missing from the cache.
│ This may mean PlotUtils [995b91a9-d308-5afd-9ec6-746e21dbc043] does not support precompilation but is imported by a module that does.
└ @ Base loading.jl:1011
┌ Warning: Module PlotUtils with build ID 7899739928829248 is missing from the cache.
│ This may mean PlotUtils [995b91a9-d308-5afd-9ec6-746e21dbc043] does not support precompilation but is imported by a module that does.
└ @ Base loading.jl:1011
┌ Warning: Module PlotUtils with build ID 7899739758531306 is missing from the cache.
│ This may mean PlotUtils [995b91a9-d308-5afd-9ec6-746e21dbc043] does not support precompilation but is imported by a module that does.
└ @ Base loading.jl:1011
┌ Warning: Module PlotUtils with build ID 7899740243702741 is missing from the cache.
│ This may mean PlotUtils [995b91a9-d308-5afd-9ec6-746e21dbc043] does not support precompilation but is imported by a module that does.
└ @ Base loading.jl:1011
┌ Warning: Module PlotUtils with build ID 7899740401860102 is missing from the cache.
│ This may mean PlotUtils [995b91a9-d308-5afd-9ec6-746e21dbc043] does not support precompilation but is imported by a module that does.
└ @ Base loading.jl:1011
┌ Warning: Module PlotUtils with build ID 7899741933903040 is missing from the cache.
│ This may mean PlotUtils [995b91a9-d308-5afd-9ec6-746e21dbc043] does not support precompilation but is imported by a module that does.
└ @ Base loading.jl:1011
┌ Warning: Module PlotUtils with build ID 7899743052247118 is missing from the cache.
│ This may mean PlotUtils [995b91a9-d308-5afd-9ec6-746e21dbc043] does not support precompilation but is imported by a module that does.
└ @ Base loading.jl:1011
┌ Warning: Module PlotUtils with build ID 7899743049703146 is missing from the cache.
│ This may mean PlotUtils [995b91a9-d308-5afd-9ec6-746e21dbc043] does not support precompilation but is imported by a module that does.
└ @ Base loading.jl:1011
┌ Warning: Module PlotUtils with build ID 7899743204325575 is missing from the cache.
│ This may mean PlotUtils [995b91a9-d308-5afd-9ec6-746e21dbc043] does not support precompilation but is imported by a module that does.
└ @ Base loading.jl:1011
┌ Warning: Module PlotUtils with build ID 7899743666595656 is missing from the cache.
│ This may mean PlotUtils [995b91a9-d308-5afd-9ec6-746e21dbc043] does not support precompilation but is imported by a module that does.
└ @ Base loading.jl:1011
┌ Warning: Module PlotUtils with build ID 7899743434205395 is missing from the cache.
│ This may mean PlotUtils [995b91a9-d308-5afd-9ec6-746e21dbc043] does not support precompilation but is imported by a module that does.
└ @ Base loading.jl:1011
┌ Warning: Module PlotUtils with build ID 7899743792523103 is missing from the cache.
│ This may mean PlotUtils [995b91a9-d308-5afd-9ec6-746e21dbc043] does not support precompilation but is imported by a module that does.
└ @ Base loading.jl:1011
┌ Warning: Module PlotUtils with build ID 7899743610570313 is missing from the cache.
│ This may mean PlotUtils [995b91a9-d308-5afd-9ec6-746e21dbc043] does not support precompilation but is imported by a module that does.
└ @ Base loading.jl:1011
┌ Warning: Module PlotUtils with build ID 7899744914708383 is missing from the cache.
│ This may mean PlotUtils [995b91a9-d308-5afd-9ec6-746e21dbc043] does not support precompilation but is imported by a module that does.
└ @ Base loading.jl:1011
┌ Warning: Module PlotUtils with build ID 7899744872012345 is missing from the cache.
│ This may mean PlotUtils [995b91a9-d308-5afd-9ec6-746e21dbc043] does not support precompilation but is imported by a module that does.
└ @ Base loading.jl:1011
┌ Warning: Module PlotUtils with build ID 7899744703112501 is missing from the cache.
│ This may mean PlotUtils [995b91a9-d308-5afd-9ec6-746e21dbc043] does not support precompilation but is imported by a module that does.
└ @ Base loading.jl:1011
┌ Warning: Module PlotUtils with build ID 7899745069539901 is missing from the cache.
│ This may mean PlotUtils [995b91a9-d308-5afd-9ec6-746e21dbc043] does not support precompilation but is imported by a module that does.
└ @ Base loading.jl:1011
┌ Warning: Module PlotUtils with build ID 7899745100210992 is missing from the cache.
│ This may mean PlotUtils [995b91a9-d308-5afd-9ec6-746e21dbc043] does not support precompilation but is imported by a module that does.
└ @ Base loading.jl:1011
┌ Warning: You appear to be using MPI.jl with the default MPI binary on a cluster.
│ We recommend using the system-provided MPI, see the Configuration section of the MPI.jl docs.
└ @ MPI ~/.julia/packages/MPI/b7MVG/deps/deps.jl:15
┌ Warning: You appear to be using MPI.jl with the default MPI binary on a cluster.
│ We recommend using the system-provided MPI, see the Configuration section of the MPI.jl docs.
└ @ MPI ~/.julia/packages/MPI/b7MVG/deps/deps.jl:15
┌ Warning: You appear to be using MPI.jl with the default MPI binary on a cluster.
│ We recommend using the system-provided MPI, see the Configuration section of the MPI.jl docs.
└ @ MPI ~/.julia/packages/MPI/b7MVG/deps/deps.jl:15
┌ Warning: You appear to be using MPI.jl with the default MPI binary on a cluster.
│ We recommend using the system-provided MPI, see the Configuration section of the MPI.jl docs.
└ @ MPI ~/.julia/packages/MPI/b7MVG/deps/deps.jl:15
┌ Warning: You appear to be using MPI.jl with the default MPI binary on a cluster.
│ We recommend using the system-provided MPI, see the Configuration section of the MPI.jl docs.
└ @ MPI ~/.julia/packages/MPI/b7MVG/deps/deps.jl:15
┌ Warning: You appear to be using MPI.jl with the default MPI binary on a cluster.
│ We recommend using the system-provided MPI, see the Configuration section of the MPI.jl docs.
└ @ MPI ~/.julia/packages/MPI/b7MVG/deps/deps.jl:15
┌ Warning: You appear to be using MPI.jl with the default MPI binary on a cluster.
│ We recommend using the system-provided MPI, see the Configuration section of the MPI.jl docs.
└ @ MPI ~/.julia/packages/MPI/b7MVG/deps/deps.jl:15
┌ Warning: You appear to be using MPI.jl with the default MPI binary on a cluster.
│ We recommend using the system-provided MPI, see the Configuration section of the MPI.jl docs.
└ @ MPI ~/.julia/packages/MPI/b7MVG/deps/deps.jl:15
┌ Warning: You appear to be using MPI.jl with the default MPI binary on a cluster.
│ We recommend using the system-provided MPI, see the Configuration section of the MPI.jl docs.
└ @ MPI ~/.julia/packages/MPI/b7MVG/deps/deps.jl:15
┌ Warning: You appear to be using MPI.jl with the default MPI binary on a cluster.
│ We recommend using the system-provided MPI, see the Configuration section of the MPI.jl docs.
└ @ MPI ~/.julia/packages/MPI/b7MVG/deps/deps.jl:15
┌ Warning: You appear to be using MPI.jl with the default MPI binary on a cluster.
│ We recommend using the system-provided MPI, see the Configuration section of the MPI.jl docs.
└ @ MPI ~/.julia/packages/MPI/b7MVG/deps/deps.jl:15
┌ Warning: You appear to be using MPI.jl with the default MPI binary on a cluster.
│ We recommend using the system-provided MPI, see the Configuration section of the MPI.jl docs.
└ @ MPI ~/.julia/packages/MPI/b7MVG/deps/deps.jl:15
┌ Warning: You appear to be using MPI.jl with the default MPI binary on a cluster.
│ We recommend using the system-provided MPI, see the Configuration section of the MPI.jl docs.
└ @ MPI ~/.julia/packages/MPI/b7MVG/deps/deps.jl:15
┌ Warning: You appear to be using MPI.jl with the default MPI binary on a cluster.
│ We recommend using the system-provided MPI, see the Configuration section of the MPI.jl docs.
└ @ MPI ~/.julia/packages/MPI/b7MVG/deps/deps.jl:15
┌ Warning: You appear to be using MPI.jl with the default MPI binary on a cluster.
│ We recommend using the system-provided MPI, see the Configuration section of the MPI.jl docs.
└ @ MPI ~/.julia/packages/MPI/b7MVG/deps/deps.jl:15
┌ Warning: You appear to be using MPI.jl with the default MPI binary on a cluster.
│ We recommend using the system-provided MPI, see the Configuration section of the MPI.jl docs.
└ @ MPI ~/.julia/packages/MPI/b7MVG/deps/deps.jl:15
┌ Warning: You appear to be using MPI.jl with the default MPI binary on a cluster.
│ We recommend using the system-provided MPI, see the Configuration section of the MPI.jl docs.
└ @ MPI ~/.julia/packages/MPI/b7MVG/deps/deps.jl:15
┌ Warning: You appear to be using MPI.jl with the default MPI binary on a cluster.
│ We recommend using the system-provided MPI, see the Configuration section of the MPI.jl docs.
└ @ MPI ~/.julia/packages/MPI/b7MVG/deps/deps.jl:15
┌ Warning: You appear to be using MPI.jl with the default MPI binary on a cluster.
│ We recommend using the system-provided MPI, see the Configuration section of the MPI.jl docs.
└ @ MPI ~/.julia/packages/MPI/b7MVG/deps/deps.jl:15
┌ Warning: You appear to be using MPI.jl with the default MPI binary on a cluster.
│ We recommend using the system-provided MPI, see the Configuration section of the MPI.jl docs.
└ @ MPI ~/.julia/packages/MPI/b7MVG/deps/deps.jl:15
┌ Warning: You appear to be using MPI.jl with the default MPI binary on a cluster.
│ We recommend using the system-provided MPI, see the Configuration section of the MPI.jl docs.
└ @ MPI ~/.julia/packages/MPI/b7MVG/deps/deps.jl:15
┌ Warning: You appear to be using MPI.jl with the default MPI binary on a cluster.
│ We recommend using the system-provided MPI, see the Configuration section of the MPI.jl docs.
└ @ MPI ~/.julia/packages/MPI/b7MVG/deps/deps.jl:15
┌ Warning: You appear to be using MPI.jl with the default MPI binary on a cluster.
│ We recommend using the system-provided MPI, see the Configuration section of the MPI.jl docs.
└ @ MPI ~/.julia/packages/MPI/b7MVG/deps/deps.jl:15
┌ Warning: You appear to be using MPI.jl with the default MPI binary on a cluster.
│ We recommend using the system-provided MPI, see the Configuration section of the MPI.jl docs.
└ @ MPI ~/.julia/packages/MPI/b7MVG/deps/deps.jl:15
┌ Warning: You appear to be using MPI.jl with the default MPI binary on a cluster.
│ We recommend using the system-provided MPI, see the Configuration section of the MPI.jl docs.
└ @ MPI ~/.julia/packages/MPI/b7MVG/deps/deps.jl:15
┌ Warning: You appear to be using MPI.jl with the default MPI binary on a cluster.
│ We recommend using the system-provided MPI, see the Configuration section of the MPI.jl docs.
└ @ MPI ~/.julia/packages/MPI/b7MVG/deps/deps.jl:15
┌ Warning: You appear to be using MPI.jl with the default MPI binary on a cluster.
│ We recommend using the system-provided MPI, see the Configuration section of the MPI.jl docs.
└ @ MPI ~/.julia/packages/MPI/b7MVG/deps/deps.jl:15
┌ Warning: You appear to be using MPI.jl with the default MPI binary on a cluster.
│ We recommend using the system-provided MPI, see the Configuration section of the MPI.jl docs.
└ @ MPI ~/.julia/packages/MPI/b7MVG/deps/deps.jl:15
