┌ Warning: You appear to be using MPI.jl with the default MPI binary on a cluster.
│ We recommend using the system-provided MPI, see the Configuration section of the MPI.jl docs.
└ @ MPI ~/.julia/packages/MPI/b7MVG/deps/deps.jl:15
┌ Warning: You appear to be using MPI.jl with the default MPI binary on a cluster.
│ We recommend using the system-provided MPI, see the Configuration section of the MPI.jl docs.
└ @ MPI ~/.julia/packages/MPI/b7MVG/deps/deps.jl:15
┌ Warning: You appear to be using MPI.jl with the default MPI binary on a cluster.
│ We recommend using the system-provided MPI, see the Configuration section of the MPI.jl docs.
└ @ MPI ~/.julia/packages/MPI/b7MVG/deps/deps.jl:15
┌ Warning: You appear to be using MPI.jl with the default MPI binary on a cluster.
│ We recommend using the system-provided MPI, see the Configuration section of the MPI.jl docs.
└ @ MPI ~/.julia/packages/MPI/b7MVG/deps/deps.jl:15
┌ Warning: You appear to be using MPI.jl with the default MPI binary on a cluster.
│ We recommend using the system-provided MPI, see the Configuration section of the MPI.jl docs.
└ @ MPI ~/.julia/packages/MPI/b7MVG/deps/deps.jl:15
┌ Warning: You appear to be using MPI.jl with the default MPI binary on a cluster.
│ We recommend using the system-provided MPI, see the Configuration section of the MPI.jl docs.
└ @ MPI ~/.julia/packages/MPI/b7MVG/deps/deps.jl:15
┌ Warning: You appear to be using MPI.jl with the default MPI binary on a cluster.
│ We recommend using the system-provided MPI, see the Configuration section of the MPI.jl docs.
└ @ MPI ~/.julia/packages/MPI/b7MVG/deps/deps.jl:15
┌ Warning: You appear to be using MPI.jl with the default MPI binary on a cluster.
│ We recommend using the system-provided MPI, see the Configuration section of the MPI.jl docs.
└ @ MPI ~/.julia/packages/MPI/b7MVG/deps/deps.jl:15
┌ Warning: You appear to be using MPI.jl with the default MPI binary on a cluster.
│ We recommend using the system-provided MPI, see the Configuration section of the MPI.jl docs.
└ @ MPI ~/.julia/packages/MPI/b7MVG/deps/deps.jl:15
┌ Warning: You appear to be using MPI.jl with the default MPI binary on a cluster.
│ We recommend using the system-provided MPI, see the Configuration section of the MPI.jl docs.
└ @ MPI ~/.julia/packages/MPI/b7MVG/deps/deps.jl:15
┌ Warning: You appear to be using MPI.jl with the default MPI binary on a cluster.
│ We recommend using the system-provided MPI, see the Configuration section of the MPI.jl docs.
└ @ MPI ~/.julia/packages/MPI/b7MVG/deps/deps.jl:15
┌ Warning: You appear to be using MPI.jl with the default MPI binary on a cluster.
│ We recommend using the system-provided MPI, see the Configuration section of the MPI.jl docs.
└ @ MPI ~/.julia/packages/MPI/b7MVG/deps/deps.jl:15
┌ Warning: You appear to be using MPI.jl with the default MPI binary on a cluster.
│ We recommend using the system-provided MPI, see the Configuration section of the MPI.jl docs.
└ @ MPI ~/.julia/packages/MPI/b7MVG/deps/deps.jl:15
┌ Warning: You appear to be using MPI.jl with the default MPI binary on a cluster.
│ We recommend using the system-provided MPI, see the Configuration section of the MPI.jl docs.
└ @ MPI ~/.julia/packages/MPI/b7MVG/deps/deps.jl:15
┌ Warning: You appear to be using MPI.jl with the default MPI binary on a cluster.
│ We recommend using the system-provided MPI, see the Configuration section of the MPI.jl docs.
└ @ MPI ~/.julia/packages/MPI/b7MVG/deps/deps.jl:15
┌ Warning: You appear to be using MPI.jl with the default MPI binary on a cluster.
│ We recommend using the system-provided MPI, see the Configuration section of the MPI.jl docs.
└ @ MPI ~/.julia/packages/MPI/b7MVG/deps/deps.jl:15
┌ Warning: You appear to be using MPI.jl with the default MPI binary on a cluster.
│ We recommend using the system-provided MPI, see the Configuration section of the MPI.jl docs.
└ @ MPI ~/.julia/packages/MPI/b7MVG/deps/deps.jl:15
┌ Warning: You appear to be using MPI.jl with the default MPI binary on a cluster.
│ We recommend using the system-provided MPI, see the Configuration section of the MPI.jl docs.
└ @ MPI ~/.julia/packages/MPI/b7MVG/deps/deps.jl:15
┌ Warning: You appear to be using MPI.jl with the default MPI binary on a cluster.
│ We recommend using the system-provided MPI, see the Configuration section of the MPI.jl docs.
└ @ MPI ~/.julia/packages/MPI/b7MVG/deps/deps.jl:15
┌ Warning: You appear to be using MPI.jl with the default MPI binary on a cluster.
│ We recommend using the system-provided MPI, see the Configuration section of the MPI.jl docs.
└ @ MPI ~/.julia/packages/MPI/b7MVG/deps/deps.jl:15
┌ Warning: You appear to be using MPI.jl with the default MPI binary on a cluster.
│ We recommend using the system-provided MPI, see the Configuration section of the MPI.jl docs.
└ @ MPI ~/.julia/packages/MPI/b7MVG/deps/deps.jl:15
┌ Warning: You appear to be using MPI.jl with the default MPI binary on a cluster.
│ We recommend using the system-provided MPI, see the Configuration section of the MPI.jl docs.
└ @ MPI ~/.julia/packages/MPI/b7MVG/deps/deps.jl:15
┌ Warning: You appear to be using MPI.jl with the default MPI binary on a cluster.
│ We recommend using the system-provided MPI, see the Configuration section of the MPI.jl docs.
└ @ MPI ~/.julia/packages/MPI/b7MVG/deps/deps.jl:15
┌ Warning: You appear to be using MPI.jl with the default MPI binary on a cluster.
│ We recommend using the system-provided MPI, see the Configuration section of the MPI.jl docs.
└ @ MPI ~/.julia/packages/MPI/b7MVG/deps/deps.jl:15
┌ Warning: You appear to be using MPI.jl with the default MPI binary on a cluster.
│ We recommend using the system-provided MPI, see the Configuration section of the MPI.jl docs.
└ @ MPI ~/.julia/packages/MPI/b7MVG/deps/deps.jl:15
┌ Warning: You appear to be using MPI.jl with the default MPI binary on a cluster.
│ We recommend using the system-provided MPI, see the Configuration section of the MPI.jl docs.
└ @ MPI ~/.julia/packages/MPI/b7MVG/deps/deps.jl:15
┌ Warning: You appear to be using MPI.jl with the default MPI binary on a cluster.
│ We recommend using the system-provided MPI, see the Configuration section of the MPI.jl docs.
└ @ MPI ~/.julia/packages/MPI/b7MVG/deps/deps.jl:15
┌ Warning: You appear to be using MPI.jl with the default MPI binary on a cluster.
│ We recommend using the system-provided MPI, see the Configuration section of the MPI.jl docs.
└ @ MPI ~/.julia/packages/MPI/b7MVG/deps/deps.jl:15
srun: Job step aborted: Waiting up to 32 seconds for job step to finish.
slurmstepd: error: *** STEP 2160212.0 ON iris-041 CANCELLED AT 2020-12-04T23:50:16 DUE TO TIME LIMIT ***
slurmstepd: error: *** JOB 2160212 ON iris-041 CANCELLED AT 2020-12-04T23:50:16 DUE TO TIME LIMIT ***

signal (15): Terminated

signal (15): Terminated
in expression starting at /mnt/irisgpfs/projects/tcp/epillon/FSSH/Param/C_1/extended_standard_FSSH.jl:142

signal (15): Terminated
in expression starting at /mnt/irisgpfs/projects/tcp/epillon/FSSH/Param/C_1/extended_standard_FSSH.jl:142

signal (15): Terminated
in expression starting at /mnt/irisgpfs/projects/tcp/epillon/FSSH/Param/C_1/extended_standard_FSSH.jl:142

signal (15): Terminated
in expression starting at /mnt/irisgpfs/projects/tcp/epillon/FSSH/Param/C_1/extended_standard_FSSH.jl:142

signal (15): Terminated
in expression starting at /mnt/irisgpfs/projects/tcp/epillon/FSSH/Param/C_1/extended_standard_FSSH.jl:142

signal (15): Terminated
in expression starting at /mnt/irisgpfs/projects/tcp/epillon/FSSH/Param/C_1/extended_standard_FSSH.jl:142

signal (15): Terminated
in expression starting at /mnt/irisgpfs/projects/tcp/epillon/FSSH/Param/C_1/extended_standard_FSSH.jl:142

signal (15): Terminated
in expression starting at /mnt/irisgpfs/projects/tcp/epillon/FSSH/Param/C_1/extended_standard_FSSH.jl:142

signal (15): Terminated
in expression starting at /mnt/irisgpfs/projects/tcp/epillon/FSSH/Param/C_1/extended_standard_FSSH.jl:142

signal (15): Terminated
in expression starting at /mnt/irisgpfs/projects/tcp/epillon/FSSH/Param/C_1/extended_standard_FSSH.jl:142

signal (15): Terminated
in expression starting at /mnt/irisgpfs/projects/tcp/epillon/FSSH/Param/C_1/extended_standard_FSSH.jl:142

signal (15): Terminated
in expression starting at /mnt/irisgpfs/projects/tcp/epillon/FSSH/Param/C_1/extended_standard_FSSH.jl:142

signal (15): Terminated
in expression starting at /mnt/irisgpfs/projects/tcp/epillon/FSSH/Param/C_1/extended_standard_FSSH.jl:142

signal (15): Terminated
in expression starting at /mnt/irisgpfs/projects/tcp/epillon/FSSH/Param/C_1/extended_standard_FSSH.jl:142

signal (15): Terminated
in expression starting at /mnt/irisgpfs/projects/tcp/epillon/FSSH/Param/C_1/extended_standard_FSSH.jl:142

signal (15): Terminated
in expression starting at /mnt/irisgpfs/projects/tcp/epillon/FSSH/Param/C_1/extended_standard_FSSH.jl:142

signal (15): Terminated
in expression starting at /mnt/irisgpfs/projects/tcp/epillon/FSSH/Param/C_1/extended_standard_FSSH.jl:142

signal (15): Terminated
in expression starting at /mnt/irisgpfs/projects/tcp/epillon/FSSH/Param/C_1/extended_standard_FSSH.jl:142

signal (15): Terminated
in expression starting at /mnt/irisgpfs/projects/tcp/epillon/FSSH/Param/C_1/extended_standard_FSSH.jl:142
in expression starting at /mnt/irisgpfs/projects/tcp/epillon/FSSH/Param/C_1/extended_standard_FSSH.jl:142

signal (15): Terminated
in expression starting at /mnt/irisgpfs/projects/tcp/epillon/FSSH/Param/C_1/extended_standard_FSSH.jl:142

signal (15): Terminated
in expression starting at /mnt/irisgpfs/projects/tcp/epillon/FSSH/Param/C_1/extended_standard_FSSH.jl:142

signal (15): Terminated
in expression starting at /mnt/irisgpfs/projects/tcp/epillon/FSSH/Param/C_1/extended_standard_FSSH.jl:142

signal (15): Terminated
in expression starting at /mnt/irisgpfs/projects/tcp/epillon/FSSH/Param/C_1/extended_standard_FSSH.jl:142
jl_typemap_entry_assoc_exact at /buildworker/worker/package_linux64/build/src/typemap.c:797
splev_ at /home/users/epillon/.julia/artifacts/4af195a529c56762113fac4823c38d0d911367a9/lib/libddierckx.so (unknown line)
splev_ at /home/users/epillon/.julia/artifacts/4af195a529c56762113fac4823c38d0d911367a9/lib/libddierckx.so (unknown line)
splev_ at /home/users/epillon/.julia/artifacts/4af195a529c56762113fac4823c38d0d911367a9/lib/libddierckx.so (unknown line)
splev_ at /home/users/epillon/.julia/artifacts/4af195a529c56762113fac4823c38d0d911367a9/lib/libddierckx.so (unknown line)
jl_typemap_level_assoc_exact at /buildworker/worker/package_linux64/build/src/typemap.c:861
splev_ at /home/users/epillon/.julia/artifacts/4af195a529c56762113fac4823c38d0d911367a9/lib/libddierckx.so (unknown line)
splev_ at /home/users/epillon/.julia/artifacts/4af195a529c56762113fac4823c38d0d911367a9/lib/libddierckx.so (unknown line)
_evaluate at /home/users/epillon/.julia/packages/Dierckx/UZGsb/src/Dierckx.jl:279
evaluate at /home/users/epillon/.julia/packages/Dierckx/UZGsb/src/Dierckx.jl:296 [inlined]
Spline1D at /home/users/epillon/.julia/packages/Dierckx/UZGsb/src/Dierckx.jl:1040
unknown function (ip: 0x2aaac4a15397)
_evaluate at /home/users/epillon/.julia/packages/Dierckx/UZGsb/src/Dierckx.jl:279
evaluate at /home/users/epillon/.julia/packages/Dierckx/UZGsb/src/Dierckx.jl:296 [inlined]
Spline1D at /home/users/epillon/.julia/packages/Dierckx/UZGsb/src/Dierckx.jl:1040
unknown function (ip: 0x2aaac4a15397)
_evaluate at /home/users/epillon/.julia/packages/Dierckx/UZGsb/src/Dierckx.jl:279
evaluate at /home/users/epillon/.julia/packages/Dierckx/UZGsb/src/Dierckx.jl:296 [inlined]
Spline1D at /home/users/epillon/.julia/packages/Dierckx/UZGsb/src/Dierckx.jl:1040
unknown function (ip: 0x2aaac4a15397)
_evaluate at /home/users/epillon/.julia/packages/Dierckx/UZGsb/src/Dierckx.jl:279
evaluate at /home/users/epillon/.julia/packages/Dierckx/UZGsb/src/Dierckx.jl:296 [inlined]
_evaluate at /home/users/epillon/.julia/packages/Dierckx/UZGsb/src/Dierckx.jl:279
evaluate at /home/users/epillon/.julia/packages/Dierckx/UZGsb/src/Dierckx.jl:296 [inlined]
Spline1D at /home/users/epillon/.julia/packages/Dierckx/UZGsb/src/Dierckx.jl:1040
unknown function (ip: 0x2aaac4a15397)
_evaluate at /home/users/epillon/.julia/packages/Dierckx/UZGsb/src/Dierckx.jl:279
evaluate at /home/users/epillon/.julia/packages/Dierckx/UZGsb/src/Dierckx.jl:296 [inlined]
Spline1D at /home/users/epillon/.julia/packages/Dierckx/UZGsb/src/Dierckx.jl:1040
Spline1D at /home/users/epillon/.julia/packages/Dierckx/UZGsb/src/Dierckx.jl:1040
unknown function (ip: 0x2aaac4a15397)
unknown function (ip: 0x2aaac4a15397)
splev_ at /home/users/epillon/.julia/artifacts/4af195a529c56762113fac4823c38d0d911367a9/lib/libddierckx.so (unknown line)
splev_ at /home/users/epillon/.julia/artifacts/4af195a529c56762113fac4823c38d0d911367a9/lib/libddierckx.so (unknown line)
splev_ at /home/users/epillon/.julia/artifacts/4af195a529c56762113fac4823c38d0d911367a9/lib/libddierckx.so (unknown line)
splev_ at /home/users/epillon/.julia/artifacts/4af195a529c56762113fac4823c38d0d911367a9/lib/libddierckx.so (unknown line)
splev_ at /home/users/epillon/.julia/artifacts/4af195a529c56762113fac4823c38d0d911367a9/lib/libddierckx.so (unknown line)
jl_lookup_generic_ at /buildworker/worker/package_linux64/build/src/gf.c:2243 [inlined]
jl_apply_generic at /buildworker/worker/package_linux64/build/src/gf.c:2301
jl_typemap_entry_assoc_exact at /buildworker/worker/package_linux64/build/src/typemap.c:794
_evaluate at /home/users/epillon/.julia/packages/Dierckx/UZGsb/src/Dierckx.jl:279
_evaluate at /home/users/epillon/.julia/packages/Dierckx/UZGsb/src/Dierckx.jl:279
_evaluate at /home/users/epillon/.julia/packages/Dierckx/UZGsb/src/Dierckx.jl:279
evaluate at /home/users/epillon/.julia/packages/Dierckx/UZGsb/src/Dierckx.jl:296 [inlined]
Spline1D at /home/users/epillon/.julia/packages/Dierckx/UZGsb/src/Dierckx.jl:1040
unknown function (ip: 0x2aaac4a15397)
_evaluate at /home/users/epillon/.julia/packages/Dierckx/UZGsb/src/Dierckx.jl:279
evaluate at /home/users/epillon/.julia/packages/Dierckx/UZGsb/src/Dierckx.jl:296 [inlined]
Spline1D at /home/users/epillon/.julia/packages/Dierckx/UZGsb/src/Dierckx.jl:1040
unknown function (ip: 0x2aaac4a15397)
evaluate at /home/users/epillon/.julia/packages/Dierckx/UZGsb/src/Dierckx.jl:296 [inlined]
Spline1D at /home/users/epillon/.julia/packages/Dierckx/UZGsb/src/Dierckx.jl:1040
unknown function (ip: 0x2aaac4a15397)
evaluate at /home/users/epillon/.julia/packages/Dierckx/UZGsb/src/Dierckx.jl:296 [inlined]
Spline1D at /home/users/epillon/.julia/packages/Dierckx/UZGsb/src/Dierckx.jl:1040
unknown function (ip: 0x2aaac4a15397)
_evaluate at /home/users/epillon/.julia/packages/Dierckx/UZGsb/src/Dierckx.jl:279
evaluate at /home/users/epillon/.julia/packages/Dierckx/UZGsb/src/Dierckx.jl:296 [inlined]
Spline1D at /home/users/epillon/.julia/packages/Dierckx/UZGsb/src/Dierckx.jl:1040
unknown function (ip: 0x2aaac4a15397)
#maximum#591 at ./reducedim.jl:652 [inlined]
maximum at ./reducedim.jl:652 [inlined]
switch_surface at /mnt/irisgpfs/projects/tcp/epillon/FSSH/Param/C_1/particle_methods_2d.jl:211
run_dynamics_extended at /mnt/irisgpfs/projects/tcp/epillon/FSSH/Param/C_1/particle_methods_2d.jl:265
main at /mnt/irisgpfs/projects/tcp/epillon/FSSH/Param/C_1/extended_standard_FSSH.jl:90
unknown function (ip: 0x2aaac4a0dd3f)
_jl_invoke at /buildworker/worker/package_linux64/build/src/gf.c:2141 [inlined]
jl_apply_generic at /buildworker/worker/package_linux64/build/src/gf.c:2305
jl_typemap_assoc_exact at /buildworker/worker/package_linux64/build/src/julia_internal.h:939 [inlined]
jl_lookup_generic_ at /buildworker/worker/package_linux64/build/src/gf.c:2252 [inlined]
jl_apply_generic at /buildworker/worker/package_linux64/build/src/gf.c:2301
setproperty! at ./Base.jl:21
unknown function (ip: 0x2aaac4a1621c)
_jl_invoke at /buildworker/worker/package_linux64/build/src/gf.c:2135 [inlined]
jl_apply_generic at /buildworker/worker/package_linux64/build/src/gf.c:2305
jl_typemap_level_assoc_exact at /buildworker/worker/package_linux64/build/src/typemap.c:861
update_density_coefficients at /mnt/irisgpfs/projects/tcp/epillon/FSSH/Param/C_1/particle_methods_2d.jl:56
run_dynamics_extended at /mnt/irisgpfs/projects/tcp/epillon/FSSH/Param/C_1/particle_methods_2d.jl:263
main at /mnt/irisgpfs/projects/tcp/epillon/FSSH/Param/C_1/extended_standard_FSSH.jl:90
unknown function (ip: 0x2aaac4a0dd3f)
_jl_invoke at /buildworker/worker/package_linux64/build/src/gf.c:2141 [inlined]
jl_apply_generic at /buildworker/worker/package_linux64/build/src/gf.c:2305
_jl_invoke at /buildworker/worker/package_linux64/build/src/gf.c:2135 [inlined]
jl_apply_generic at /buildworker/worker/package_linux64/build/src/gf.c:2305
_jl_invoke at /buildworker/worker/package_linux64/build/src/gf.c:2135 [inlined]
jl_apply_generic at /buildworker/worker/package_linux64/build/src/gf.c:2305
update_density_coefficients at /mnt/irisgpfs/projects/tcp/epillon/FSSH/Param/C_1/particle_methods_2d.jl:45
run_dynamics_extended at /mnt/irisgpfs/projects/tcp/epillon/FSSH/Param/C_1/particle_methods_2d.jl:263
_jl_invoke at /buildworker/worker/package_linux64/build/src/gf.c:2135 [inlined]
jl_apply_generic at /buildworker/worker/package_linux64/build/src/gf.c:2305
jl_apply at /buildworker/worker/package_linux64/build/src/julia.h:1631 [inlined]
do_call at /buildworker/worker/package_linux64/build/src/interpreter.c:328
update_density_coefficients at /mnt/irisgpfs/projects/tcp/epillon/FSSH/Param/C_1/particle_methods_2d.jl:45
run_dynamics_extended at /mnt/irisgpfs/projects/tcp/epillon/FSSH/Param/C_1/particle_methods_2d.jl:263
_jl_invoke at /buildworker/worker/package_linux64/build/src/gf.c:2135 [inlined]
jl_apply_generic at /buildworker/worker/package_linux64/build/src/gf.c:2305
update_density_coefficients at /mnt/irisgpfs/projects/tcp/epillon/FSSH/Param/C_1/particle_methods_2d.jl:46
main at /mnt/irisgpfs/projects/tcp/epillon/FSSH/Param/C_1/extended_standard_FSSH.jl:90
unknown function (ip: 0x2aaac4a0dd3f)
run_dynamics_extended at /mnt/irisgpfs/projects/tcp/epillon/FSSH/Param/C_1/particle_methods_2d.jl:263
_jl_invoke at /buildworker/worker/package_linux64/build/src/gf.c:2141 [inlined]
jl_apply_generic at /buildworker/worker/package_linux64/build/src/gf.c:2305
update_density_coefficients at /mnt/irisgpfs/projects/tcp/epillon/FSSH/Param/C_1/particle_methods_2d.jl:46
main at /mnt/irisgpfs/projects/tcp/epillon/FSSH/Param/C_1/extended_standard_FSSH.jl:90
unknown function (ip: 0x2aaac4a0dd3f)
_jl_invoke at /buildworker/worker/package_linux64/build/src/gf.c:2141 [inlined]
jl_apply_generic at /buildworker/worker/package_linux64/build/src/gf.c:2305
run_dynamics_extended at /mnt/irisgpfs/projects/tcp/epillon/FSSH/Param/C_1/particle_methods_2d.jl:263
main at /mnt/irisgpfs/projects/tcp/epillon/FSSH/Param/C_1/extended_standard_FSSH.jl:90
unknown function (ip: 0x2aaac4a0dd3f)
_jl_invoke at /buildworker/worker/package_linux64/build/src/gf.c:2135 [inlined]
jl_apply_generic at /buildworker/worker/package_linux64/build/src/gf.c:2305
_jl_invoke at /buildworker/worker/package_linux64/build/src/gf.c:2141 [inlined]
jl_apply_generic at /buildworker/worker/package_linux64/build/src/gf.c:2305
main at /mnt/irisgpfs/projects/tcp/epillon/FSSH/Param/C_1/extended_standard_FSSH.jl:90
unknown function (ip: 0x2aaac4a0dd3f)
update_density_coefficients at /mnt/irisgpfs/projects/tcp/epillon/FSSH/Param/C_1/particle_methods_2d.jl:46
_jl_invoke at /buildworker/worker/package_linux64/build/src/gf.c:2141 [inlined]
jl_apply_generic at /buildworker/worker/package_linux64/build/src/gf.c:2305
run_dynamics_extended at /mnt/irisgpfs/projects/tcp/epillon/FSSH/Param/C_1/particle_methods_2d.jl:263
jl_typemap_assoc_exact at /buildworker/worker/package_linux64/build/src/julia_internal.h:939 [inlined]
jl_lookup_generic_ at /buildworker/worker/package_linux64/build/src/gf.c:2252 [inlined]
jl_apply_generic at /buildworker/worker/package_linux64/build/src/gf.c:2301
setproperty! at ./Base.jl:21
unknown function (ip: 0x2aaac4a1621c)
_jl_invoke at /buildworker/worker/package_linux64/build/src/gf.c:2135 [inlined]
jl_apply_generic at /buildworker/worker/package_linux64/build/src/gf.c:2305
main at /mnt/irisgpfs/projects/tcp/epillon/FSSH/Param/C_1/extended_standard_FSSH.jl:90
unknown function (ip: 0x2aaac4a0dd3f)
jl_apply at /buildworker/worker/package_linux64/build/src/julia.h:1631 [inlined]
do_call at /buildworker/worker/package_linux64/build/src/interpreter.c:328
_jl_invoke at /buildworker/worker/package_linux64/build/src/gf.c:2135 [inlined]
jl_apply_generic at /buildworker/worker/package_linux64/build/src/gf.c:2305
_jl_invoke at /buildworker/worker/package_linux64/build/src/gf.c:2141 [inlined]
jl_apply_generic at /buildworker/worker/package_linux64/build/src/gf.c:2305
_jl_invoke at /buildworker/worker/package_linux64/build/src/gf.c:2135 [inlined]
jl_apply_generic at /buildworker/worker/package_linux64/build/src/gf.c:2305
update_density_coefficients at /mnt/irisgpfs/projects/tcp/epillon/FSSH/Param/C_1/particle_methods_2d.jl:55
run_dynamics_extended at /mnt/irisgpfs/projects/tcp/epillon/FSSH/Param/C_1/particle_methods_2d.jl:263
eval_value at /buildworker/worker/package_linux64/build/src/interpreter.c:417
_jl_invoke at /buildworker/worker/package_linux64/build/src/gf.c:2135 [inlined]
jl_apply_generic at /buildworker/worker/package_linux64/build/src/gf.c:2305
update_density_coefficients at /mnt/irisgpfs/projects/tcp/epillon/FSSH/Param/C_1/particle_methods_2d.jl:46
run_dynamics_extended at /mnt/irisgpfs/projects/tcp/epillon/FSSH/Param/C_1/particle_methods_2d.jl:263
_jl_invoke at /buildworker/worker/package_linux64/build/src/gf.c:2135 [inlined]
jl_apply_generic at /buildworker/worker/package_linux64/build/src/gf.c:2305
_jl_invoke at /buildworker/worker/package_linux64/build/src/gf.c:2135 [inlined]
jl_apply_generic at /buildworker/worker/package_linux64/build/src/gf.c:2305
update_density_coefficients at /mnt/irisgpfs/projects/tcp/epillon/FSSH/Param/C_1/particle_methods_2d.jl:45
run_dynamics_extended at /mnt/irisgpfs/projects/tcp/epillon/FSSH/Param/C_1/particle_methods_2d.jl:263
update_density_coefficients at /mnt/irisgpfs/projects/tcp/epillon/FSSH/Param/C_1/particle_methods_2d.jl:46
update_density_coefficients at /mnt/irisgpfs/projects/tcp/epillon/FSSH/Param/C_1/particle_methods_2d.jl:48
coeff_b at /mnt/irisgpfs/projects/tcp/epillon/FSSH/Param/C_1/particle_methods_2d.jl:197
run_dynamics_extended at /mnt/irisgpfs/projects/tcp/epillon/FSSH/Param/C_1/particle_methods_2d.jl:263
main at /mnt/irisgpfs/projects/tcp/epillon/FSSH/Param/C_1/extended_standard_FSSH.jl:90
unknown function (ip: 0x2aaac4a0dd3f)
_jl_invoke at /buildworker/worker/package_linux64/build/src/gf.c:2141 [inlined]
jl_apply_generic at /buildworker/worker/package_linux64/build/src/gf.c:2305
run_dynamics_extended at /mnt/irisgpfs/projects/tcp/epillon/FSSH/Param/C_1/particle_methods_2d.jl:263
main at /mnt/irisgpfs/projects/tcp/epillon/FSSH/Param/C_1/extended_standard_FSSH.jl:90
unknown function (ip: 0x2aaac4a0dd3f)
switch_surface at /mnt/irisgpfs/projects/tcp/epillon/FSSH/Param/C_1/particle_methods_2d.jl:207
_jl_invoke at /buildworker/worker/package_linux64/build/src/gf.c:2141 [inlined]
jl_apply_generic at /buildworker/worker/package_linux64/build/src/gf.c:2305
main at /mnt/irisgpfs/projects/tcp/epillon/FSSH/Param/C_1/extended_standard_FSSH.jl:90
unknown function (ip: 0x2aaac4a0dd3f)
_jl_invoke at /buildworker/worker/package_linux64/build/src/gf.c:2141 [inlined]
jl_apply_generic at /buildworker/worker/package_linux64/build/src/gf.c:2305
main at /mnt/irisgpfs/projects/tcp/epillon/FSSH/Param/C_1/extended_standard_FSSH.jl:90
unknown function (ip: 0x2aaac4a0dd3f)
run_dynamics_extended at /mnt/irisgpfs/projects/tcp/epillon/FSSH/Param/C_1/particle_methods_2d.jl:265
main at /mnt/irisgpfs/projects/tcp/epillon/FSSH/Param/C_1/extended_standard_FSSH.jl:90
unknown function (ip: 0x2aaac4a0dd3f)
_jl_invoke at /buildworker/worker/package_linux64/build/src/gf.c:2141 [inlined]
jl_apply_generic at /buildworker/worker/package_linux64/build/src/gf.c:2305
_jl_invoke at /buildworker/worker/package_linux64/build/src/gf.c:2141 [inlined]
jl_apply_generic at /buildworker/worker/package_linux64/build/src/gf.c:2305
main at /mnt/irisgpfs/projects/tcp/epillon/FSSH/Param/C_1/extended_standard_FSSH.jl:90
unknown function (ip: 0x2aaac4a0dd3f)
_jl_invoke at /buildworker/worker/package_linux64/build/src/gf.c:2141 [inlined]
jl_apply_generic at /buildworker/worker/package_linux64/build/src/gf.c:2305
eval_value at /buildworker/worker/package_linux64/build/src/interpreter.c:417
eval_stmt_value at /buildworker/worker/package_linux64/build/src/interpreter.c:368 [inlined]
eval_body at /buildworker/worker/package_linux64/build/src/interpreter.c:778
jl_apply at /buildworker/worker/package_linux64/build/src/julia.h:1631 [inlined]
do_call at /buildworker/worker/package_linux64/build/src/interpreter.c:328
jl_apply at /buildworker/worker/package_linux64/build/src/julia.h:1631 [inlined]
do_call at /buildworker/worker/package_linux64/build/src/interpreter.c:328
jl_apply at /buildworker/worker/package_linux64/build/src/julia.h:1631 [inlined]
do_call at /buildworker/worker/package_linux64/build/src/interpreter.c:328
jl_apply at /buildworker/worker/package_linux64/build/src/julia.h:1631 [inlined]
do_call at /buildworker/worker/package_linux64/build/src/interpreter.c:328
jl_apply at /buildworker/worker/package_linux64/build/src/julia.h:1631 [inlined]
do_call at /buildworker/worker/package_linux64/build/src/interpreter.c:328
eval_stmt_value at /buildworker/worker/package_linux64/build/src/interpreter.c:368 [inlined]
eval_body at /buildworker/worker/package_linux64/build/src/interpreter.c:778
jl_apply at /buildworker/worker/package_linux64/build/src/julia.h:1631 [inlined]
do_call at /buildworker/worker/package_linux64/build/src/interpreter.c:328
jl_interpret_toplevel_thunk_callback at /buildworker/worker/package_linux64/build/src/interpreter.c:888
unknown function (ip: 0xfffffffffffffffe)
unknown function (ip: 0x2aaac278948f)
unknown function (ip: 0xffffffffffffffff)
eval_value at /buildworker/worker/package_linux64/build/src/interpreter.c:417
eval_value at /buildworker/worker/package_linux64/build/src/interpreter.c:417
jl_apply at /buildworker/worker/package_linux64/build/src/julia.h:1631 [inlined]
do_call at /buildworker/worker/package_linux64/build/src/interpreter.c:328
eval_value at /buildworker/worker/package_linux64/build/src/interpreter.c:417
jl_apply at /buildworker/worker/package_linux64/build/src/julia.h:1631 [inlined]
do_call at /buildworker/worker/package_linux64/build/src/interpreter.c:328
jl_apply at /buildworker/worker/package_linux64/build/src/julia.h:1631 [inlined]
do_call at /buildworker/worker/package_linux64/build/src/interpreter.c:328
jl_apply at /buildworker/worker/package_linux64/build/src/julia.h:1631 [inlined]
do_call at /buildworker/worker/package_linux64/build/src/interpreter.c:328
eval_value at /buildworker/worker/package_linux64/build/src/interpreter.c:417
jl_apply at /buildworker/worker/package_linux64/build/src/julia.h:1631 [inlined]
do_call at /buildworker/worker/package_linux64/build/src/interpreter.c:328
eval_value at /buildworker/worker/package_linux64/build/src/interpreter.c:417
jl_interpret_toplevel_thunk_callback at /buildworker/worker/package_linux64/build/src/interpreter.c:888
unknown function (ip: 0xfffffffffffffffe)
unknown function (ip: 0x2aaac278948f)
unknown function (ip: 0xffffffffffffffff)
eval_value at /buildworker/worker/package_linux64/build/src/interpreter.c:417
eval_stmt_value at /buildworker/worker/package_linux64/build/src/interpreter.c:368 [inlined]
eval_body at /buildworker/worker/package_linux64/build/src/interpreter.c:778
eval_stmt_value at /buildworker/worker/package_linux64/build/src/interpreter.c:368 [inlined]
eval_body at /buildworker/worker/package_linux64/build/src/interpreter.c:778
eval_value at /buildworker/worker/package_linux64/build/src/interpreter.c:417
eval_stmt_value at /buildworker/worker/package_linux64/build/src/interpreter.c:368 [inlined]
eval_body at /buildworker/worker/package_linux64/build/src/interpreter.c:778
eval_value at /buildworker/worker/package_linux64/build/src/interpreter.c:417
eval_value at /buildworker/worker/package_linux64/build/src/interpreter.c:417
eval_value at /buildworker/worker/package_linux64/build/src/interpreter.c:417
eval_stmt_value at /buildworker/worker/package_linux64/build/src/interpreter.c:368 [inlined]
eval_body at /buildworker/worker/package_linux64/build/src/interpreter.c:778
eval_value at /buildworker/worker/package_linux64/build/src/interpreter.c:417
eval_stmt_value at /buildworker/worker/package_linux64/build/src/interpreter.c:368 [inlined]
eval_body at /buildworker/worker/package_linux64/build/src/interpreter.c:778
jl_interpret_toplevel_thunk at /buildworker/worker/package_linux64/build/src/interpreter.c:897
eval_stmt_value at /buildworker/worker/package_linux64/build/src/interpreter.c:368 [inlined]
eval_body at /buildworker/worker/package_linux64/build/src/interpreter.c:778
jl_interpret_toplevel_thunk_callback at /buildworker/worker/package_linux64/build/src/interpreter.c:888
unknown function (ip: 0xfffffffffffffffe)
unknown function (ip: 0x2aaac278948f)
unknown function (ip: 0xffffffffffffffff)
jl_interpret_toplevel_thunk_callback at /buildworker/worker/package_linux64/build/src/interpreter.c:888
unknown function (ip: 0xfffffffffffffffe)
unknown function (ip: 0x2aaac278948f)
unknown function (ip: 0xffffffffffffffff)
eval_stmt_value at /buildworker/worker/package_linux64/build/src/interpreter.c:368 [inlined]
eval_body at /buildworker/worker/package_linux64/build/src/interpreter.c:778
jl_interpret_toplevel_thunk_callback at /buildworker/worker/package_linux64/build/src/interpreter.c:888
unknown function (ip: 0xfffffffffffffffe)
unknown function (ip: 0x2aaac278948f)
unknown function (ip: 0xffffffffffffffff)
eval_stmt_value at /buildworker/worker/package_linux64/build/src/interpreter.c:368 [inlined]
eval_body at /buildworker/worker/package_linux64/build/src/interpreter.c:778
eval_stmt_value at /buildworker/worker/package_linux64/build/src/interpreter.c:368 [inlined]
eval_body at /buildworker/worker/package_linux64/build/src/interpreter.c:778
eval_stmt_value at /buildworker/worker/package_linux64/build/src/interpreter.c:368 [inlined]
eval_body at /buildworker/worker/package_linux64/build/src/interpreter.c:778
jl_interpret_toplevel_thunk_callback at /buildworker/worker/package_linux64/build/src/interpreter.c:888
unknown function (ip: 0xfffffffffffffffe)
unknown function (ip: 0x2aaac278948f)
unknown function (ip: 0xffffffffffffffff)
eval_stmt_value at /buildworker/worker/package_linux64/build/src/interpreter.c:368 [inlined]
eval_body at /buildworker/worker/package_linux64/build/src/interpreter.c:778
splev_ at /home/users/epillon/.julia/artifacts/4af195a529c56762113fac4823c38d0d911367a9/lib/libddierckx.so (unknown line)
jl_interpret_toplevel_thunk_callback at /buildworker/worker/package_linux64/build/src/interpreter.c:888
unknown function (ip: 0xfffffffffffffffe)
unknown function (ip: 0x2aaac278948f)
unknown function (ip: 0xffffffffffffffff)
jl_interpret_toplevel_thunk_callback at /buildworker/worker/package_linux64/build/src/interpreter.c:888
unknown function (ip: 0xfffffffffffffffe)
unknown function (ip: 0x2aaac278948f)
unknown function (ip: 0xffffffffffffffff)
jl_interpret_toplevel_thunk at /buildworker/worker/package_linux64/build/src/interpreter.c:897
jl_interpret_toplevel_thunk at /buildworker/worker/package_linux64/build/src/interpreter.c:897
_evaluate at /home/users/epillon/.julia/packages/Dierckx/UZGsb/src/Dierckx.jl:279
jl_interpret_toplevel_thunk_callback at /buildworker/worker/package_linux64/build/src/interpreter.c:888
unknown function (ip: 0xfffffffffffffffe)
unknown function (ip: 0x2aaac278948f)
unknown function (ip: 0xffffffffffffffff)
evaluate at /home/users/epillon/.julia/packages/Dierckx/UZGsb/src/Dierckx.jl:296 [inlined]
Spline1D at /home/users/epillon/.julia/packages/Dierckx/UZGsb/src/Dierckx.jl:1040
unknown function (ip: 0x2aaac4a15397)
jl_interpret_toplevel_thunk at /buildworker/worker/package_linux64/build/src/interpreter.c:897
jl_interpret_toplevel_thunk_callback at /buildworker/worker/package_linux64/build/src/interpreter.c:888
unknown function (ip: 0xfffffffffffffffe)
unknown function (ip: 0x2aaac278948f)
unknown function (ip: 0xffffffffffffffff)
jl_interpret_toplevel_thunk_callback at /buildworker/worker/package_linux64/build/src/interpreter.c:888
unknown function (ip: 0xfffffffffffffffe)
unknown function (ip: 0x2aaac278948f)
unknown function (ip: 0xffffffffffffffff)
jl_interpret_toplevel_thunk_callback at /buildworker/worker/package_linux64/build/src/interpreter.c:888
unknown function (ip: 0xfffffffffffffffe)
unknown function (ip: 0x2aaac278948f)
unknown function (ip: 0xffffffffffffffff)
jl_interpret_toplevel_thunk at /buildworker/worker/package_linux64/build/src/interpreter.c:897
jl_interpret_toplevel_thunk_callback at /buildworker/worker/package_linux64/build/src/interpreter.c:888
unknown function (ip: 0xfffffffffffffffe)
unknown function (ip: 0x2aaac278948f)
unknown function (ip: 0xffffffffffffffff)
jl_toplevel_eval_flex at /buildworker/worker/package_linux64/build/src/toplevel.c:814
jl_interpret_toplevel_thunk at /buildworker/worker/package_linux64/build/src/interpreter.c:897
jl_interpret_toplevel_thunk at /buildworker/worker/package_linux64/build/src/interpreter.c:897
jl_interpret_toplevel_thunk at /buildworker/worker/package_linux64/build/src/interpreter.c:897
jl_interpret_toplevel_thunk at /buildworker/worker/package_linux64/build/src/interpreter.c:897
jl_interpret_toplevel_thunk at /buildworker/worker/package_linux64/build/src/interpreter.c:897
jl_interpret_toplevel_thunk at /buildworker/worker/package_linux64/build/src/interpreter.c:897
jl_interpret_toplevel_thunk at /buildworker/worker/package_linux64/build/src/interpreter.c:897
jl_toplevel_eval_flex at /buildworker/worker/package_linux64/build/src/toplevel.c:814
jl_toplevel_eval_flex at /buildworker/worker/package_linux64/build/src/toplevel.c:814
jl_toplevel_eval_flex at /buildworker/worker/package_linux64/build/src/toplevel.c:814
jl_toplevel_eval_flex at /buildworker/worker/package_linux64/build/src/toplevel.c:814
jl_toplevel_eval_flex at /buildworker/worker/package_linux64/build/src/toplevel.c:814
jl_toplevel_eval_flex at /buildworker/worker/package_linux64/build/src/toplevel.c:814
jl_toplevel_eval_flex at /buildworker/worker/package_linux64/build/src/toplevel.c:814
jl_toplevel_eval_flex at /buildworker/worker/package_linux64/build/src/toplevel.c:814
jl_parse_eval_all at /buildworker/worker/package_linux64/build/src/ast.c:873
jl_toplevel_eval_flex at /buildworker/worker/package_linux64/build/src/toplevel.c:814
jl_toplevel_eval_flex at /buildworker/worker/package_linux64/build/src/toplevel.c:814
jl_load at /buildworker/worker/package_linux64/build/src/toplevel.c:878
jl_toplevel_eval_flex at /buildworker/worker/package_linux64/build/src/toplevel.c:814
_jl_invoke at /buildworker/worker/package_linux64/build/src/gf.c:2135 [inlined]
jl_apply_generic at /buildworker/worker/package_linux64/build/src/gf.c:2305
update_density_coefficients at /mnt/irisgpfs/projects/tcp/epillon/FSSH/Param/C_1/particle_methods_2d.jl:48
run_dynamics_extended at /mnt/irisgpfs/projects/tcp/epillon/FSSH/Param/C_1/particle_methods_2d.jl:263
main at /mnt/irisgpfs/projects/tcp/epillon/FSSH/Param/C_1/extended_standard_FSSH.jl:90
unknown function (ip: 0x2aaac4a0dd3f)
_jl_invoke at /buildworker/worker/package_linux64/build/src/gf.c:2141 [inlined]
jl_apply_generic at /buildworker/worker/package_linux64/build/src/gf.c:2305
splev_ at /home/users/epillon/.julia/artifacts/4af195a529c56762113fac4823c38d0d911367a9/lib/libddierckx.so (unknown line)
jl_parse_eval_all at /buildworker/worker/package_linux64/build/src/ast.c:873
jl_load at /buildworker/worker/package_linux64/build/src/toplevel.c:878

signal (15): Terminated
in expression starting at /mnt/irisgpfs/projects/tcp/epillon/FSSH/Param/C_1/extended_standard_FSSH.jl:142
splev_ at /home/users/epillon/.julia/artifacts/4af195a529c56762113fac4823c38d0d911367a9/lib/libddierckx.so (unknown line)
splev_ at /home/users/epillon/.julia/artifacts/4af195a529c56762113fac4823c38d0d911367a9/lib/libddierckx.so (unknown line)
_evaluate at /home/users/epillon/.julia/packages/Dierckx/UZGsb/src/Dierckx.jl:279
evaluate at /home/users/epillon/.julia/packages/Dierckx/UZGsb/src/Dierckx.jl:296 [inlined]
Spline1D at /home/users/epillon/.julia/packages/Dierckx/UZGsb/src/Dierckx.jl:1040
unknown function (ip: 0x2aaac4a15397)
splev_ at /home/users/epillon/.julia/artifacts/4af195a529c56762113fac4823c38d0d911367a9/lib/libddierckx.so (unknown line)

signal (15): Terminated
in expression starting at /mnt/irisgpfs/projects/tcp/epillon/FSSH/Param/C_1/extended_standard_FSSH.jl:142
_evaluate at /home/users/epillon/.julia/packages/Dierckx/UZGsb/src/Dierckx.jl:279
evaluate at /home/users/epillon/.julia/packages/Dierckx/UZGsb/src/Dierckx.jl:296 [inlined]
Spline1D at /home/users/epillon/.julia/packages/Dierckx/UZGsb/src/Dierckx.jl:1040
unknown function (ip: 0x2aaac4a15397)
_evaluate at /home/users/epillon/.julia/packages/Dierckx/UZGsb/src/Dierckx.jl:279
evaluate at /home/users/epillon/.julia/packages/Dierckx/UZGsb/src/Dierckx.jl:296 [inlined]
Spline1D at /home/users/epillon/.julia/packages/Dierckx/UZGsb/src/Dierckx.jl:1040
unknown function (ip: 0x2aaac4a15397)
splev_ at /home/users/epillon/.julia/artifacts/4af195a529c56762113fac4823c38d0d911367a9/lib/libddierckx.so (unknown line)
jl_parse_eval_all at /buildworker/worker/package_linux64/build/src/ast.c:873
_evaluate at /home/users/epillon/.julia/packages/Dierckx/UZGsb/src/Dierckx.jl:279
evaluate at /home/users/epillon/.julia/packages/Dierckx/UZGsb/src/Dierckx.jl:296 [inlined]
Spline1D at /home/users/epillon/.julia/packages/Dierckx/UZGsb/src/Dierckx.jl:1040
jl_load at /buildworker/worker/package_linux64/build/src/toplevel.c:878
unknown function (ip: 0x2aaac4a15397)
_jl_invoke at /buildworker/worker/package_linux64/build/src/gf.c:2135 [inlined]
jl_apply_generic at /buildworker/worker/package_linux64/build/src/gf.c:2305
update_density_coefficients at /mnt/irisgpfs/projects/tcp/epillon/FSSH/Param/C_1/particle_methods_2d.jl:46
run_dynamics_extended at /mnt/irisgpfs/projects/tcp/epillon/FSSH/Param/C_1/particle_methods_2d.jl:263
jl_parse_eval_all at /buildworker/worker/package_linux64/build/src/ast.c:873
jl_load at /buildworker/worker/package_linux64/build/src/toplevel.c:878
_evaluate at /home/users/epillon/.julia/packages/Dierckx/UZGsb/src/Dierckx.jl:279
evaluate at /home/users/epillon/.julia/packages/Dierckx/UZGsb/src/Dierckx.jl:296 [inlined]
Spline1D at /home/users/epillon/.julia/packages/Dierckx/UZGsb/src/Dierckx.jl:1040
unknown function (ip: 0x2aaac4a15397)
main at /mnt/irisgpfs/projects/tcp/epillon/FSSH/Param/C_1/extended_standard_FSSH.jl:90
unknown function (ip: 0x2aaac4a0dd3f)
_jl_invoke at /buildworker/worker/package_linux64/build/src/gf.c:2141 [inlined]
jl_apply_generic at /buildworker/worker/package_linux64/build/src/gf.c:2305
jl_apply at /buildworker/worker/package_linux64/build/src/julia.h:1631 [inlined]
do_call at /buildworker/worker/package_linux64/build/src/interpreter.c:328
eval_value at /buildworker/worker/package_linux64/build/src/interpreter.c:417
jl_apply at /buildworker/worker/package_linux64/build/src/julia.h:1631 [inlined]
do_call at /buildworker/worker/package_linux64/build/src/interpreter.c:328
_jl_invoke at /buildworker/worker/package_linux64/build/src/gf.c:2135 [inlined]
jl_apply_generic at /buildworker/worker/package_linux64/build/src/gf.c:2305
eval_stmt_value at /buildworker/worker/package_linux64/build/src/interpreter.c:368 [inlined]
eval_body at /buildworker/worker/package_linux64/build/src/interpreter.c:778
update_density_coefficients at /mnt/irisgpfs/projects/tcp/epillon/FSSH/Param/C_1/particle_methods_2d.jl:45
run_dynamics_extended at /mnt/irisgpfs/projects/tcp/epillon/FSSH/Param/C_1/particle_methods_2d.jl:263
_jl_invoke at /buildworker/worker/package_linux64/build/src/gf.c:2135 [inlined]
jl_apply_generic at /buildworker/worker/package_linux64/build/src/gf.c:2305
_jl_invoke at /buildworker/worker/package_linux64/build/src/gf.c:2135 [inlined]
jl_apply_generic at /buildworker/worker/package_linux64/build/src/gf.c:2305
update_density_coefficients at /mnt/irisgpfs/projects/tcp/epillon/FSSH/Param/C_1/particle_methods_2d.jl:48
main at /mnt/irisgpfs/projects/tcp/epillon/FSSH/Param/C_1/extended_standard_FSSH.jl:90
unknown function (ip: 0x2aaac4a0dd3f)
run_dynamics_extended at /mnt/irisgpfs/projects/tcp/epillon/FSSH/Param/C_1/particle_methods_2d.jl:263
_jl_invoke at /buildworker/worker/package_linux64/build/src/gf.c:2141 [inlined]
jl_apply_generic at /buildworker/worker/package_linux64/build/src/gf.c:2305
update_density_coefficients at /mnt/irisgpfs/projects/tcp/epillon/FSSH/Param/C_1/particle_methods_2d.jl:46
run_dynamics_extended at /mnt/irisgpfs/projects/tcp/epillon/FSSH/Param/C_1/particle_methods_2d.jl:263
_jl_invoke at /buildworker/worker/package_linux64/build/src/gf.c:2135 [inlined]
jl_apply_generic at /buildworker/worker/package_linux64/build/src/gf.c:2305
main at /mnt/irisgpfs/projects/tcp/epillon/FSSH/Param/C_1/extended_standard_FSSH.jl:90
unknown function (ip: 0x2aaac4a0dd3f)
_jl_invoke at /buildworker/worker/package_linux64/build/src/gf.c:2141 [inlined]
jl_apply_generic at /buildworker/worker/package_linux64/build/src/gf.c:2305
main at /mnt/irisgpfs/projects/tcp/epillon/FSSH/Param/C_1/extended_standard_FSSH.jl:90
unknown function (ip: 0x2aaac4a0dd3f)
update_density_coefficients at /mnt/irisgpfs/projects/tcp/epillon/FSSH/Param/C_1/particle_methods_2d.jl:46
_jl_invoke at /buildworker/worker/package_linux64/build/src/gf.c:2141 [inlined]
jl_apply_generic at /buildworker/worker/package_linux64/build/src/gf.c:2305
run_dynamics_extended at /mnt/irisgpfs/projects/tcp/epillon/FSSH/Param/C_1/particle_methods_2d.jl:263
eval_value at /buildworker/worker/package_linux64/build/src/interpreter.c:417
_jl_invoke at /buildworker/worker/package_linux64/build/src/gf.c:2135 [inlined]
jl_apply_generic at /buildworker/worker/package_linux64/build/src/gf.c:2305
main at /mnt/irisgpfs/projects/tcp/epillon/FSSH/Param/C_1/extended_standard_FSSH.jl:90
unknown function (ip: 0x2aaac4a0dd3f)
jl_interpret_toplevel_thunk_callback at /buildworker/worker/package_linux64/build/src/interpreter.c:888
unknown function (ip: 0xfffffffffffffffe)
unknown function (ip: 0x2aaac278948f)
unknown function (ip: 0xffffffffffffffff)
_jl_invoke at /buildworker/worker/package_linux64/build/src/gf.c:2141 [inlined]
jl_apply_generic at /buildworker/worker/package_linux64/build/src/gf.c:2305
update_density_coefficients at /mnt/irisgpfs/projects/tcp/epillon/FSSH/Param/C_1/particle_methods_2d.jl:48
run_dynamics_extended at /mnt/irisgpfs/projects/tcp/epillon/FSSH/Param/C_1/particle_methods_2d.jl:263
main at /mnt/irisgpfs/projects/tcp/epillon/FSSH/Param/C_1/extended_standard_FSSH.jl:90
unknown function (ip: 0x2aaac4a0dd3f)
_jl_invoke at /buildworker/worker/package_linux64/build/src/gf.c:2141 [inlined]
jl_apply_generic at /buildworker/worker/package_linux64/build/src/gf.c:2305
splev_ at /home/users/epillon/.julia/artifacts/4af195a529c56762113fac4823c38d0d911367a9/lib/libddierckx.so (unknown line)
eval_stmt_value at /buildworker/worker/package_linux64/build/src/interpreter.c:368 [inlined]
eval_body at /buildworker/worker/package_linux64/build/src/interpreter.c:778
jl_interpret_toplevel_thunk at /buildworker/worker/package_linux64/build/src/interpreter.c:897
jl_apply at /buildworker/worker/package_linux64/build/src/julia.h:1631 [inlined]
do_call at /buildworker/worker/package_linux64/build/src/interpreter.c:328
jl_apply at /buildworker/worker/package_linux64/build/src/julia.h:1631 [inlined]
do_call at /buildworker/worker/package_linux64/build/src/interpreter.c:328
jl_apply at /buildworker/worker/package_linux64/build/src/julia.h:1631 [inlined]
do_call at /buildworker/worker/package_linux64/build/src/interpreter.c:328
jl_interpret_toplevel_thunk_callback at /buildworker/worker/package_linux64/build/src/interpreter.c:888
unknown function (ip: 0xfffffffffffffffe)
unknown function (ip: 0x2aaac278948f)
unknown function (ip: 0xffffffffffffffff)
jl_apply at /buildworker/worker/package_linux64/build/src/julia.h:1631 [inlined]
do_call at /buildworker/worker/package_linux64/build/src/interpreter.c:328
_evaluate at /home/users/epillon/.julia/packages/Dierckx/UZGsb/src/Dierckx.jl:279
evaluate at /home/users/epillon/.julia/packages/Dierckx/UZGsb/src/Dierckx.jl:296 [inlined]
eval_value at /buildworker/worker/package_linux64/build/src/interpreter.c:417
jl_apply at /buildworker/worker/package_linux64/build/src/julia.h:1631 [inlined]
do_call at /buildworker/worker/package_linux64/build/src/interpreter.c:328
eval_value at /buildworker/worker/package_linux64/build/src/interpreter.c:417
Spline1D at /home/users/epillon/.julia/packages/Dierckx/UZGsb/src/Dierckx.jl:1040
eval_value at /buildworker/worker/package_linux64/build/src/interpreter.c:417
unknown function (ip: 0x2aaac4a15397)
jl_toplevel_eval_flex at /buildworker/worker/package_linux64/build/src/toplevel.c:814
jl_interpret_toplevel_thunk at /buildworker/worker/package_linux64/build/src/interpreter.c:897
eval_value at /buildworker/worker/package_linux64/build/src/interpreter.c:417
eval_stmt_value at /buildworker/worker/package_linux64/build/src/interpreter.c:368 [inlined]
eval_body at /buildworker/worker/package_linux64/build/src/interpreter.c:778
eval_value at /buildworker/worker/package_linux64/build/src/interpreter.c:417
eval_stmt_value at /buildworker/worker/package_linux64/build/src/interpreter.c:368 [inlined]
eval_body at /buildworker/worker/package_linux64/build/src/interpreter.c:778
eval_stmt_value at /buildworker/worker/package_linux64/build/src/interpreter.c:368 [inlined]
eval_body at /buildworker/worker/package_linux64/build/src/interpreter.c:778
eval_stmt_value at /buildworker/worker/package_linux64/build/src/interpreter.c:368 [inlined]
eval_body at /buildworker/worker/package_linux64/build/src/interpreter.c:778
jl_interpret_toplevel_thunk_callback at /buildworker/worker/package_linux64/build/src/interpreter.c:888
unknown function (ip: 0xfffffffffffffffe)
unknown function (ip: 0x2aaac278948f)
unknown function (ip: 0xffffffffffffffff)
jl_interpret_toplevel_thunk_callback at /buildworker/worker/package_linux64/build/src/interpreter.c:888
unknown function (ip: 0xfffffffffffffffe)
unknown function (ip: 0x2aaac278948f)
unknown function (ip: 0xffffffffffffffff)
jl_toplevel_eval_flex at /buildworker/worker/package_linux64/build/src/toplevel.c:814
jl_interpret_toplevel_thunk_callback at /buildworker/worker/package_linux64/build/src/interpreter.c:888
unknown function (ip: 0xfffffffffffffffe)
unknown function (ip: 0x2aaac278948f)
unknown function (ip: 0xffffffffffffffff)
jl_interpret_toplevel_thunk_callback at /buildworker/worker/package_linux64/build/src/interpreter.c:888
unknown function (ip: 0xfffffffffffffffe)
unknown function (ip: 0x2aaac278948f)
unknown function (ip: 0xffffffffffffffff)
jl_parse_eval_all at /buildworker/worker/package_linux64/build/src/ast.c:873
jl_load at /buildworker/worker/package_linux64/build/src/toplevel.c:878
jl_interpret_toplevel_thunk at /buildworker/worker/package_linux64/build/src/interpreter.c:897
jl_interpret_toplevel_thunk at /buildworker/worker/package_linux64/build/src/interpreter.c:897
jl_interpret_toplevel_thunk at /buildworker/worker/package_linux64/build/src/interpreter.c:897

signal (15): Terminated
in expression starting at /mnt/irisgpfs/projects/tcp/epillon/FSSH/Param/C_1/extended_standard_FSSH.jl:142
jl_interpret_toplevel_thunk at /buildworker/worker/package_linux64/build/src/interpreter.c:897
splev_ at /home/users/epillon/.julia/artifacts/4af195a529c56762113fac4823c38d0d911367a9/lib/libddierckx.so (unknown line)
splev_ at /home/users/epillon/.julia/artifacts/4af195a529c56762113fac4823c38d0d911367a9/lib/libddierckx.so (unknown line)
_evaluate at /home/users/epillon/.julia/packages/Dierckx/UZGsb/src/Dierckx.jl:279
evaluate at /home/users/epillon/.julia/packages/Dierckx/UZGsb/src/Dierckx.jl:296 [inlined]
Spline1D at /home/users/epillon/.julia/packages/Dierckx/UZGsb/src/Dierckx.jl:1040
unknown function (ip: 0x2aaac4a15397)
_evaluate at /home/users/epillon/.julia/packages/Dierckx/UZGsb/src/Dierckx.jl:279
evaluate at /home/users/epillon/.julia/packages/Dierckx/UZGsb/src/Dierckx.jl:296 [inlined]
Spline1D at /home/users/epillon/.julia/packages/Dierckx/UZGsb/src/Dierckx.jl:1040
unknown function (ip: 0x2aaac4a15397)
jl_parse_eval_all at /buildworker/worker/package_linux64/build/src/ast.c:873
jl_load at /buildworker/worker/package_linux64/build/src/toplevel.c:878
jl_toplevel_eval_flex at /buildworker/worker/package_linux64/build/src/toplevel.c:814
jl_toplevel_eval_flex at /buildworker/worker/package_linux64/build/src/toplevel.c:814
jl_toplevel_eval_flex at /buildworker/worker/package_linux64/build/src/toplevel.c:814
jl_toplevel_eval_flex at /buildworker/worker/package_linux64/build/src/toplevel.c:814
splev_ at /home/users/epillon/.julia/artifacts/4af195a529c56762113fac4823c38d0d911367a9/lib/libddierckx.so (unknown line)
splev_ at /home/users/epillon/.julia/artifacts/4af195a529c56762113fac4823c38d0d911367a9/lib/libddierckx.so (unknown line)
_evaluate at /home/users/epillon/.julia/packages/Dierckx/UZGsb/src/Dierckx.jl:279
_evaluate at /home/users/epillon/.julia/packages/Dierckx/UZGsb/src/Dierckx.jl:279
evaluate at /home/users/epillon/.julia/packages/Dierckx/UZGsb/src/Dierckx.jl:296 [inlined]
Spline1D at /home/users/epillon/.julia/packages/Dierckx/UZGsb/src/Dierckx.jl:1040
unknown function (ip: 0x2aaac4a15397)
evaluate at /home/users/epillon/.julia/packages/Dierckx/UZGsb/src/Dierckx.jl:296 [inlined]
Spline1D at /home/users/epillon/.julia/packages/Dierckx/UZGsb/src/Dierckx.jl:1040
unknown function (ip: 0x2aaac4a15397)
jl_parse_eval_all at /buildworker/worker/package_linux64/build/src/ast.c:873
jl_load at /buildworker/worker/package_linux64/build/src/toplevel.c:878
jl_parse_eval_all at /buildworker/worker/package_linux64/build/src/ast.c:873
_jl_invoke at /buildworker/worker/package_linux64/build/src/gf.c:2135 [inlined]
jl_apply_generic at /buildworker/worker/package_linux64/build/src/gf.c:2305
jl_load at /buildworker/worker/package_linux64/build/src/toplevel.c:878
_jl_invoke at /buildworker/worker/package_linux64/build/src/gf.c:2135 [inlined]
jl_apply_generic at /buildworker/worker/package_linux64/build/src/gf.c:2305
update_density_coefficients at /mnt/irisgpfs/projects/tcp/epillon/FSSH/Param/C_1/particle_methods_2d.jl:48
run_dynamics_extended at /mnt/irisgpfs/projects/tcp/epillon/FSSH/Param/C_1/particle_methods_2d.jl:263
update_density_coefficients at /mnt/irisgpfs/projects/tcp/epillon/FSSH/Param/C_1/particle_methods_2d.jl:48
run_dynamics_extended at /mnt/irisgpfs/projects/tcp/epillon/FSSH/Param/C_1/particle_methods_2d.jl:263
jl_parse_eval_all at /buildworker/worker/package_linux64/build/src/ast.c:873
jl_load at /buildworker/worker/package_linux64/build/src/toplevel.c:878
main at /mnt/irisgpfs/projects/tcp/epillon/FSSH/Param/C_1/extended_standard_FSSH.jl:90
unknown function (ip: 0x2aaac4a0dd3f)
_jl_invoke at /buildworker/worker/package_linux64/build/src/gf.c:2141 [inlined]
jl_apply_generic at /buildworker/worker/package_linux64/build/src/gf.c:2305
main at /mnt/irisgpfs/projects/tcp/epillon/FSSH/Param/C_1/extended_standard_FSSH.jl:90
unknown function (ip: 0x2aaac4a0dd3f)
_jl_invoke at /buildworker/worker/package_linux64/build/src/gf.c:2141 [inlined]
jl_apply_generic at /buildworker/worker/package_linux64/build/src/gf.c:2305
_jl_invoke at /buildworker/worker/package_linux64/build/src/gf.c:2135 [inlined]
jl_apply_generic at /buildworker/worker/package_linux64/build/src/gf.c:2305
update_density_coefficients at /mnt/irisgpfs/projects/tcp/epillon/FSSH/Param/C_1/particle_methods_2d.jl:48
run_dynamics_extended at /mnt/irisgpfs/projects/tcp/epillon/FSSH/Param/C_1/particle_methods_2d.jl:263
main at /mnt/irisgpfs/projects/tcp/epillon/FSSH/Param/C_1/extended_standard_FSSH.jl:90
unknown function (ip: 0x2aaac4a0dd3f)
_jl_invoke at /buildworker/worker/package_linux64/build/src/gf.c:2135 [inlined]
jl_apply_generic at /buildworker/worker/package_linux64/build/src/gf.c:2305
_jl_invoke at /buildworker/worker/package_linux64/build/src/gf.c:2135 [inlined]
jl_apply_generic at /buildworker/worker/package_linux64/build/src/gf.c:2305
der_surface at /mnt/irisgpfs/projects/tcp/epillon/FSSH/Param/C_1/particle_methods_2d.jl:62
jl_apply at /buildworker/worker/package_linux64/build/src/julia.h:1631 [inlined]
do_call at /buildworker/worker/package_linux64/build/src/interpreter.c:328
update_density_coefficients at /mnt/irisgpfs/projects/tcp/epillon/FSSH/Param/C_1/particle_methods_2d.jl:48
run_dynamics_extended at /mnt/irisgpfs/projects/tcp/epillon/FSSH/Param/C_1/particle_methods_2d.jl:263
jl_apply at /buildworker/worker/package_linux64/build/src/julia.h:1631 [inlined]
do_call at /buildworker/worker/package_linux64/build/src/interpreter.c:328
der_surface at /mnt/irisgpfs/projects/tcp/epillon/FSSH/Param/C_1/particle_methods_2d.jl:60 [inlined]
time_evolution_extended at /mnt/irisgpfs/projects/tcp/epillon/FSSH/Param/C_1/particle_methods_2d.jl:163
run_dynamics_extended at /mnt/irisgpfs/projects/tcp/epillon/FSSH/Param/C_1/particle_methods_2d.jl:261
main at /mnt/irisgpfs/projects/tcp/epillon/FSSH/Param/C_1/extended_standard_FSSH.jl:90
unknown function (ip: 0x2aaac4a0dd3f)
_jl_invoke at /buildworker/worker/package_linux64/build/src/gf.c:2141 [inlined]
jl_apply_generic at /buildworker/worker/package_linux64/build/src/gf.c:2305
main at /mnt/irisgpfs/projects/tcp/epillon/FSSH/Param/C_1/extended_standard_FSSH.jl:90
unknown function (ip: 0x2aaac4a0dd3f)
_jl_invoke at /buildworker/worker/package_linux64/build/src/gf.c:2141 [inlined]
jl_apply_generic at /buildworker/worker/package_linux64/build/src/gf.c:2305
splev_ at /home/users/epillon/.julia/artifacts/4af195a529c56762113fac4823c38d0d911367a9/lib/libddierckx.so (unknown line)
_jl_invoke at /buildworker/worker/package_linux64/build/src/gf.c:2141 [inlined]
jl_apply_generic at /buildworker/worker/package_linux64/build/src/gf.c:2305
eval_value at /buildworker/worker/package_linux64/build/src/interpreter.c:417
_evaluate at /home/users/epillon/.julia/packages/Dierckx/UZGsb/src/Dierckx.jl:279
evaluate at /home/users/epillon/.julia/packages/Dierckx/UZGsb/src/Dierckx.jl:296 [inlined]
Spline1D at /home/users/epillon/.julia/packages/Dierckx/UZGsb/src/Dierckx.jl:1040
eval_value at /buildworker/worker/package_linux64/build/src/interpreter.c:417
unknown function (ip: 0x2aaac4a15397)
eval_stmt_value at /buildworker/worker/package_linux64/build/src/interpreter.c:368 [inlined]
eval_body at /buildworker/worker/package_linux64/build/src/interpreter.c:778
eval_stmt_value at /buildworker/worker/package_linux64/build/src/interpreter.c:368 [inlined]
eval_body at /buildworker/worker/package_linux64/build/src/interpreter.c:778
jl_apply at /buildworker/worker/package_linux64/build/src/julia.h:1631 [inlined]
do_call at /buildworker/worker/package_linux64/build/src/interpreter.c:328
jl_apply at /buildworker/worker/package_linux64/build/src/julia.h:1631 [inlined]
do_call at /buildworker/worker/package_linux64/build/src/interpreter.c:328
jl_interpret_toplevel_thunk_callback at /buildworker/worker/package_linux64/build/src/interpreter.c:888
unknown function (ip: 0xfffffffffffffffe)
unknown function (ip: 0x2aaac278948f)
unknown function (ip: 0xffffffffffffffff)
jl_interpret_toplevel_thunk_callback at /buildworker/worker/package_linux64/build/src/interpreter.c:888
unknown function (ip: 0xfffffffffffffffe)
unknown function (ip: 0x2aaac278948f)
unknown function (ip: 0xffffffffffffffff)
eval_value at /buildworker/worker/package_linux64/build/src/interpreter.c:417
eval_value at /buildworker/worker/package_linux64/build/src/interpreter.c:417
jl_apply at /buildworker/worker/package_linux64/build/src/julia.h:1631 [inlined]
jl_parse_eval_all at /buildworker/worker/package_linux64/build/src/ast.c:873
jl_load at /buildworker/worker/package_linux64/build/src/toplevel.c:878
do_call at /buildworker/worker/package_linux64/build/src/interpreter.c:328
jl_interpret_toplevel_thunk at /buildworker/worker/package_linux64/build/src/interpreter.c:897
eval_stmt_value at /buildworker/worker/package_linux64/build/src/interpreter.c:368 [inlined]
eval_body at /buildworker/worker/package_linux64/build/src/interpreter.c:778
jl_interpret_toplevel_thunk at /buildworker/worker/package_linux64/build/src/interpreter.c:897
_jl_invoke at /buildworker/worker/package_linux64/build/src/gf.c:2135 [inlined]
jl_apply_generic at /buildworker/worker/package_linux64/build/src/gf.c:2305
eval_stmt_value at /buildworker/worker/package_linux64/build/src/interpreter.c:368 [inlined]
eval_body at /buildworker/worker/package_linux64/build/src/interpreter.c:778
update_density_coefficients at /mnt/irisgpfs/projects/tcp/epillon/FSSH/Param/C_1/particle_methods_2d.jl:45
run_dynamics_extended at /mnt/irisgpfs/projects/tcp/epillon/FSSH/Param/C_1/particle_methods_2d.jl:263
main at /mnt/irisgpfs/projects/tcp/epillon/FSSH/Param/C_1/extended_standard_FSSH.jl:90
unknown function (ip: 0x2aaac4a0dd3f)
_jl_invoke at /buildworker/worker/package_linux64/build/src/gf.c:2141 [inlined]
jl_apply_generic at /buildworker/worker/package_linux64/build/src/gf.c:2305
jl_interpret_toplevel_thunk_callback at /buildworker/worker/package_linux64/build/src/interpreter.c:888
unknown function (ip: 0xfffffffffffffffe)
unknown function (ip: 0x2aaac278948f)
unknown function (ip: 0xffffffffffffffff)
jl_interpret_toplevel_thunk at /buildworker/worker/package_linux64/build/src/interpreter.c:897
jl_interpret_toplevel_thunk_callback at /buildworker/worker/package_linux64/build/src/interpreter.c:888
unknown function (ip: 0xfffffffffffffffe)
unknown function (ip: 0x2aaac278948f)
unknown function (ip: 0xffffffffffffffff)
jl_toplevel_eval_flex at /buildworker/worker/package_linux64/build/src/toplevel.c:814
jl_toplevel_eval_flex at /buildworker/worker/package_linux64/build/src/toplevel.c:814
jl_interpret_toplevel_thunk at /buildworker/worker/package_linux64/build/src/interpreter.c:897
eval_value at /buildworker/worker/package_linux64/build/src/interpreter.c:417
jl_interpret_toplevel_thunk at /buildworker/worker/package_linux64/build/src/interpreter.c:897
jl_apply at /buildworker/worker/package_linux64/build/src/julia.h:1631 [inlined]
do_call at /buildworker/worker/package_linux64/build/src/interpreter.c:328
jl_toplevel_eval_flex at /buildworker/worker/package_linux64/build/src/toplevel.c:814
eval_value at /buildworker/worker/package_linux64/build/src/interpreter.c:417
eval_stmt_value at /buildworker/worker/package_linux64/build/src/interpreter.c:368 [inlined]
jl_toplevel_eval_flex at /buildworker/worker/package_linux64/build/src/toplevel.c:814
jl_toplevel_eval_flex at /buildworker/worker/package_linux64/build/src/toplevel.c:814
eval_body at /buildworker/worker/package_linux64/build/src/interpreter.c:778
jl_parse_eval_all at /buildworker/worker/package_linux64/build/src/ast.c:873
jl_load at /buildworker/worker/package_linux64/build/src/toplevel.c:878
jl_parse_eval_all at /buildworker/worker/package_linux64/build/src/ast.c:873
jl_load at /buildworker/worker/package_linux64/build/src/toplevel.c:878
eval_stmt_value at /buildworker/worker/package_linux64/build/src/interpreter.c:368 [inlined]
eval_body at /buildworker/worker/package_linux64/build/src/interpreter.c:778
jl_parse_eval_all at /buildworker/worker/package_linux64/build/src/ast.c:873
jl_load at /buildworker/worker/package_linux64/build/src/toplevel.c:878
jl_interpret_toplevel_thunk_callback at /buildworker/worker/package_linux64/build/src/interpreter.c:888
unknown function (ip: 0xfffffffffffffffe)
unknown function (ip: 0x2aaac278948f)
unknown function (ip: 0xffffffffffffffff)
jl_interpret_toplevel_thunk_callback at /buildworker/worker/package_linux64/build/src/interpreter.c:888
unknown function (ip: 0xfffffffffffffffe)
unknown function (ip: 0x2aaac278948f)
jl_parse_eval_all at /buildworker/worker/package_linux64/build/src/ast.c:873
jl_load at /buildworker/worker/package_linux64/build/src/toplevel.c:878
jl_parse_eval_all at /buildworker/worker/package_linux64/build/src/ast.c:873
jl_load at /buildworker/worker/package_linux64/build/src/toplevel.c:878
jl_interpret_toplevel_thunk at /buildworker/worker/package_linux64/build/src/interpreter.c:897
unknown function (ip: 0xffffffffffffffff)
jl_parse_eval_all at /buildworker/worker/package_linux64/build/src/ast.c:873
jl_load at /buildworker/worker/package_linux64/build/src/toplevel.c:878
jl_interpret_toplevel_thunk at /buildworker/worker/package_linux64/build/src/interpreter.c:897
jl_toplevel_eval_flex at /buildworker/worker/package_linux64/build/src/toplevel.c:814
jl_parse_eval_all at /buildworker/worker/package_linux64/build/src/ast.c:873
jl_load at /buildworker/worker/package_linux64/build/src/toplevel.c:878
jl_parse_eval_all at /buildworker/worker/package_linux64/build/src/ast.c:873
jl_load at /buildworker/worker/package_linux64/build/src/toplevel.c:878

signal (15): Terminated
in expression starting at /mnt/irisgpfs/projects/tcp/epillon/FSSH/Param/C_1/extended_standard_FSSH.jl:142
jl_parse_eval_all at /buildworker/worker/package_linux64/build/src/ast.c:873
jl_load at /buildworker/worker/package_linux64/build/src/toplevel.c:878
splev_ at /home/users/epillon/.julia/artifacts/4af195a529c56762113fac4823c38d0d911367a9/lib/libddierckx.so (unknown line)
_evaluate at /home/users/epillon/.julia/packages/Dierckx/UZGsb/src/Dierckx.jl:279
evaluate at /home/users/epillon/.julia/packages/Dierckx/UZGsb/src/Dierckx.jl:296 [inlined]
Spline1D at /home/users/epillon/.julia/packages/Dierckx/UZGsb/src/Dierckx.jl:1040
unknown function (ip: 0x2aaac4a15397)
jl_parse_eval_all at /buildworker/worker/package_linux64/build/src/ast.c:873
jl_load at /buildworker/worker/package_linux64/build/src/toplevel.c:878
jl_toplevel_eval_flex at /buildworker/worker/package_linux64/build/src/toplevel.c:814
jl_parse_eval_all at /buildworker/worker/package_linux64/build/src/ast.c:873
jl_load at /buildworker/worker/package_linux64/build/src/toplevel.c:878
jl_parse_eval_all at /buildworker/worker/package_linux64/build/src/ast.c:873
jl_load at /buildworker/worker/package_linux64/build/src/toplevel.c:878
_jl_invoke at /buildworker/worker/package_linux64/build/src/gf.c:2135 [inlined]
jl_apply_generic at /buildworker/worker/package_linux64/build/src/gf.c:2305
update_density_coefficients at /mnt/irisgpfs/projects/tcp/epillon/FSSH/Param/C_1/particle_methods_2d.jl:48
splev_ at /home/users/epillon/.julia/artifacts/4af195a529c56762113fac4823c38d0d911367a9/lib/libddierckx.so (unknown line)
run_dynamics_extended at /mnt/irisgpfs/projects/tcp/epillon/FSSH/Param/C_1/particle_methods_2d.jl:263
main at /mnt/irisgpfs/projects/tcp/epillon/FSSH/Param/C_1/extended_standard_FSSH.jl:90
unknown function (ip: 0x2aaac4a0dd3f)
_jl_invoke at /buildworker/worker/package_linux64/build/src/gf.c:2141 [inlined]
jl_apply_generic at /buildworker/worker/package_linux64/build/src/gf.c:2305
_evaluate at /home/users/epillon/.julia/packages/Dierckx/UZGsb/src/Dierckx.jl:279
evaluate at /home/users/epillon/.julia/packages/Dierckx/UZGsb/src/Dierckx.jl:296 [inlined]
Spline1D at /home/users/epillon/.julia/packages/Dierckx/UZGsb/src/Dierckx.jl:1040
unknown function (ip: 0x2aaac4a15397)
jl_parse_eval_all at /buildworker/worker/package_linux64/build/src/ast.c:873
jl_load at /buildworker/worker/package_linux64/build/src/toplevel.c:878
jl_apply at /buildworker/worker/package_linux64/build/src/julia.h:1631 [inlined]
do_call at /buildworker/worker/package_linux64/build/src/interpreter.c:328
jl_parse_eval_all at /buildworker/worker/package_linux64/build/src/ast.c:873
eval_value at /buildworker/worker/package_linux64/build/src/interpreter.c:417
jl_load at /buildworker/worker/package_linux64/build/src/toplevel.c:878
eval_stmt_value at /buildworker/worker/package_linux64/build/src/interpreter.c:368 [inlined]
eval_body at /buildworker/worker/package_linux64/build/src/interpreter.c:778
jl_interpret_toplevel_thunk_callback at /buildworker/worker/package_linux64/build/src/interpreter.c:888
unknown function (ip: 0xfffffffffffffffe)
unknown function (ip: 0x2aaac278948f)
unknown function (ip: 0xffffffffffffffff)
jl_interpret_toplevel_thunk at /buildworker/worker/package_linux64/build/src/interpreter.c:897
jl_toplevel_eval_flex at /buildworker/worker/package_linux64/build/src/toplevel.c:814
jl_parse_eval_all at /buildworker/worker/package_linux64/build/src/ast.c:873
jl_load at /buildworker/worker/package_linux64/build/src/toplevel.c:878
eval_stmt_value at /buildworker/worker/package_linux64/build/src/interpreter.c:368 [inlined]
eval_body at /buildworker/worker/package_linux64/build/src/interpreter.c:778
jl_interpret_toplevel_thunk_callback at /buildworker/worker/package_linux64/build/src/interpreter.c:888
unknown function (ip: 0xfffffffffffffffe)
unknown function (ip: 0x2aaac278948f)
unknown function (ip: 0xffffffffffffffff)
jl_interpret_toplevel_thunk at /buildworker/worker/package_linux64/build/src/interpreter.c:897
jl_parse_eval_all at /buildworker/worker/package_linux64/build/src/ast.c:873
jl_load at /buildworker/worker/package_linux64/build/src/toplevel.c:878
jl_toplevel_eval_flex at /buildworker/worker/package_linux64/build/src/toplevel.c:814
jl_parse_eval_all at /buildworker/worker/package_linux64/build/src/ast.c:873
jl_load at /buildworker/worker/package_linux64/build/src/toplevel.c:878
include at ./boot.jl:328 [inlined]
include_relative at ./loading.jl:1105
include at ./Base.jl:31
_jl_invoke at /buildworker/worker/package_linux64/build/src/gf.c:2135 [inlined]
jl_apply_generic at /buildworker/worker/package_linux64/build/src/gf.c:2305
exec_options at ./client.jl:287
_start at ./client.jl:460
jfptr__start_2084.clone_1 at /mnt/irisgpfs/apps/resif/data/production/v1.2-20191021/default/software/lang/Julia/1.3.0/lib/julia/sys.so (unknown line)
_jl_invoke at /buildworker/worker/package_linux64/build/src/gf.c:2135 [inlined]
jl_apply_generic at /buildworker/worker/package_linux64/build/src/gf.c:2305
jl_apply at /buildworker/worker/package_linux64/build/ui/../src/julia.h:1631 [inlined]
true_main at /buildworker/worker/package_linux64/build/ui/repl.c:96
main at /buildworker/worker/package_linux64/build/ui/repl.c:217
__libc_start_main at /lib64/libc.so.6 (unknown line)
_start at /opt/apps/resif/data/production/v1.2-20191021/default/software/lang/Julia/1.3.0/bin/julia (unknown line)
unknown function (ip: 0xffffffffffffffff)
Allocations: 36267410105 (Pool: 36267394659; Big: 15446); GC: 20643
include at ./boot.jl:328 [inlined]
include_relative at ./loading.jl:1105
include at ./Base.jl:31
_jl_invoke at /buildworker/worker/package_linux64/build/src/gf.c:2135 [inlined]
jl_apply_generic at /buildworker/worker/package_linux64/build/src/gf.c:2305
include at ./boot.jl:328 [inlined]
include_relative at ./loading.jl:1105
include at ./boot.jl:328 [inlined]
include_relative at ./loading.jl:1105
include at ./boot.jl:328 [inlined]
include_relative at ./loading.jl:1105
exec_options at ./client.jl:287
include at ./Base.jl:31
_jl_invoke at /buildworker/worker/package_linux64/build/src/gf.c:2135 [inlined]
jl_apply_generic at /buildworker/worker/package_linux64/build/src/gf.c:2305
_start at ./client.jl:460
include at ./boot.jl:328 [inlined]
include_relative at ./loading.jl:1105
jfptr__start_2084.clone_1 at /mnt/irisgpfs/apps/resif/data/production/v1.2-20191021/default/software/lang/Julia/1.3.0/lib/julia/sys.so (unknown line)
_jl_invoke at /buildworker/worker/package_linux64/build/src/gf.c:2135 [inlined]
include at ./boot.jl:328 [inlined]
include_relative at ./loading.jl:1105
jl_apply_generic at /buildworker/worker/package_linux64/build/src/gf.c:2305
include at ./boot.jl:328 [inlined]
include_relative at ./loading.jl:1105
jl_apply at /buildworker/worker/package_linux64/build/ui/../src/julia.h:1631 [inlined]
true_main at /buildworker/worker/package_linux64/build/ui/repl.c:96
main at /buildworker/worker/package_linux64/build/ui/repl.c:217
include at ./Base.jl:31
_jl_invoke at /buildworker/worker/package_linux64/build/src/gf.c:2135 [inlined]
jl_apply_generic at /buildworker/worker/package_linux64/build/src/gf.c:2305
__libc_start_main at /lib64/libc.so.6 (unknown line)
_start at /opt/apps/resif/data/production/v1.2-20191021/default/software/lang/Julia/1.3.0/bin/julia (unknown line)
unknown function (ip: 0xffffffffffffffff)
Allocations: 36251745197 (Pool: 36251729751; Big: 15446); GC: 20634
include at ./boot.jl:328 [inlined]
include_relative at ./loading.jl:1105
include at ./boot.jl:328 [inlined]
include_relative at ./loading.jl:1105
include at ./boot.jl:328 [inlined]
include_relative at ./loading.jl:1105
include at ./Base.jl:31
_jl_invoke at /buildworker/worker/package_linux64/build/src/gf.c:2135 [inlined]
jl_apply_generic at /buildworker/worker/package_linux64/build/src/gf.c:2305
include at ./boot.jl:328 [inlined]
include_relative at ./loading.jl:1105
include at ./Base.jl:31
_jl_invoke at /buildworker/worker/package_linux64/build/src/gf.c:2135 [inlined]
jl_apply_generic at /buildworker/worker/package_linux64/build/src/gf.c:2305
exec_options at ./client.jl:287
exec_options at ./client.jl:287
include at ./boot.jl:328 [inlined]
include_relative at ./loading.jl:1105
include at ./boot.jl:328 [inlined]
include_relative at ./loading.jl:1105
include at ./boot.jl:328 [inlined]
include_relative at ./loading.jl:1105
include at ./boot.jl:328 [inlined]
include_relative at ./loading.jl:1105
exec_options at ./client.jl:287
exec_options at ./client.jl:287
_start at ./client.jl:460
_jl_invoke at /buildworker/worker/package_linux64/build/src/gf.c:2135 [inlined]
jl_apply_generic at /buildworker/worker/package_linux64/build/src/gf.c:2305
update_density_coefficients at /mnt/irisgpfs/projects/tcp/epillon/FSSH/Param/C_1/particle_methods_2d.jl:48
run_dynamics_extended at /mnt/irisgpfs/projects/tcp/epillon/FSSH/Param/C_1/particle_methods_2d.jl:263
include at ./boot.jl:328 [inlined]
include_relative at ./loading.jl:1105
main at /mnt/irisgpfs/projects/tcp/epillon/FSSH/Param/C_1/extended_standard_FSSH.jl:90
unknown function (ip: 0x2aaac4a0dd3f)
_jl_invoke at /buildworker/worker/package_linux64/build/src/gf.c:2141 [inlined]
jl_apply_generic at /buildworker/worker/package_linux64/build/src/gf.c:2305
_start at ./client.jl:460
jl_apply at /buildworker/worker/package_linux64/build/src/julia.h:1631 [inlined]
do_call at /buildworker/worker/package_linux64/build/src/interpreter.c:328
eval_value at /buildworker/worker/package_linux64/build/src/interpreter.c:417
eval_stmt_value at /buildworker/worker/package_linux64/build/src/interpreter.c:368 [inlined]
eval_body at /buildworker/worker/package_linux64/build/src/interpreter.c:778
include at ./boot.jl:328 [inlined]
include_relative at ./loading.jl:1105
include at ./Base.jl:31
_jl_invoke at /buildworker/worker/package_linux64/build/src/gf.c:2135 [inlined]
jl_apply_generic at /buildworker/worker/package_linux64/build/src/gf.c:2305
jl_interpret_toplevel_thunk_callback at /buildworker/worker/package_linux64/build/src/interpreter.c:888
unknown function (ip: 0xfffffffffffffffe)
unknown function (ip: 0x2aaac278948f)
unknown function (ip: 0xffffffffffffffff)
include at ./Base.jl:31
_jl_invoke at /buildworker/worker/package_linux64/build/src/gf.c:2135 [inlined]
jl_apply_generic at /buildworker/worker/package_linux64/build/src/gf.c:2305
jl_interpret_toplevel_thunk at /buildworker/worker/package_linux64/build/src/interpreter.c:897
include at ./Base.jl:31
_jl_invoke at /buildworker/worker/package_linux64/build/src/gf.c:2135 [inlined]
jl_apply_generic at /buildworker/worker/package_linux64/build/src/gf.c:2305
include at ./boot.jl:328 [inlined]
include_relative at ./loading.jl:1105
include at ./boot.jl:328 [inlined]
include_relative at ./loading.jl:1105
include at ./Base.jl:31
_jl_invoke at /buildworker/worker/package_linux64/build/src/gf.c:2135 [inlined]
jl_apply_generic at /buildworker/worker/package_linux64/build/src/gf.c:2305
_start at ./client.jl:460
jl_toplevel_eval_flex at /buildworker/worker/package_linux64/build/src/toplevel.c:814
include at ./Base.jl:31
_jl_invoke at /buildworker/worker/package_linux64/build/src/gf.c:2135 [inlined]
jl_apply_generic at /buildworker/worker/package_linux64/build/src/gf.c:2305
jl_parse_eval_all at /buildworker/worker/package_linux64/build/src/ast.c:873
jl_load at /buildworker/worker/package_linux64/build/src/toplevel.c:878
include at ./boot.jl:328 [inlined]
include_relative at ./loading.jl:1105
include at ./Base.jl:31
_jl_invoke at /buildworker/worker/package_linux64/build/src/gf.c:2135 [inlined]
jl_apply_generic at /buildworker/worker/package_linux64/build/src/gf.c:2305
include at ./boot.jl:328 [inlined]
include_relative at ./loading.jl:1105
exec_options at ./client.jl:287
include at ./Base.jl:31
_jl_invoke at /buildworker/worker/package_linux64/build/src/gf.c:2135 [inlined]
jl_apply_generic at /buildworker/worker/package_linux64/build/src/gf.c:2305
include at ./Base.jl:31
_jl_invoke at /buildworker/worker/package_linux64/build/src/gf.c:2135 [inlined]
jl_apply_generic at /buildworker/worker/package_linux64/build/src/gf.c:2305
include at ./Base.jl:31
_jl_invoke at /buildworker/worker/package_linux64/build/src/gf.c:2135 [inlined]
jl_apply_generic at /buildworker/worker/package_linux64/build/src/gf.c:2305
jfptr__start_2084.clone_1 at /mnt/irisgpfs/apps/resif/data/production/v1.2-20191021/default/software/lang/Julia/1.3.0/lib/julia/sys.so (unknown line)
_jl_invoke at /buildworker/worker/package_linux64/build/src/gf.c:2135 [inlined]
jl_apply_generic at /buildworker/worker/package_linux64/build/src/gf.c:2305
include at ./Base.jl:31
_jl_invoke at /buildworker/worker/package_linux64/build/src/gf.c:2135 [inlined]
jl_apply_generic at /buildworker/worker/package_linux64/build/src/gf.c:2305
jl_apply at /buildworker/worker/package_linux64/build/ui/../src/julia.h:1631 [inlined]
true_main at /buildworker/worker/package_linux64/build/ui/repl.c:96
main at /buildworker/worker/package_linux64/build/ui/repl.c:217
include at ./Base.jl:31
__libc_start_main at /lib64/libc.so.6 (unknown line)
_start at /opt/apps/resif/data/production/v1.2-20191021/default/software/lang/Julia/1.3.0/bin/julia (unknown line)
unknown function (ip: 0xffffffffffffffff)
Allocations: 36295556883 (Pool: 36295541437; Big: 15446); GC: 20659
_jl_invoke at /buildworker/worker/package_linux64/build/src/gf.c:2135 [inlined]
jl_apply_generic at /buildworker/worker/package_linux64/build/src/gf.c:2305
include at ./Base.jl:31
_jl_invoke at /buildworker/worker/package_linux64/build/src/gf.c:2135 [inlined]
jl_apply_generic at /buildworker/worker/package_linux64/build/src/gf.c:2305
include at ./Base.jl:31
_jl_invoke at /buildworker/worker/package_linux64/build/src/gf.c:2135 [inlined]
jl_apply_generic at /buildworker/worker/package_linux64/build/src/gf.c:2305
include at ./Base.jl:31
_jl_invoke at /buildworker/worker/package_linux64/build/src/gf.c:2135 [inlined]
jl_apply_generic at /buildworker/worker/package_linux64/build/src/gf.c:2305
include at ./Base.jl:31
_jl_invoke at /buildworker/worker/package_linux64/build/src/gf.c:2135 [inlined]
jl_apply_generic at /buildworker/worker/package_linux64/build/src/gf.c:2305
exec_options at ./client.jl:287
include at ./Base.jl:31
_jl_invoke at /buildworker/worker/package_linux64/build/src/gf.c:2135 [inlined]
jl_apply_generic at /buildworker/worker/package_linux64/build/src/gf.c:2305
exec_options at ./client.jl:287
exec_options at ./client.jl:287
exec_options at ./client.jl:287
exec_options at ./client.jl:287
exec_options at ./client.jl:287
exec_options at ./client.jl:287
exec_options at ./client.jl:287
exec_options at ./client.jl:287
jfptr__start_2084.clone_1 at /mnt/irisgpfs/apps/resif/data/production/v1.2-20191021/default/software/lang/Julia/1.3.0/lib/julia/sys.so (unknown line)
_jl_invoke at /buildworker/worker/package_linux64/build/src/gf.c:2135 [inlined]
jl_apply_generic at /buildworker/worker/package_linux64/build/src/gf.c:2305
jl_apply at /buildworker/worker/package_linux64/build/ui/../src/julia.h:1631 [inlined]
true_main at /buildworker/worker/package_linux64/build/ui/repl.c:96
main at /buildworker/worker/package_linux64/build/ui/repl.c:217
__libc_start_main at /lib64/libc.so.6 (unknown line)
_start at /opt/apps/resif/data/production/v1.2-20191021/default/software/lang/Julia/1.3.0/bin/julia (unknown line)
unknown function (ip: 0xffffffffffffffff)
Allocations: 36232049772 (Pool: 36232034326; Big: 15446); GC: 20623
exec_options at ./client.jl:287
exec_options at ./client.jl:287
jfptr__start_2084.clone_1 at /mnt/irisgpfs/apps/resif/data/production/v1.2-20191021/default/software/lang/Julia/1.3.0/lib/julia/sys.so (unknown line)
_jl_invoke at /buildworker/worker/package_linux64/build/src/gf.c:2135 [inlined]
jl_apply_generic at /buildworker/worker/package_linux64/build/src/gf.c:2305
jl_apply at /buildworker/worker/package_linux64/build/ui/../src/julia.h:1631 [inlined]
true_main at /buildworker/worker/package_linux64/build/ui/repl.c:96
main at /buildworker/worker/package_linux64/build/ui/repl.c:217
__libc_start_main at /lib64/libc.so.6 (unknown line)
_start at /opt/apps/resif/data/production/v1.2-20191021/default/software/lang/Julia/1.3.0/bin/julia (unknown line)
unknown function (ip: 0xffffffffffffffff)
Allocations: 36290067383 (Pool: 36290051937; Big: 15446); GC: 20656
_start at ./client.jl:460
_start at ./client.jl:460
_start at ./client.jl:460
_start at ./client.jl:460
include at ./boot.jl:328 [inlined]
include_relative at ./loading.jl:1105
_start at ./client.jl:460
_start at ./client.jl:460
_start at ./client.jl:460
_start at ./client.jl:460
_start at ./client.jl:460
exec_options at ./client.jl:287
exec_options at ./client.jl:287
jfptr__start_2084.clone_1 at /mnt/irisgpfs/apps/resif/data/production/v1.2-20191021/default/software/lang/Julia/1.3.0/lib/julia/sys.so (unknown line)
_jl_invoke at /buildworker/worker/package_linux64/build/src/gf.c:2135 [inlined]
jl_apply_generic at /buildworker/worker/package_linux64/build/src/gf.c:2305
exec_options at ./client.jl:287
include at ./boot.jl:328 [inlined]
include_relative at ./loading.jl:1105
jl_apply at /buildworker/worker/package_linux64/build/ui/../src/julia.h:1631 [inlined]
true_main at /buildworker/worker/package_linux64/build/ui/repl.c:96
main at /buildworker/worker/package_linux64/build/ui/repl.c:217
__libc_start_main at /lib64/libc.so.6 (unknown line)
_start at /opt/apps/resif/data/production/v1.2-20191021/default/software/lang/Julia/1.3.0/bin/julia (unknown line)
unknown function (ip: 0xffffffffffffffff)
Allocations: 36233813842 (Pool: 36233798396; Big: 15446); GC: 20624
jfptr__start_2084.clone_1 at /mnt/irisgpfs/apps/resif/data/production/v1.2-20191021/default/software/lang/Julia/1.3.0/lib/julia/sys.so (unknown line)
_jl_invoke at /buildworker/worker/package_linux64/build/src/gf.c:2135 [inlined]
jl_apply_generic at /buildworker/worker/package_linux64/build/src/gf.c:2305
jl_apply at /buildworker/worker/package_linux64/build/ui/../src/julia.h:1631 [inlined]
true_main at /buildworker/worker/package_linux64/build/ui/repl.c:96
main at /buildworker/worker/package_linux64/build/ui/repl.c:217
__libc_start_main at /lib64/libc.so.6 (unknown line)
_start at /opt/apps/resif/data/production/v1.2-20191021/default/software/lang/Julia/1.3.0/bin/julia (unknown line)
unknown function (ip: 0xffffffffffffffff)
Allocations: 36224993496 (Pool: 36224978050; Big: 15446); GC: 20619
_start at ./client.jl:460
_start at ./client.jl:460
_start at ./client.jl:460
include at ./Base.jl:31
_start at ./client.jl:460
_jl_invoke at /buildworker/worker/package_linux64/build/src/gf.c:2135 [inlined]
jl_apply_generic at /buildworker/worker/package_linux64/build/src/gf.c:2305
exec_options at ./client.jl:287
jfptr__start_2084.clone_1 at /mnt/irisgpfs/apps/resif/data/production/v1.2-20191021/default/software/lang/Julia/1.3.0/lib/julia/sys.so (unknown line)
_jl_invoke at /buildworker/worker/package_linux64/build/src/gf.c:2135 [inlined]
jl_apply_generic at /buildworker/worker/package_linux64/build/src/gf.c:2305
jl_apply at /buildworker/worker/package_linux64/build/ui/../src/julia.h:1631 [inlined]
true_main at /buildworker/worker/package_linux64/build/ui/repl.c:96
main at /buildworker/worker/package_linux64/build/ui/repl.c:217
__libc_start_main at /lib64/libc.so.6 (unknown line)
_start at /opt/apps/resif/data/production/v1.2-20191021/default/software/lang/Julia/1.3.0/bin/julia (unknown line)
unknown function (ip: 0xffffffffffffffff)
Allocations: 36267475932 (Pool: 36267460486; Big: 15446); GC: 20643
include at ./boot.jl:328 [inlined]
include_relative at ./loading.jl:1105
_start at ./client.jl:460
jfptr__start_2084.clone_1 at /mnt/irisgpfs/apps/resif/data/production/v1.2-20191021/default/software/lang/Julia/1.3.0/lib/julia/sys.so (unknown line)
_jl_invoke at /buildworker/worker/package_linux64/build/src/gf.c:2135 [inlined]
jl_apply_generic at /buildworker/worker/package_linux64/build/src/gf.c:2305
jfptr__start_2084.clone_1 at /mnt/irisgpfs/apps/resif/data/production/v1.2-20191021/default/software/lang/Julia/1.3.0/lib/julia/sys.so (unknown line)
_jl_invoke at /buildworker/worker/package_linux64/build/src/gf.c:2135 [inlined]
jl_apply_generic at /buildworker/worker/package_linux64/build/src/gf.c:2305
jl_apply at /buildworker/worker/package_linux64/build/ui/../src/julia.h:1631 [inlined]
true_main at /buildworker/worker/package_linux64/build/ui/repl.c:96
main at /buildworker/worker/package_linux64/build/ui/repl.c:217
__libc_start_main at /lib64/libc.so.6 (unknown line)
_start at /opt/apps/resif/data/production/v1.2-20191021/default/software/lang/Julia/1.3.0/bin/julia (unknown line)
unknown function (ip: 0xffffffffffffffff)
Allocations: 36292028684 (Pool: 36292013238; Big: 15446); GC: 20657
jfptr__start_2084.clone_1 at /mnt/irisgpfs/apps/resif/data/production/v1.2-20191021/default/software/lang/Julia/1.3.0/lib/julia/sys.so (unknown line)
jl_apply at /buildworker/worker/package_linux64/build/ui/../src/julia.h:1631 [inlined]
true_main at /buildworker/worker/package_linux64/build/ui/repl.c:96
main at /buildworker/worker/package_linux64/build/ui/repl.c:217
_jl_invoke at /buildworker/worker/package_linux64/build/src/gf.c:2135 [inlined]
jl_apply_generic at /buildworker/worker/package_linux64/build/src/gf.c:2305
__libc_start_main at /lib64/libc.so.6 (unknown line)
_start at /opt/apps/resif/data/production/v1.2-20191021/default/software/lang/Julia/1.3.0/bin/julia (unknown line)
unknown function (ip: 0xffffffffffffffff)
Allocations: 36269095479 (Pool: 36269080033; Big: 15446); GC: 20644
jfptr__start_2084.clone_1 at /mnt/irisgpfs/apps/resif/data/production/v1.2-20191021/default/software/lang/Julia/1.3.0/lib/julia/sys.so (unknown line)
_jl_invoke at /buildworker/worker/package_linux64/build/src/gf.c:2135 [inlined]
jl_apply_generic at /buildworker/worker/package_linux64/build/src/gf.c:2305
jl_apply at /buildworker/worker/package_linux64/build/ui/../src/julia.h:1631 [inlined]
true_main at /buildworker/worker/package_linux64/build/ui/repl.c:96
main at /buildworker/worker/package_linux64/build/ui/repl.c:217
__libc_start_main at /lib64/libc.so.6 (unknown line)
_start at /opt/apps/resif/data/production/v1.2-20191021/default/software/lang/Julia/1.3.0/bin/julia (unknown line)
unknown function (ip: 0xffffffffffffffff)
Allocations: 35908087723 (Pool: 35908072204; Big: 15519); GC: 20340
jl_apply at /buildworker/worker/package_linux64/build/ui/../src/julia.h:1631 [inlined]
true_main at /buildworker/worker/package_linux64/build/ui/repl.c:96
main at /buildworker/worker/package_linux64/build/ui/repl.c:217
__libc_start_main at /lib64/libc.so.6 (unknown line)
_start at /opt/apps/resif/data/production/v1.2-20191021/default/software/lang/Julia/1.3.0/bin/julia (unknown line)
unknown function (ip: 0xffffffffffffffff)
Allocations: 36304179751 (Pool: 36304164305; Big: 15446); GC: 20664
include at ./Base.jl:31
_jl_invoke at /buildworker/worker/package_linux64/build/src/gf.c:2135 [inlined]
jl_apply_generic at /buildworker/worker/package_linux64/build/src/gf.c:2305
_start at ./client.jl:460
_start at ./client.jl:460
include at ./Base.jl:31
_jl_invoke at /buildworker/worker/package_linux64/build/src/gf.c:2135 [inlined]
jl_apply_generic at /buildworker/worker/package_linux64/build/src/gf.c:2305
jfptr__start_2084.clone_1 at /mnt/irisgpfs/apps/resif/data/production/v1.2-20191021/default/software/lang/Julia/1.3.0/lib/julia/sys.so (unknown line)
_jl_invoke at /buildworker/worker/package_linux64/build/src/gf.c:2135 [inlined]
jl_apply_generic at /buildworker/worker/package_linux64/build/src/gf.c:2305
jl_apply at /buildworker/worker/package_linux64/build/ui/../src/julia.h:1631 [inlined]
true_main at /buildworker/worker/package_linux64/build/ui/repl.c:96
_start at ./client.jl:460
main at /buildworker/worker/package_linux64/build/ui/repl.c:217
__libc_start_main at /lib64/libc.so.6 (unknown line)
_start at /opt/apps/resif/data/production/v1.2-20191021/default/software/lang/Julia/1.3.0/bin/julia (unknown line)
unknown function (ip: 0xffffffffffffffff)
Allocations: 36254786678 (Pool: 36254771232; Big: 15446); GC: 20636
jfptr__start_2084.clone_1 at /mnt/irisgpfs/apps/resif/data/production/v1.2-20191021/default/software/lang/Julia/1.3.0/lib/julia/sys.so (unknown line)
_jl_invoke at /buildworker/worker/package_linux64/build/src/gf.c:2135 [inlined]
jl_apply_generic at /buildworker/worker/package_linux64/build/src/gf.c:2305
jl_apply at /buildworker/worker/package_linux64/build/ui/../src/julia.h:1631 [inlined]
true_main at /buildworker/worker/package_linux64/build/ui/repl.c:96
main at /buildworker/worker/package_linux64/build/ui/repl.c:217
__libc_start_main at /lib64/libc.so.6 (unknown line)
_start at /opt/apps/resif/data/production/v1.2-20191021/default/software/lang/Julia/1.3.0/bin/julia (unknown line)
unknown function (ip: 0xffffffffffffffff)
Allocations: 36214409056 (Pool: 36214393610; Big: 15446); GC: 20613
jfptr__start_2084.clone_1 at /mnt/irisgpfs/apps/resif/data/production/v1.2-20191021/default/software/lang/Julia/1.3.0/lib/julia/sys.so (unknown line)
_jl_invoke at /buildworker/worker/package_linux64/build/src/gf.c:2135 [inlined]
jl_apply_generic at /buildworker/worker/package_linux64/build/src/gf.c:2305
jfptr__start_2084.clone_1 at /mnt/irisgpfs/apps/resif/data/production/v1.2-20191021/default/software/lang/Julia/1.3.0/lib/julia/sys.so (unknown line)
_jl_invoke at /buildworker/worker/package_linux64/build/src/gf.c:2135 [inlined]
jl_apply_generic at /buildworker/worker/package_linux64/build/src/gf.c:2305
jl_apply at /buildworker/worker/package_linux64/build/ui/../src/julia.h:1631 [inlined]
true_main at /buildworker/worker/package_linux64/build/ui/repl.c:96
main at /buildworker/worker/package_linux64/build/ui/repl.c:217
jfptr__start_2084.clone_1 at /mnt/irisgpfs/apps/resif/data/production/v1.2-20191021/default/software/lang/Julia/1.3.0/lib/julia/sys.so (unknown line)
jfptr__start_2084.clone_1 at /mnt/irisgpfs/apps/resif/data/production/v1.2-20191021/default/software/lang/Julia/1.3.0/lib/julia/sys.so (unknown line)
exec_options at ./client.jl:287
_jl_invoke at /buildworker/worker/package_linux64/build/src/gf.c:2135 [inlined]
jl_apply_generic at /buildworker/worker/package_linux64/build/src/gf.c:2305
jl_apply at /buildworker/worker/package_linux64/build/ui/../src/julia.h:1631 [inlined]
true_main at /buildworker/worker/package_linux64/build/ui/repl.c:96
main at /buildworker/worker/package_linux64/build/ui/repl.c:217
__libc_start_main at /lib64/libc.so.6 (unknown line)
_start at /opt/apps/resif/data/production/v1.2-20191021/default/software/lang/Julia/1.3.0/bin/julia (unknown line)
_jl_invoke at /buildworker/worker/package_linux64/build/src/gf.c:2135 [inlined]
jl_apply_generic at /buildworker/worker/package_linux64/build/src/gf.c:2305
unknown function (ip: 0xffffffffffffffff)
Allocations: 36293830645 (Pool: 36293815199; Big: 15446); GC: 20658
__libc_start_main at /lib64/libc.so.6 (unknown line)
_start at /opt/apps/resif/data/production/v1.2-20191021/default/software/lang/Julia/1.3.0/bin/julia (unknown line)
unknown function (ip: 0xffffffffffffffff)
Allocations: 36260471103 (Pool: 36260455657; Big: 15446); GC: 20639
jl_apply at /buildworker/worker/package_linux64/build/ui/../src/julia.h:1631 [inlined]
true_main at /buildworker/worker/package_linux64/build/ui/repl.c:96
main at /buildworker/worker/package_linux64/build/ui/repl.c:217
jl_apply at /buildworker/worker/package_linux64/build/ui/../src/julia.h:1631 [inlined]
true_main at /buildworker/worker/package_linux64/build/ui/repl.c:96
main at /buildworker/worker/package_linux64/build/ui/repl.c:217
__libc_start_main at /lib64/libc.so.6 (unknown line)
_start at /opt/apps/resif/data/production/v1.2-20191021/default/software/lang/Julia/1.3.0/bin/julia (unknown line)
unknown function (ip: 0xffffffffffffffff)
Allocations: 36240674464 (Pool: 36240659018; Big: 15446); GC: 20628
__libc_start_main at /lib64/libc.so.6 (unknown line)
_start at /opt/apps/resif/data/production/v1.2-20191021/default/software/lang/Julia/1.3.0/bin/julia (unknown line)
unknown function (ip: 0xffffffffffffffff)
Allocations: 36263913853 (Pool: 36263898407; Big: 15446); GC: 20641
jfptr__start_2084.clone_1 at /mnt/irisgpfs/apps/resif/data/production/v1.2-20191021/default/software/lang/Julia/1.3.0/lib/julia/sys.so (unknown line)
_jl_invoke at /buildworker/worker/package_linux64/build/src/gf.c:2135 [inlined]
jl_apply_generic at /buildworker/worker/package_linux64/build/src/gf.c:2305
jl_apply at /buildworker/worker/package_linux64/build/ui/../src/julia.h:1631 [inlined]
true_main at /buildworker/worker/package_linux64/build/ui/repl.c:96
main at /buildworker/worker/package_linux64/build/ui/repl.c:217
__libc_start_main at /lib64/libc.so.6 (unknown line)
_start at /opt/apps/resif/data/production/v1.2-20191021/default/software/lang/Julia/1.3.0/bin/julia (unknown line)
jfptr__start_2084.clone_1 at /mnt/irisgpfs/apps/resif/data/production/v1.2-20191021/default/software/lang/Julia/1.3.0/lib/julia/sys.so (unknown line)
unknown function (ip: 0xffffffffffffffff)
Allocations: 36232049772 (Pool: 36232034326; Big: 15446); GC: 20623
_jl_invoke at /buildworker/worker/package_linux64/build/src/gf.c:2135 [inlined]
jl_apply_generic at /buildworker/worker/package_linux64/build/src/gf.c:2305
include at ./boot.jl:328 [inlined]
include_relative at ./loading.jl:1105
jl_apply at /buildworker/worker/package_linux64/build/ui/../src/julia.h:1631 [inlined]
true_main at /buildworker/worker/package_linux64/build/ui/repl.c:96
main at /buildworker/worker/package_linux64/build/ui/repl.c:217
__libc_start_main at /lib64/libc.so.6 (unknown line)
_start at /opt/apps/resif/data/production/v1.2-20191021/default/software/lang/Julia/1.3.0/bin/julia (unknown line)
unknown function (ip: 0xffffffffffffffff)
Allocations: 36218090746 (Pool: 36218075300; Big: 15446); GC: 20615
exec_options at ./client.jl:287
jfptr__start_2084.clone_1 at /mnt/irisgpfs/apps/resif/data/production/v1.2-20191021/default/software/lang/Julia/1.3.0/lib/julia/sys.so (unknown line)
_jl_invoke at /buildworker/worker/package_linux64/build/src/gf.c:2135 [inlined]
jl_apply_generic at /buildworker/worker/package_linux64/build/src/gf.c:2305
jfptr__start_2084.clone_1 at /mnt/irisgpfs/apps/resif/data/production/v1.2-20191021/default/software/lang/Julia/1.3.0/lib/julia/sys.so (unknown line)
_jl_invoke at /buildworker/worker/package_linux64/build/src/gf.c:2135 [inlined]
jl_apply_generic at /buildworker/worker/package_linux64/build/src/gf.c:2305
jl_apply at /buildworker/worker/package_linux64/build/ui/../src/julia.h:1631 [inlined]
true_main at /buildworker/worker/package_linux64/build/ui/repl.c:96
main at /buildworker/worker/package_linux64/build/ui/repl.c:217
__libc_start_main at /lib64/libc.so.6 (unknown line)
_start at /opt/apps/resif/data/production/v1.2-20191021/default/software/lang/Julia/1.3.0/bin/julia (unknown line)
unknown function (ip: 0xffffffffffffffff)
Allocations: 36297320976 (Pool: 36297305530; Big: 15446); GC: 20660
jl_apply at /buildworker/worker/package_linux64/build/ui/../src/julia.h:1631 [inlined]
true_main at /buildworker/worker/package_linux64/build/ui/repl.c:96
main at /buildworker/worker/package_linux64/build/ui/repl.c:217
__libc_start_main at /lib64/libc.so.6 (unknown line)
_start at /opt/apps/resif/data/production/v1.2-20191021/default/software/lang/Julia/1.3.0/bin/julia (unknown line)
unknown function (ip: 0xffffffffffffffff)
Allocations: 36221553638 (Pool: 36221538192; Big: 15446); GC: 20617
_start at ./client.jl:460
include at ./Base.jl:31
_jl_invoke at /buildworker/worker/package_linux64/build/src/gf.c:2135 [inlined]
jl_apply_generic at /buildworker/worker/package_linux64/build/src/gf.c:2305
exec_options at ./client.jl:287
exec_options at ./client.jl:287
_start at ./client.jl:460
_start at ./client.jl:460
jfptr__start_2084.clone_1 at /mnt/irisgpfs/apps/resif/data/production/v1.2-20191021/default/software/lang/Julia/1.3.0/lib/julia/sys.so (unknown line)
_jl_invoke at /buildworker/worker/package_linux64/build/src/gf.c:2135 [inlined]
jl_apply_generic at /buildworker/worker/package_linux64/build/src/gf.c:2305
jl_apply at /buildworker/worker/package_linux64/build/ui/../src/julia.h:1631 [inlined]
true_main at /buildworker/worker/package_linux64/build/ui/repl.c:96
main at /buildworker/worker/package_linux64/build/ui/repl.c:217
__libc_start_main at /lib64/libc.so.6 (unknown line)
_start at /opt/apps/resif/data/production/v1.2-20191021/default/software/lang/Julia/1.3.0/bin/julia (unknown line)
unknown function (ip: 0xffffffffffffffff)
Allocations: 36212645006 (Pool: 36212629560; Big: 15446); GC: 20612
_start at ./client.jl:460
jfptr__start_2084.clone_1 at /mnt/irisgpfs/apps/resif/data/production/v1.2-20191021/default/software/lang/Julia/1.3.0/lib/julia/sys.so (unknown line)
_jl_invoke at /buildworker/worker/package_linux64/build/src/gf.c:2135 [inlined]
jl_apply_generic at /buildworker/worker/package_linux64/build/src/gf.c:2305
jl_apply at /buildworker/worker/package_linux64/build/ui/../src/julia.h:1631 [inlined]
true_main at /buildworker/worker/package_linux64/build/ui/repl.c:96
main at /buildworker/worker/package_linux64/build/ui/repl.c:217
__libc_start_main at /lib64/libc.so.6 (unknown line)
_start at /opt/apps/resif/data/production/v1.2-20191021/default/software/lang/Julia/1.3.0/bin/julia (unknown line)
unknown function (ip: 0xffffffffffffffff)
Allocations: 36233813842 (Pool: 36233798396; Big: 15446); GC: 20624
jfptr__start_2084.clone_1 at /mnt/irisgpfs/apps/resif/data/production/v1.2-20191021/default/software/lang/Julia/1.3.0/lib/julia/sys.so (unknown line)
_jl_invoke at /buildworker/worker/package_linux64/build/src/gf.c:2135 [inlined]
jl_apply_generic at /buildworker/worker/package_linux64/build/src/gf.c:2305
jl_apply at /buildworker/worker/package_linux64/build/ui/../src/julia.h:1631 [inlined]
true_main at /buildworker/worker/package_linux64/build/ui/repl.c:96
main at /buildworker/worker/package_linux64/build/ui/repl.c:217
__libc_start_main at /lib64/libc.so.6 (unknown line)
_start at /opt/apps/resif/data/production/v1.2-20191021/default/software/lang/Julia/1.3.0/bin/julia (unknown line)
unknown function (ip: 0xffffffffffffffff)
Allocations: 36283292723 (Pool: 36283277277; Big: 15446); GC: 20652
include at ./boot.jl:328 [inlined]
include_relative at ./loading.jl:1105
jfptr__start_2084.clone_1 at /mnt/irisgpfs/apps/resif/data/production/v1.2-20191021/default/software/lang/Julia/1.3.0/lib/julia/sys.so (unknown line)
_jl_invoke at /buildworker/worker/package_linux64/build/src/gf.c:2135 [inlined]
jl_apply_generic at /buildworker/worker/package_linux64/build/src/gf.c:2305
jl_apply at /buildworker/worker/package_linux64/build/ui/../src/julia.h:1631 [inlined]
true_main at /buildworker/worker/package_linux64/build/ui/repl.c:96
main at /buildworker/worker/package_linux64/build/ui/repl.c:217
__libc_start_main at /lib64/libc.so.6 (unknown line)
_start at /opt/apps/resif/data/production/v1.2-20191021/default/software/lang/Julia/1.3.0/bin/julia (unknown line)
unknown function (ip: 0xffffffffffffffff)
Allocations: 36212676919 (Pool: 36212661473; Big: 15446); GC: 20612
include at ./boot.jl:328 [inlined]
include_relative at ./loading.jl:1105
include at ./Base.jl:31
_jl_invoke at /buildworker/worker/package_linux64/build/src/gf.c:2135 [inlined]
jl_apply_generic at /buildworker/worker/package_linux64/build/src/gf.c:2305
include at ./Base.jl:31
_jl_invoke at /buildworker/worker/package_linux64/build/src/gf.c:2135 [inlined]
jl_apply_generic at /buildworker/worker/package_linux64/build/src/gf.c:2305
exec_options at ./client.jl:287
_start at ./client.jl:460
jfptr__start_2084.clone_1 at /mnt/irisgpfs/apps/resif/data/production/v1.2-20191021/default/software/lang/Julia/1.3.0/lib/julia/sys.so (unknown line)
_jl_invoke at /buildworker/worker/package_linux64/build/src/gf.c:2135 [inlined]
jl_apply_generic at /buildworker/worker/package_linux64/build/src/gf.c:2305
jl_apply at /buildworker/worker/package_linux64/build/ui/../src/julia.h:1631 [inlined]
true_main at /buildworker/worker/package_linux64/build/ui/repl.c:96
main at /buildworker/worker/package_linux64/build/ui/repl.c:217
__libc_start_main at /lib64/libc.so.6 (unknown line)
_start at /opt/apps/resif/data/production/v1.2-20191021/default/software/lang/Julia/1.3.0/bin/julia (unknown line)
unknown function (ip: 0xffffffffffffffff)
Allocations: 36239106077 (Pool: 36239090631; Big: 15446); GC: 20627
exec_options at ./client.jl:287
_start at ./client.jl:460
jfptr__start_2084.clone_1 at /mnt/irisgpfs/apps/resif/data/production/v1.2-20191021/default/software/lang/Julia/1.3.0/lib/julia/sys.so (unknown line)
_jl_invoke at /buildworker/worker/package_linux64/build/src/gf.c:2135 [inlined]
jl_apply_generic at /buildworker/worker/package_linux64/build/src/gf.c:2305
jl_apply at /buildworker/worker/package_linux64/build/ui/../src/julia.h:1631 [inlined]
true_main at /buildworker/worker/package_linux64/build/ui/repl.c:96
main at /buildworker/worker/package_linux64/build/ui/repl.c:217
__libc_start_main at /lib64/libc.so.6 (unknown line)
_start at /opt/apps/resif/data/production/v1.2-20191021/default/software/lang/Julia/1.3.0/bin/julia (unknown line)
unknown function (ip: 0xffffffffffffffff)
Allocations: 36269095479 (Pool: 36269080033; Big: 15446); GC: 20644
