┌ Warning: The call to compilecache failed to create a usable precompiled cache file for PlotUtils [995b91a9-d308-5afd-9ec6-746e21dbc043]
│   exception = Required dependency Colors [5ae59095-9a9b-59fe-a467-6f913c188581] failed to load from a cache file.
└ @ Base loading.jl:1036
┌ Warning: The call to compilecache failed to create a usable precompiled cache file for PlotUtils [995b91a9-d308-5afd-9ec6-746e21dbc043]
│   exception = Required dependency Colors [5ae59095-9a9b-59fe-a467-6f913c188581] failed to load from a cache file.
└ @ Base loading.jl:1036
┌ Warning: The call to compilecache failed to create a usable precompiled cache file for PlotUtils [995b91a9-d308-5afd-9ec6-746e21dbc043]
│   exception = Required dependency Colors [5ae59095-9a9b-59fe-a467-6f913c188581] failed to load from a cache file.
└ @ Base loading.jl:1036
┌ Warning: The call to compilecache failed to create a usable precompiled cache file for PlotUtils [995b91a9-d308-5afd-9ec6-746e21dbc043]
│   exception = Required dependency Colors [5ae59095-9a9b-59fe-a467-6f913c188581] failed to load from a cache file.
└ @ Base loading.jl:1036
┌ Warning: The call to compilecache failed to create a usable precompiled cache file for PlotUtils [995b91a9-d308-5afd-9ec6-746e21dbc043]
│   exception = Required dependency Colors [5ae59095-9a9b-59fe-a467-6f913c188581] failed to load from a cache file.
└ @ Base loading.jl:1036
┌ Warning: The call to compilecache failed to create a usable precompiled cache file for PlotUtils [995b91a9-d308-5afd-9ec6-746e21dbc043]
│   exception = Required dependency Colors [5ae59095-9a9b-59fe-a467-6f913c188581] failed to load from a cache file.
└ @ Base loading.jl:1036
┌ Warning: The call to compilecache failed to create a usable precompiled cache file for PlotUtils [995b91a9-d308-5afd-9ec6-746e21dbc043]
│   exception = Required dependency Colors [5ae59095-9a9b-59fe-a467-6f913c188581] failed to load from a cache file.
└ @ Base loading.jl:1036
┌ Warning: The call to compilecache failed to create a usable precompiled cache file for PlotUtils [995b91a9-d308-5afd-9ec6-746e21dbc043]
│   exception = Required dependency Colors [5ae59095-9a9b-59fe-a467-6f913c188581] failed to load from a cache file.
└ @ Base loading.jl:1036
┌ Warning: The call to compilecache failed to create a usable precompiled cache file for PlotUtils [995b91a9-d308-5afd-9ec6-746e21dbc043]
│   exception = Required dependency Colors [5ae59095-9a9b-59fe-a467-6f913c188581] failed to load from a cache file.
└ @ Base loading.jl:1036
┌ Warning: The call to compilecache failed to create a usable precompiled cache file for PlotUtils [995b91a9-d308-5afd-9ec6-746e21dbc043]
│   exception = Required dependency Colors [5ae59095-9a9b-59fe-a467-6f913c188581] failed to load from a cache file.
└ @ Base loading.jl:1036
┌ Warning: The call to compilecache failed to create a usable precompiled cache file for PlotUtils [995b91a9-d308-5afd-9ec6-746e21dbc043]
│   exception = Required dependency Colors [5ae59095-9a9b-59fe-a467-6f913c188581] failed to load from a cache file.
└ @ Base loading.jl:1036
┌ Warning: The call to compilecache failed to create a usable precompiled cache file for PlotUtils [995b91a9-d308-5afd-9ec6-746e21dbc043]
│   exception = Required dependency Colors [5ae59095-9a9b-59fe-a467-6f913c188581] failed to load from a cache file.
└ @ Base loading.jl:1036
┌ Warning: The call to compilecache failed to create a usable precompiled cache file for PlotUtils [995b91a9-d308-5afd-9ec6-746e21dbc043]
│   exception = Required dependency Colors [5ae59095-9a9b-59fe-a467-6f913c188581] failed to load from a cache file.
└ @ Base loading.jl:1036
┌ Warning: The call to compilecache failed to create a usable precompiled cache file for PlotUtils [995b91a9-d308-5afd-9ec6-746e21dbc043]
│   exception = Required dependency Colors [5ae59095-9a9b-59fe-a467-6f913c188581] failed to load from a cache file.
└ @ Base loading.jl:1036
┌ Warning: The call to compilecache failed to create a usable precompiled cache file for PlotUtils [995b91a9-d308-5afd-9ec6-746e21dbc043]
│   exception = Required dependency Colors [5ae59095-9a9b-59fe-a467-6f913c188581] failed to load from a cache file.
└ @ Base loading.jl:1036
┌ Warning: The call to compilecache failed to create a usable precompiled cache file for PlotUtils [995b91a9-d308-5afd-9ec6-746e21dbc043]
│   exception = Required dependency Colors [5ae59095-9a9b-59fe-a467-6f913c188581] failed to load from a cache file.
└ @ Base loading.jl:1036
┌ Warning: The call to compilecache failed to create a usable precompiled cache file for PlotUtils [995b91a9-d308-5afd-9ec6-746e21dbc043]
│   exception = Required dependency Colors [5ae59095-9a9b-59fe-a467-6f913c188581] failed to load from a cache file.
└ @ Base loading.jl:1036
┌ Warning: The call to compilecache failed to create a usable precompiled cache file for PlotUtils [995b91a9-d308-5afd-9ec6-746e21dbc043]
│   exception = Required dependency Colors [5ae59095-9a9b-59fe-a467-6f913c188581] failed to load from a cache file.
└ @ Base loading.jl:1036
┌ Warning: The call to compilecache failed to create a usable precompiled cache file for PlotUtils [995b91a9-d308-5afd-9ec6-746e21dbc043]
│   exception = Required dependency Colors [5ae59095-9a9b-59fe-a467-6f913c188581] failed to load from a cache file.
└ @ Base loading.jl:1036
┌ Warning: The call to compilecache failed to create a usable precompiled cache file for PlotUtils [995b91a9-d308-5afd-9ec6-746e21dbc043]
│   exception = Required dependency Colors [5ae59095-9a9b-59fe-a467-6f913c188581] failed to load from a cache file.
└ @ Base loading.jl:1036
┌ Warning: The call to compilecache failed to create a usable precompiled cache file for PlotUtils [995b91a9-d308-5afd-9ec6-746e21dbc043]
│   exception = Required dependency Colors [5ae59095-9a9b-59fe-a467-6f913c188581] failed to load from a cache file.
└ @ Base loading.jl:1036
┌ Warning: The call to compilecache failed to create a usable precompiled cache file for PlotUtils [995b91a9-d308-5afd-9ec6-746e21dbc043]
│   exception = Required dependency Colors [5ae59095-9a9b-59fe-a467-6f913c188581] failed to load from a cache file.
└ @ Base loading.jl:1036
┌ Warning: The call to compilecache failed to create a usable precompiled cache file for PlotUtils [995b91a9-d308-5afd-9ec6-746e21dbc043]
│   exception = Required dependency Colors [5ae59095-9a9b-59fe-a467-6f913c188581] failed to load from a cache file.
└ @ Base loading.jl:1036
┌ Warning: The call to compilecache failed to create a usable precompiled cache file for PlotUtils [995b91a9-d308-5afd-9ec6-746e21dbc043]
│   exception = Required dependency Colors [5ae59095-9a9b-59fe-a467-6f913c188581] failed to load from a cache file.
└ @ Base loading.jl:1036
┌ Warning: The call to compilecache failed to create a usable precompiled cache file for PlotUtils [995b91a9-d308-5afd-9ec6-746e21dbc043]
│   exception = Required dependency Colors [5ae59095-9a9b-59fe-a467-6f913c188581] failed to load from a cache file.
└ @ Base loading.jl:1036
┌ Warning: The call to compilecache failed to create a usable precompiled cache file for PlotUtils [995b91a9-d308-5afd-9ec6-746e21dbc043]
│   exception = Required dependency Colors [5ae59095-9a9b-59fe-a467-6f913c188581] failed to load from a cache file.
└ @ Base loading.jl:1036
┌ Warning: The call to compilecache failed to create a usable precompiled cache file for PlotUtils [995b91a9-d308-5afd-9ec6-746e21dbc043]
│   exception = Required dependency Colors [5ae59095-9a9b-59fe-a467-6f913c188581] failed to load from a cache file.
└ @ Base loading.jl:1036
┌ Warning: The call to compilecache failed to create a usable precompiled cache file for PlotUtils [995b91a9-d308-5afd-9ec6-746e21dbc043]
│   exception = Required dependency Colors [5ae59095-9a9b-59fe-a467-6f913c188581] failed to load from a cache file.
└ @ Base loading.jl:1036
┌ Warning: Module PlotUtils with build ID 10473080253203752 is missing from the cache.
│ This may mean PlotUtils [995b91a9-d308-5afd-9ec6-746e21dbc043] does not support precompilation but is imported by a module that does.
└ @ Base loading.jl:1011
┌ Warning: Module PlotUtils with build ID 10473080299094468 is missing from the cache.
│ This may mean PlotUtils [995b91a9-d308-5afd-9ec6-746e21dbc043] does not support precompilation but is imported by a module that does.
└ @ Base loading.jl:1011
┌ Warning: Module PlotUtils with build ID 10473080287800387 is missing from the cache.
│ This may mean PlotUtils [995b91a9-d308-5afd-9ec6-746e21dbc043] does not support precompilation but is imported by a module that does.
└ @ Base loading.jl:1011
┌ Warning: Module PlotUtils with build ID 10473080258225026 is missing from the cache.
│ This may mean PlotUtils [995b91a9-d308-5afd-9ec6-746e21dbc043] does not support precompilation but is imported by a module that does.
└ @ Base loading.jl:1011
┌ Warning: Module PlotUtils with build ID 10473080266709057 is missing from the cache.
│ This may mean PlotUtils [995b91a9-d308-5afd-9ec6-746e21dbc043] does not support precompilation but is imported by a module that does.
└ @ Base loading.jl:1011
┌ Warning: Module PlotUtils with build ID 10473080250873867 is missing from the cache.
│ This may mean PlotUtils [995b91a9-d308-5afd-9ec6-746e21dbc043] does not support precompilation but is imported by a module that does.
└ @ Base loading.jl:1011
┌ Warning: Module PlotUtils with build ID 10473080245998301 is missing from the cache.
│ This may mean PlotUtils [995b91a9-d308-5afd-9ec6-746e21dbc043] does not support precompilation but is imported by a module that does.
└ @ Base loading.jl:1011
┌ Warning: Module PlotUtils with build ID 10473080392412710 is missing from the cache.
│ This may mean PlotUtils [995b91a9-d308-5afd-9ec6-746e21dbc043] does not support precompilation but is imported by a module that does.
└ @ Base loading.jl:1011
┌ Warning: Module PlotUtils with build ID 10473080243499092 is missing from the cache.
│ This may mean PlotUtils [995b91a9-d308-5afd-9ec6-746e21dbc043] does not support precompilation but is imported by a module that does.
└ @ Base loading.jl:1011
┌ Warning: Module PlotUtils with build ID 10473080389529617 is missing from the cache.
│ This may mean PlotUtils [995b91a9-d308-5afd-9ec6-746e21dbc043] does not support precompilation but is imported by a module that does.
└ @ Base loading.jl:1011
┌ Warning: Module PlotUtils with build ID 10473080305851294 is missing from the cache.
│ This may mean PlotUtils [995b91a9-d308-5afd-9ec6-746e21dbc043] does not support precompilation but is imported by a module that does.
└ @ Base loading.jl:1011
┌ Warning: Module PlotUtils with build ID 10473080318025788 is missing from the cache.
│ This may mean PlotUtils [995b91a9-d308-5afd-9ec6-746e21dbc043] does not support precompilation but is imported by a module that does.
└ @ Base loading.jl:1011
┌ Warning: Module PlotUtils with build ID 10473080586556510 is missing from the cache.
│ This may mean PlotUtils [995b91a9-d308-5afd-9ec6-746e21dbc043] does not support precompilation but is imported by a module that does.
└ @ Base loading.jl:1011
┌ Warning: Module PlotUtils with build ID 10473080279031613 is missing from the cache.
│ This may mean PlotUtils [995b91a9-d308-5afd-9ec6-746e21dbc043] does not support precompilation but is imported by a module that does.
└ @ Base loading.jl:1011
┌ Warning: Module PlotUtils with build ID 10473080662279112 is missing from the cache.
│ This may mean PlotUtils [995b91a9-d308-5afd-9ec6-746e21dbc043] does not support precompilation but is imported by a module that does.
└ @ Base loading.jl:1011
┌ Warning: Module PlotUtils with build ID 10473080742633813 is missing from the cache.
│ This may mean PlotUtils [995b91a9-d308-5afd-9ec6-746e21dbc043] does not support precompilation but is imported by a module that does.
└ @ Base loading.jl:1011
┌ Warning: Module PlotUtils with build ID 10473080662657368 is missing from the cache.
│ This may mean PlotUtils [995b91a9-d308-5afd-9ec6-746e21dbc043] does not support precompilation but is imported by a module that does.
└ @ Base loading.jl:1011
┌ Warning: Module PlotUtils with build ID 10473080651810907 is missing from the cache.
│ This may mean PlotUtils [995b91a9-d308-5afd-9ec6-746e21dbc043] does not support precompilation but is imported by a module that does.
└ @ Base loading.jl:1011
┌ Warning: Module PlotUtils with build ID 10473080828866584 is missing from the cache.
│ This may mean PlotUtils [995b91a9-d308-5afd-9ec6-746e21dbc043] does not support precompilation but is imported by a module that does.
└ @ Base loading.jl:1011
┌ Warning: Module PlotUtils with build ID 10473080863553933 is missing from the cache.
│ This may mean PlotUtils [995b91a9-d308-5afd-9ec6-746e21dbc043] does not support precompilation but is imported by a module that does.
└ @ Base loading.jl:1011
┌ Warning: Module PlotUtils with build ID 10473080269141023 is missing from the cache.
│ This may mean PlotUtils [995b91a9-d308-5afd-9ec6-746e21dbc043] does not support precompilation but is imported by a module that does.
└ @ Base loading.jl:1011
┌ Warning: Module PlotUtils with build ID 10473080695814285 is missing from the cache.
│ This may mean PlotUtils [995b91a9-d308-5afd-9ec6-746e21dbc043] does not support precompilation but is imported by a module that does.
└ @ Base loading.jl:1011
┌ Warning: Module PlotUtils with build ID 10473080831412793 is missing from the cache.
│ This may mean PlotUtils [995b91a9-d308-5afd-9ec6-746e21dbc043] does not support precompilation but is imported by a module that does.
└ @ Base loading.jl:1011
┌ Warning: Module PlotUtils with build ID 10473080620889028 is missing from the cache.
│ This may mean PlotUtils [995b91a9-d308-5afd-9ec6-746e21dbc043] does not support precompilation but is imported by a module that does.
└ @ Base loading.jl:1011
┌ Warning: Module PlotUtils with build ID 10473080822229490 is missing from the cache.
│ This may mean PlotUtils [995b91a9-d308-5afd-9ec6-746e21dbc043] does not support precompilation but is imported by a module that does.
└ @ Base loading.jl:1011
┌ Warning: Module PlotUtils with build ID 10473080683298334 is missing from the cache.
│ This may mean PlotUtils [995b91a9-d308-5afd-9ec6-746e21dbc043] does not support precompilation but is imported by a module that does.
└ @ Base loading.jl:1011
┌ Warning: Module PlotUtils with build ID 10473080909091435 is missing from the cache.
│ This may mean PlotUtils [995b91a9-d308-5afd-9ec6-746e21dbc043] does not support precompilation but is imported by a module that does.
└ @ Base loading.jl:1011
┌ Warning: Module PlotUtils with build ID 10473080981506890 is missing from the cache.
│ This may mean PlotUtils [995b91a9-d308-5afd-9ec6-746e21dbc043] does not support precompilation but is imported by a module that does.
└ @ Base loading.jl:1011
┌ Warning: Module PlotUtils with build ID 10473080243499092 is missing from the cache.
│ This may mean PlotUtils [995b91a9-d308-5afd-9ec6-746e21dbc043] does not support precompilation but is imported by a module that does.
└ @ Base loading.jl:1011
┌ Warning: Module PlotUtils with build ID 10473080266709057 is missing from the cache.
│ This may mean PlotUtils [995b91a9-d308-5afd-9ec6-746e21dbc043] does not support precompilation but is imported by a module that does.
└ @ Base loading.jl:1011
┌ Warning: Module PlotUtils with build ID 10473080299094468 is missing from the cache.
│ This may mean PlotUtils [995b91a9-d308-5afd-9ec6-746e21dbc043] does not support precompilation but is imported by a module that does.
└ @ Base loading.jl:1011
┌ Warning: Module PlotUtils with build ID 10473080287800387 is missing from the cache.
│ This may mean PlotUtils [995b91a9-d308-5afd-9ec6-746e21dbc043] does not support precompilation but is imported by a module that does.
└ @ Base loading.jl:1011
┌ Warning: Module PlotUtils with build ID 10473080258225026 is missing from the cache.
│ This may mean PlotUtils [995b91a9-d308-5afd-9ec6-746e21dbc043] does not support precompilation but is imported by a module that does.
└ @ Base loading.jl:1011
┌ Warning: Module PlotUtils with build ID 10473080253203752 is missing from the cache.
│ This may mean PlotUtils [995b91a9-d308-5afd-9ec6-746e21dbc043] does not support precompilation but is imported by a module that does.
└ @ Base loading.jl:1011
┌ Warning: Module PlotUtils with build ID 10473080250873867 is missing from the cache.
│ This may mean PlotUtils [995b91a9-d308-5afd-9ec6-746e21dbc043] does not support precompilation but is imported by a module that does.
└ @ Base loading.jl:1011
┌ Warning: Module PlotUtils with build ID 10473080586556510 is missing from the cache.
│ This may mean PlotUtils [995b91a9-d308-5afd-9ec6-746e21dbc043] does not support precompilation but is imported by a module that does.
└ @ Base loading.jl:1011
┌ Warning: Module PlotUtils with build ID 10473080389529617 is missing from the cache.
│ This may mean PlotUtils [995b91a9-d308-5afd-9ec6-746e21dbc043] does not support precompilation but is imported by a module that does.
└ @ Base loading.jl:1011
┌ Warning: Module PlotUtils with build ID 10473080245998301 is missing from the cache.
│ This may mean PlotUtils [995b91a9-d308-5afd-9ec6-746e21dbc043] does not support precompilation but is imported by a module that does.
└ @ Base loading.jl:1011
┌ Warning: Module PlotUtils with build ID 10473080392412710 is missing from the cache.
│ This may mean PlotUtils [995b91a9-d308-5afd-9ec6-746e21dbc043] does not support precompilation but is imported by a module that does.
└ @ Base loading.jl:1011
┌ Warning: Module PlotUtils with build ID 10473080651810907 is missing from the cache.
│ This may mean PlotUtils [995b91a9-d308-5afd-9ec6-746e21dbc043] does not support precompilation but is imported by a module that does.
└ @ Base loading.jl:1011
┌ Warning: Module PlotUtils with build ID 10473080828866584 is missing from the cache.
│ This may mean PlotUtils [995b91a9-d308-5afd-9ec6-746e21dbc043] does not support precompilation but is imported by a module that does.
└ @ Base loading.jl:1011
┌ Warning: Module PlotUtils with build ID 10473080318025788 is missing from the cache.
│ This may mean PlotUtils [995b91a9-d308-5afd-9ec6-746e21dbc043] does not support precompilation but is imported by a module that does.
└ @ Base loading.jl:1011
┌ Warning: Module PlotUtils with build ID 10473080279031613 is missing from the cache.
│ This may mean PlotUtils [995b91a9-d308-5afd-9ec6-746e21dbc043] does not support precompilation but is imported by a module that does.
└ @ Base loading.jl:1011
┌ Warning: Module PlotUtils with build ID 10473080662279112 is missing from the cache.
│ This may mean PlotUtils [995b91a9-d308-5afd-9ec6-746e21dbc043] does not support precompilation but is imported by a module that does.
└ @ Base loading.jl:1011
┌ Warning: Module PlotUtils with build ID 10473080863553933 is missing from the cache.
│ This may mean PlotUtils [995b91a9-d308-5afd-9ec6-746e21dbc043] does not support precompilation but is imported by a module that does.
└ @ Base loading.jl:1011
┌ Warning: Module PlotUtils with build ID 10473080742633813 is missing from the cache.
│ This may mean PlotUtils [995b91a9-d308-5afd-9ec6-746e21dbc043] does not support precompilation but is imported by a module that does.
└ @ Base loading.jl:1011
┌ Warning: Module PlotUtils with build ID 10473080662657368 is missing from the cache.
│ This may mean PlotUtils [995b91a9-d308-5afd-9ec6-746e21dbc043] does not support precompilation but is imported by a module that does.
└ @ Base loading.jl:1011
┌ Warning: Module PlotUtils with build ID 10473080305851294 is missing from the cache.
│ This may mean PlotUtils [995b91a9-d308-5afd-9ec6-746e21dbc043] does not support precompilation but is imported by a module that does.
└ @ Base loading.jl:1011
┌ Warning: Module PlotUtils with build ID 10473080831412793 is missing from the cache.
│ This may mean PlotUtils [995b91a9-d308-5afd-9ec6-746e21dbc043] does not support precompilation but is imported by a module that does.
└ @ Base loading.jl:1011
┌ Warning: Module PlotUtils with build ID 10473080822229490 is missing from the cache.
│ This may mean PlotUtils [995b91a9-d308-5afd-9ec6-746e21dbc043] does not support precompilation but is imported by a module that does.
└ @ Base loading.jl:1011
┌ Warning: Module PlotUtils with build ID 10473080269141023 is missing from the cache.
│ This may mean PlotUtils [995b91a9-d308-5afd-9ec6-746e21dbc043] does not support precompilation but is imported by a module that does.
└ @ Base loading.jl:1011
┌ Warning: Module PlotUtils with build ID 10473080620889028 is missing from the cache.
│ This may mean PlotUtils [995b91a9-d308-5afd-9ec6-746e21dbc043] does not support precompilation but is imported by a module that does.
└ @ Base loading.jl:1011
┌ Warning: Module PlotUtils with build ID 10473080981506890 is missing from the cache.
│ This may mean PlotUtils [995b91a9-d308-5afd-9ec6-746e21dbc043] does not support precompilation but is imported by a module that does.
└ @ Base loading.jl:1011
┌ Warning: Module PlotUtils with build ID 10473080909091435 is missing from the cache.
│ This may mean PlotUtils [995b91a9-d308-5afd-9ec6-746e21dbc043] does not support precompilation but is imported by a module that does.
└ @ Base loading.jl:1011
┌ Warning: Module PlotUtils with build ID 10473080695814285 is missing from the cache.
│ This may mean PlotUtils [995b91a9-d308-5afd-9ec6-746e21dbc043] does not support precompilation but is imported by a module that does.
└ @ Base loading.jl:1011
┌ Warning: Module PlotUtils with build ID 10473080683298334 is missing from the cache.
│ This may mean PlotUtils [995b91a9-d308-5afd-9ec6-746e21dbc043] does not support precompilation but is imported by a module that does.
└ @ Base loading.jl:1011
┌ Warning: The call to compilecache failed to create a usable precompiled cache file for Plots [91a5bcdd-55d7-5caf-9e0b-520d859cae80]
│   exception = Required dependency Colors [5ae59095-9a9b-59fe-a467-6f913c188581] failed to load from a cache file.
└ @ Base loading.jl:1036
┌ Warning: The call to compilecache failed to create a usable precompiled cache file for Plots [91a5bcdd-55d7-5caf-9e0b-520d859cae80]
│   exception = Required dependency Colors [5ae59095-9a9b-59fe-a467-6f913c188581] failed to load from a cache file.
└ @ Base loading.jl:1036
┌ Warning: The call to compilecache failed to create a usable precompiled cache file for Plots [91a5bcdd-55d7-5caf-9e0b-520d859cae80]
│   exception = Required dependency Colors [5ae59095-9a9b-59fe-a467-6f913c188581] failed to load from a cache file.
└ @ Base loading.jl:1036
┌ Warning: The call to compilecache failed to create a usable precompiled cache file for Plots [91a5bcdd-55d7-5caf-9e0b-520d859cae80]
│   exception = Required dependency Colors [5ae59095-9a9b-59fe-a467-6f913c188581] failed to load from a cache file.
└ @ Base loading.jl:1036
┌ Warning: The call to compilecache failed to create a usable precompiled cache file for Plots [91a5bcdd-55d7-5caf-9e0b-520d859cae80]
│   exception = Required dependency Colors [5ae59095-9a9b-59fe-a467-6f913c188581] failed to load from a cache file.
└ @ Base loading.jl:1036
┌ Warning: The call to compilecache failed to create a usable precompiled cache file for Plots [91a5bcdd-55d7-5caf-9e0b-520d859cae80]
│   exception = Required dependency Colors [5ae59095-9a9b-59fe-a467-6f913c188581] failed to load from a cache file.
└ @ Base loading.jl:1036
┌ Warning: The call to compilecache failed to create a usable precompiled cache file for Plots [91a5bcdd-55d7-5caf-9e0b-520d859cae80]
│   exception = ArgumentError: Invalid checksum in cache file /home/users/epillon/.julia/compiled/v1.3/Plots/ld3vC_xxNEt.ji.
└ @ Base loading.jl:1036
┌ Warning: The call to compilecache failed to create a usable precompiled cache file for Plots [91a5bcdd-55d7-5caf-9e0b-520d859cae80]
│   exception = Required dependency Colors [5ae59095-9a9b-59fe-a467-6f913c188581] failed to load from a cache file.
└ @ Base loading.jl:1036
┌ Warning: The call to compilecache failed to create a usable precompiled cache file for Plots [91a5bcdd-55d7-5caf-9e0b-520d859cae80]
│   exception = Required dependency Colors [5ae59095-9a9b-59fe-a467-6f913c188581] failed to load from a cache file.
└ @ Base loading.jl:1036
┌ Warning: The call to compilecache failed to create a usable precompiled cache file for Plots [91a5bcdd-55d7-5caf-9e0b-520d859cae80]
│   exception = Required dependency Colors [5ae59095-9a9b-59fe-a467-6f913c188581] failed to load from a cache file.
└ @ Base loading.jl:1036
┌ Warning: The call to compilecache failed to create a usable precompiled cache file for Plots [91a5bcdd-55d7-5caf-9e0b-520d859cae80]
│   exception = Required dependency Colors [5ae59095-9a9b-59fe-a467-6f913c188581] failed to load from a cache file.
└ @ Base loading.jl:1036
┌ Warning: The call to compilecache failed to create a usable precompiled cache file for Plots [91a5bcdd-55d7-5caf-9e0b-520d859cae80]
│   exception = Required dependency Colors [5ae59095-9a9b-59fe-a467-6f913c188581] failed to load from a cache file.
└ @ Base loading.jl:1036
┌ Warning: The call to compilecache failed to create a usable precompiled cache file for Plots [91a5bcdd-55d7-5caf-9e0b-520d859cae80]
│   exception = Required dependency Colors [5ae59095-9a9b-59fe-a467-6f913c188581] failed to load from a cache file.
└ @ Base loading.jl:1036
┌ Warning: The call to compilecache failed to create a usable precompiled cache file for Plots [91a5bcdd-55d7-5caf-9e0b-520d859cae80]
│   exception = Required dependency Colors [5ae59095-9a9b-59fe-a467-6f913c188581] failed to load from a cache file.
└ @ Base loading.jl:1036
┌ Warning: The call to compilecache failed to create a usable precompiled cache file for Plots [91a5bcdd-55d7-5caf-9e0b-520d859cae80]
│   exception = Required dependency Colors [5ae59095-9a9b-59fe-a467-6f913c188581] failed to load from a cache file.
└ @ Base loading.jl:1036
┌ Warning: The call to compilecache failed to create a usable precompiled cache file for Plots [91a5bcdd-55d7-5caf-9e0b-520d859cae80]
│   exception = Required dependency Colors [5ae59095-9a9b-59fe-a467-6f913c188581] failed to load from a cache file.
└ @ Base loading.jl:1036
┌ Warning: The call to compilecache failed to create a usable precompiled cache file for Plots [91a5bcdd-55d7-5caf-9e0b-520d859cae80]
│   exception = Required dependency Colors [5ae59095-9a9b-59fe-a467-6f913c188581] failed to load from a cache file.
└ @ Base loading.jl:1036
┌ Warning: The call to compilecache failed to create a usable precompiled cache file for Plots [91a5bcdd-55d7-5caf-9e0b-520d859cae80]
│   exception = Required dependency Colors [5ae59095-9a9b-59fe-a467-6f913c188581] failed to load from a cache file.
└ @ Base loading.jl:1036
┌ Warning: The call to compilecache failed to create a usable precompiled cache file for Plots [91a5bcdd-55d7-5caf-9e0b-520d859cae80]
│   exception = Required dependency Colors [5ae59095-9a9b-59fe-a467-6f913c188581] failed to load from a cache file.
└ @ Base loading.jl:1036
┌ Warning: The call to compilecache failed to create a usable precompiled cache file for Plots [91a5bcdd-55d7-5caf-9e0b-520d859cae80]
│   exception = Required dependency Colors [5ae59095-9a9b-59fe-a467-6f913c188581] failed to load from a cache file.
└ @ Base loading.jl:1036
┌ Warning: The call to compilecache failed to create a usable precompiled cache file for Plots [91a5bcdd-55d7-5caf-9e0b-520d859cae80]
│   exception = Required dependency Colors [5ae59095-9a9b-59fe-a467-6f913c188581] failed to load from a cache file.
└ @ Base loading.jl:1036
┌ Warning: The call to compilecache failed to create a usable precompiled cache file for Plots [91a5bcdd-55d7-5caf-9e0b-520d859cae80]
│   exception = Required dependency Colors [5ae59095-9a9b-59fe-a467-6f913c188581] failed to load from a cache file.
└ @ Base loading.jl:1036
┌ Warning: The call to compilecache failed to create a usable precompiled cache file for Plots [91a5bcdd-55d7-5caf-9e0b-520d859cae80]
│   exception = Required dependency Colors [5ae59095-9a9b-59fe-a467-6f913c188581] failed to load from a cache file.
└ @ Base loading.jl:1036
┌ Warning: The call to compilecache failed to create a usable precompiled cache file for Plots [91a5bcdd-55d7-5caf-9e0b-520d859cae80]
│   exception = Required dependency Colors [5ae59095-9a9b-59fe-a467-6f913c188581] failed to load from a cache file.
└ @ Base loading.jl:1036
┌ Warning: The call to compilecache failed to create a usable precompiled cache file for Plots [91a5bcdd-55d7-5caf-9e0b-520d859cae80]
│   exception = Required dependency Colors [5ae59095-9a9b-59fe-a467-6f913c188581] failed to load from a cache file.
└ @ Base loading.jl:1036
┌ Warning: The call to compilecache failed to create a usable precompiled cache file for Plots [91a5bcdd-55d7-5caf-9e0b-520d859cae80]
│   exception = Required dependency Colors [5ae59095-9a9b-59fe-a467-6f913c188581] failed to load from a cache file.
└ @ Base loading.jl:1036
┌ Warning: The call to compilecache failed to create a usable precompiled cache file for Plots [91a5bcdd-55d7-5caf-9e0b-520d859cae80]
│   exception = Required dependency Colors [5ae59095-9a9b-59fe-a467-6f913c188581] failed to load from a cache file.
└ @ Base loading.jl:1036
┌ Warning: The call to compilecache failed to create a usable precompiled cache file for Plots [91a5bcdd-55d7-5caf-9e0b-520d859cae80]
│   exception = Required dependency Colors [5ae59095-9a9b-59fe-a467-6f913c188581] failed to load from a cache file.
└ @ Base loading.jl:1036
┌ Warning: The call to compilecache failed to create a usable precompiled cache file for PlotUtils [995b91a9-d308-5afd-9ec6-746e21dbc043]
│   exception = Required dependency Colors [5ae59095-9a9b-59fe-a467-6f913c188581] failed to load from a cache file.
└ @ Base loading.jl:1036
┌ Warning: The call to compilecache failed to create a usable precompiled cache file for PlotUtils [995b91a9-d308-5afd-9ec6-746e21dbc043]
│   exception = Required dependency Colors [5ae59095-9a9b-59fe-a467-6f913c188581] failed to load from a cache file.
└ @ Base loading.jl:1036
┌ Warning: The call to compilecache failed to create a usable precompiled cache file for PlotUtils [995b91a9-d308-5afd-9ec6-746e21dbc043]
│   exception = Required dependency Colors [5ae59095-9a9b-59fe-a467-6f913c188581] failed to load from a cache file.
└ @ Base loading.jl:1036
┌ Warning: The call to compilecache failed to create a usable precompiled cache file for PlotUtils [995b91a9-d308-5afd-9ec6-746e21dbc043]
│   exception = Required dependency Colors [5ae59095-9a9b-59fe-a467-6f913c188581] failed to load from a cache file.
└ @ Base loading.jl:1036
┌ Warning: The call to compilecache failed to create a usable precompiled cache file for PlotUtils [995b91a9-d308-5afd-9ec6-746e21dbc043]
│   exception = Required dependency Colors [5ae59095-9a9b-59fe-a467-6f913c188581] failed to load from a cache file.
└ @ Base loading.jl:1036
┌ Warning: The call to compilecache failed to create a usable precompiled cache file for PlotUtils [995b91a9-d308-5afd-9ec6-746e21dbc043]
│   exception = Required dependency Colors [5ae59095-9a9b-59fe-a467-6f913c188581] failed to load from a cache file.
└ @ Base loading.jl:1036
┌ Warning: The call to compilecache failed to create a usable precompiled cache file for PlotUtils [995b91a9-d308-5afd-9ec6-746e21dbc043]
│   exception = Required dependency Colors [5ae59095-9a9b-59fe-a467-6f913c188581] failed to load from a cache file.
└ @ Base loading.jl:1036
┌ Warning: The call to compilecache failed to create a usable precompiled cache file for PlotUtils [995b91a9-d308-5afd-9ec6-746e21dbc043]
│   exception = Required dependency Colors [5ae59095-9a9b-59fe-a467-6f913c188581] failed to load from a cache file.
└ @ Base loading.jl:1036
┌ Warning: The call to compilecache failed to create a usable precompiled cache file for PlotUtils [995b91a9-d308-5afd-9ec6-746e21dbc043]
│   exception = Required dependency Colors [5ae59095-9a9b-59fe-a467-6f913c188581] failed to load from a cache file.
└ @ Base loading.jl:1036
┌ Warning: The call to compilecache failed to create a usable precompiled cache file for PlotUtils [995b91a9-d308-5afd-9ec6-746e21dbc043]
│   exception = Required dependency Colors [5ae59095-9a9b-59fe-a467-6f913c188581] failed to load from a cache file.
└ @ Base loading.jl:1036
┌ Warning: The call to compilecache failed to create a usable precompiled cache file for PlotUtils [995b91a9-d308-5afd-9ec6-746e21dbc043]
│   exception = Required dependency Colors [5ae59095-9a9b-59fe-a467-6f913c188581] failed to load from a cache file.
└ @ Base loading.jl:1036
┌ Warning: The call to compilecache failed to create a usable precompiled cache file for PlotUtils [995b91a9-d308-5afd-9ec6-746e21dbc043]
│   exception = Required dependency Colors [5ae59095-9a9b-59fe-a467-6f913c188581] failed to load from a cache file.
└ @ Base loading.jl:1036
┌ Warning: The call to compilecache failed to create a usable precompiled cache file for PlotUtils [995b91a9-d308-5afd-9ec6-746e21dbc043]
│   exception = Required dependency Colors [5ae59095-9a9b-59fe-a467-6f913c188581] failed to load from a cache file.
└ @ Base loading.jl:1036
┌ Warning: The call to compilecache failed to create a usable precompiled cache file for PlotUtils [995b91a9-d308-5afd-9ec6-746e21dbc043]
│   exception = Required dependency Colors [5ae59095-9a9b-59fe-a467-6f913c188581] failed to load from a cache file.
└ @ Base loading.jl:1036
┌ Warning: The call to compilecache failed to create a usable precompiled cache file for PlotUtils [995b91a9-d308-5afd-9ec6-746e21dbc043]
│   exception = Required dependency Colors [5ae59095-9a9b-59fe-a467-6f913c188581] failed to load from a cache file.
└ @ Base loading.jl:1036
┌ Warning: The call to compilecache failed to create a usable precompiled cache file for PlotUtils [995b91a9-d308-5afd-9ec6-746e21dbc043]
│   exception = Required dependency Colors [5ae59095-9a9b-59fe-a467-6f913c188581] failed to load from a cache file.
└ @ Base loading.jl:1036
┌ Warning: The call to compilecache failed to create a usable precompiled cache file for PlotUtils [995b91a9-d308-5afd-9ec6-746e21dbc043]
│   exception = Required dependency Colors [5ae59095-9a9b-59fe-a467-6f913c188581] failed to load from a cache file.
└ @ Base loading.jl:1036
┌ Warning: The call to compilecache failed to create a usable precompiled cache file for PlotUtils [995b91a9-d308-5afd-9ec6-746e21dbc043]
│   exception = Required dependency Colors [5ae59095-9a9b-59fe-a467-6f913c188581] failed to load from a cache file.
└ @ Base loading.jl:1036
┌ Warning: The call to compilecache failed to create a usable precompiled cache file for PlotUtils [995b91a9-d308-5afd-9ec6-746e21dbc043]
│   exception = Required dependency Colors [5ae59095-9a9b-59fe-a467-6f913c188581] failed to load from a cache file.
└ @ Base loading.jl:1036
┌ Warning: The call to compilecache failed to create a usable precompiled cache file for PlotUtils [995b91a9-d308-5afd-9ec6-746e21dbc043]
│   exception = Required dependency Colors [5ae59095-9a9b-59fe-a467-6f913c188581] failed to load from a cache file.
└ @ Base loading.jl:1036
┌ Warning: The call to compilecache failed to create a usable precompiled cache file for PlotUtils [995b91a9-d308-5afd-9ec6-746e21dbc043]
│   exception = Required dependency Colors [5ae59095-9a9b-59fe-a467-6f913c188581] failed to load from a cache file.
└ @ Base loading.jl:1036
┌ Warning: The call to compilecache failed to create a usable precompiled cache file for PlotUtils [995b91a9-d308-5afd-9ec6-746e21dbc043]
│   exception = Required dependency Colors [5ae59095-9a9b-59fe-a467-6f913c188581] failed to load from a cache file.
└ @ Base loading.jl:1036
┌ Warning: The call to compilecache failed to create a usable precompiled cache file for PlotUtils [995b91a9-d308-5afd-9ec6-746e21dbc043]
│   exception = Required dependency Colors [5ae59095-9a9b-59fe-a467-6f913c188581] failed to load from a cache file.
└ @ Base loading.jl:1036
┌ Warning: The call to compilecache failed to create a usable precompiled cache file for PlotUtils [995b91a9-d308-5afd-9ec6-746e21dbc043]
│   exception = Required dependency Colors [5ae59095-9a9b-59fe-a467-6f913c188581] failed to load from a cache file.
└ @ Base loading.jl:1036
┌ Warning: The call to compilecache failed to create a usable precompiled cache file for PlotUtils [995b91a9-d308-5afd-9ec6-746e21dbc043]
│   exception = Required dependency Colors [5ae59095-9a9b-59fe-a467-6f913c188581] failed to load from a cache file.
└ @ Base loading.jl:1036
┌ Warning: The call to compilecache failed to create a usable precompiled cache file for PlotUtils [995b91a9-d308-5afd-9ec6-746e21dbc043]
│   exception = Required dependency Colors [5ae59095-9a9b-59fe-a467-6f913c188581] failed to load from a cache file.
└ @ Base loading.jl:1036
┌ Warning: The call to compilecache failed to create a usable precompiled cache file for PlotUtils [995b91a9-d308-5afd-9ec6-746e21dbc043]
│   exception = Required dependency Colors [5ae59095-9a9b-59fe-a467-6f913c188581] failed to load from a cache file.
└ @ Base loading.jl:1036
┌ Warning: The call to compilecache failed to create a usable precompiled cache file for PlotUtils [995b91a9-d308-5afd-9ec6-746e21dbc043]
│   exception = Required dependency Colors [5ae59095-9a9b-59fe-a467-6f913c188581] failed to load from a cache file.
└ @ Base loading.jl:1036
┌ Warning: Module PlotUtils with build ID 10473142804582990 is missing from the cache.
│ This may mean PlotUtils [995b91a9-d308-5afd-9ec6-746e21dbc043] does not support precompilation but is imported by a module that does.
└ @ Base loading.jl:1011
┌ Warning: Module PlotUtils with build ID 10473142643172419 is missing from the cache.
│ This may mean PlotUtils [995b91a9-d308-5afd-9ec6-746e21dbc043] does not support precompilation but is imported by a module that does.
└ @ Base loading.jl:1011
┌ Warning: Module PlotUtils with build ID 10473142798132747 is missing from the cache.
│ This may mean PlotUtils [995b91a9-d308-5afd-9ec6-746e21dbc043] does not support precompilation but is imported by a module that does.
└ @ Base loading.jl:1011
┌ Warning: Module PlotUtils with build ID 10473143025822048 is missing from the cache.
│ This may mean PlotUtils [995b91a9-d308-5afd-9ec6-746e21dbc043] does not support precompilation but is imported by a module that does.
└ @ Base loading.jl:1011
┌ Warning: Module PlotUtils with build ID 10473142807593557 is missing from the cache.
│ This may mean PlotUtils [995b91a9-d308-5afd-9ec6-746e21dbc043] does not support precompilation but is imported by a module that does.
└ @ Base loading.jl:1011
┌ Warning: Module PlotUtils with build ID 10473143015425844 is missing from the cache.
│ This may mean PlotUtils [995b91a9-d308-5afd-9ec6-746e21dbc043] does not support precompilation but is imported by a module that does.
└ @ Base loading.jl:1011
┌ Warning: Module PlotUtils with build ID 10473143204868535 is missing from the cache.
│ This may mean PlotUtils [995b91a9-d308-5afd-9ec6-746e21dbc043] does not support precompilation but is imported by a module that does.
└ @ Base loading.jl:1011
┌ Warning: Module PlotUtils with build ID 10473143376397836 is missing from the cache.
│ This may mean PlotUtils [995b91a9-d308-5afd-9ec6-746e21dbc043] does not support precompilation but is imported by a module that does.
└ @ Base loading.jl:1011
┌ Warning: Module PlotUtils with build ID 10473143176617428 is missing from the cache.
│ This may mean PlotUtils [995b91a9-d308-5afd-9ec6-746e21dbc043] does not support precompilation but is imported by a module that does.
└ @ Base loading.jl:1011
┌ Warning: Module PlotUtils with build ID 10473143179012562 is missing from the cache.
│ This may mean PlotUtils [995b91a9-d308-5afd-9ec6-746e21dbc043] does not support precompilation but is imported by a module that does.
└ @ Base loading.jl:1011
┌ Warning: Module PlotUtils with build ID 10473143325599930 is missing from the cache.
│ This may mean PlotUtils [995b91a9-d308-5afd-9ec6-746e21dbc043] does not support precompilation but is imported by a module that does.
└ @ Base loading.jl:1011
┌ Warning: Module PlotUtils with build ID 10473143145661835 is missing from the cache.
│ This may mean PlotUtils [995b91a9-d308-5afd-9ec6-746e21dbc043] does not support precompilation but is imported by a module that does.
└ @ Base loading.jl:1011
┌ Warning: Module PlotUtils with build ID 10473143201919732 is missing from the cache.
│ This may mean PlotUtils [995b91a9-d308-5afd-9ec6-746e21dbc043] does not support precompilation but is imported by a module that does.
└ @ Base loading.jl:1011
┌ Warning: Module PlotUtils with build ID 10473143388800086 is missing from the cache.
│ This may mean PlotUtils [995b91a9-d308-5afd-9ec6-746e21dbc043] does not support precompilation but is imported by a module that does.
└ @ Base loading.jl:1011
┌ Warning: Module PlotUtils with build ID 10473143427278690 is missing from the cache.
│ This may mean PlotUtils [995b91a9-d308-5afd-9ec6-746e21dbc043] does not support precompilation but is imported by a module that does.
└ @ Base loading.jl:1011
┌ Warning: Module PlotUtils with build ID 10473143700677425 is missing from the cache.
│ This may mean PlotUtils [995b91a9-d308-5afd-9ec6-746e21dbc043] does not support precompilation but is imported by a module that does.
└ @ Base loading.jl:1011
┌ Warning: Module PlotUtils with build ID 10473144384321202 is missing from the cache.
│ This may mean PlotUtils [995b91a9-d308-5afd-9ec6-746e21dbc043] does not support precompilation but is imported by a module that does.
└ @ Base loading.jl:1011
┌ Warning: Module PlotUtils with build ID 10473144541621905 is missing from the cache.
│ This may mean PlotUtils [995b91a9-d308-5afd-9ec6-746e21dbc043] does not support precompilation but is imported by a module that does.
└ @ Base loading.jl:1011
┌ Warning: Module PlotUtils with build ID 10473146490628456 is missing from the cache.
│ This may mean PlotUtils [995b91a9-d308-5afd-9ec6-746e21dbc043] does not support precompilation but is imported by a module that does.
└ @ Base loading.jl:1011
┌ Warning: Module PlotUtils with build ID 10473146465728237 is missing from the cache.
│ This may mean PlotUtils [995b91a9-d308-5afd-9ec6-746e21dbc043] does not support precompilation but is imported by a module that does.
└ @ Base loading.jl:1011
┌ Warning: Module PlotUtils with build ID 10473147492508876 is missing from the cache.
│ This may mean PlotUtils [995b91a9-d308-5afd-9ec6-746e21dbc043] does not support precompilation but is imported by a module that does.
└ @ Base loading.jl:1011
┌ Warning: Module PlotUtils with build ID 10473147317079283 is missing from the cache.
│ This may mean PlotUtils [995b91a9-d308-5afd-9ec6-746e21dbc043] does not support precompilation but is imported by a module that does.
└ @ Base loading.jl:1011
┌ Warning: Module PlotUtils with build ID 10473147559145923 is missing from the cache.
│ This may mean PlotUtils [995b91a9-d308-5afd-9ec6-746e21dbc043] does not support precompilation but is imported by a module that does.
└ @ Base loading.jl:1011
┌ Warning: Module PlotUtils with build ID 10473147688421140 is missing from the cache.
│ This may mean PlotUtils [995b91a9-d308-5afd-9ec6-746e21dbc043] does not support precompilation but is imported by a module that does.
└ @ Base loading.jl:1011
┌ Warning: Module PlotUtils with build ID 10473147746409913 is missing from the cache.
│ This may mean PlotUtils [995b91a9-d308-5afd-9ec6-746e21dbc043] does not support precompilation but is imported by a module that does.
└ @ Base loading.jl:1011
┌ Warning: Module PlotUtils with build ID 10473148053816308 is missing from the cache.
│ This may mean PlotUtils [995b91a9-d308-5afd-9ec6-746e21dbc043] does not support precompilation but is imported by a module that does.
└ @ Base loading.jl:1011
┌ Warning: Module PlotUtils with build ID 10473142643172419 is missing from the cache.
│ This may mean PlotUtils [995b91a9-d308-5afd-9ec6-746e21dbc043] does not support precompilation but is imported by a module that does.
└ @ Base loading.jl:1011
┌ Warning: Module PlotUtils with build ID 10473148385915556 is missing from the cache.
│ This may mean PlotUtils [995b91a9-d308-5afd-9ec6-746e21dbc043] does not support precompilation but is imported by a module that does.
└ @ Base loading.jl:1011
┌ Warning: Module PlotUtils with build ID 10473142807593557 is missing from the cache.
│ This may mean PlotUtils [995b91a9-d308-5afd-9ec6-746e21dbc043] does not support precompilation but is imported by a module that does.
└ @ Base loading.jl:1011
┌ Warning: Module PlotUtils with build ID 10473142798132747 is missing from the cache.
│ This may mean PlotUtils [995b91a9-d308-5afd-9ec6-746e21dbc043] does not support precompilation but is imported by a module that does.
└ @ Base loading.jl:1011
┌ Warning: Module PlotUtils with build ID 10473142804582990 is missing from the cache.
│ This may mean PlotUtils [995b91a9-d308-5afd-9ec6-746e21dbc043] does not support precompilation but is imported by a module that does.
└ @ Base loading.jl:1011
┌ Warning: Module PlotUtils with build ID 10473143025822048 is missing from the cache.
│ This may mean PlotUtils [995b91a9-d308-5afd-9ec6-746e21dbc043] does not support precompilation but is imported by a module that does.
└ @ Base loading.jl:1011
┌ Warning: Module PlotUtils with build ID 10473148656892497 is missing from the cache.
│ This may mean PlotUtils [995b91a9-d308-5afd-9ec6-746e21dbc043] does not support precompilation but is imported by a module that does.
└ @ Base loading.jl:1011
┌ Warning: Module PlotUtils with build ID 10473143204868535 is missing from the cache.
│ This may mean PlotUtils [995b91a9-d308-5afd-9ec6-746e21dbc043] does not support precompilation but is imported by a module that does.
└ @ Base loading.jl:1011
┌ Warning: Module PlotUtils with build ID 10473143201919732 is missing from the cache.
│ This may mean PlotUtils [995b91a9-d308-5afd-9ec6-746e21dbc043] does not support precompilation but is imported by a module that does.
└ @ Base loading.jl:1011
┌ Warning: Module PlotUtils with build ID 10473143176617428 is missing from the cache.
│ This may mean PlotUtils [995b91a9-d308-5afd-9ec6-746e21dbc043] does not support precompilation but is imported by a module that does.
└ @ Base loading.jl:1011
┌ Warning: Module PlotUtils with build ID 10473143325599930 is missing from the cache.
│ This may mean PlotUtils [995b91a9-d308-5afd-9ec6-746e21dbc043] does not support precompilation but is imported by a module that does.
└ @ Base loading.jl:1011
┌ Warning: Module PlotUtils with build ID 10473143376397836 is missing from the cache.
│ This may mean PlotUtils [995b91a9-d308-5afd-9ec6-746e21dbc043] does not support precompilation but is imported by a module that does.
└ @ Base loading.jl:1011
┌ Warning: Module PlotUtils with build ID 10473143179012562 is missing from the cache.
│ This may mean PlotUtils [995b91a9-d308-5afd-9ec6-746e21dbc043] does not support precompilation but is imported by a module that does.
└ @ Base loading.jl:1011
┌ Warning: Module PlotUtils with build ID 10473143145661835 is missing from the cache.
│ This may mean PlotUtils [995b91a9-d308-5afd-9ec6-746e21dbc043] does not support precompilation but is imported by a module that does.
└ @ Base loading.jl:1011
┌ Warning: Module PlotUtils with build ID 10473143015425844 is missing from the cache.
│ This may mean PlotUtils [995b91a9-d308-5afd-9ec6-746e21dbc043] does not support precompilation but is imported by a module that does.
└ @ Base loading.jl:1011
┌ Warning: Module PlotUtils with build ID 10473143700677425 is missing from the cache.
│ This may mean PlotUtils [995b91a9-d308-5afd-9ec6-746e21dbc043] does not support precompilation but is imported by a module that does.
└ @ Base loading.jl:1011
┌ Warning: Module PlotUtils with build ID 10473143388800086 is missing from the cache.
│ This may mean PlotUtils [995b91a9-d308-5afd-9ec6-746e21dbc043] does not support precompilation but is imported by a module that does.
└ @ Base loading.jl:1011
┌ Warning: Module PlotUtils with build ID 10473143427278690 is missing from the cache.
│ This may mean PlotUtils [995b91a9-d308-5afd-9ec6-746e21dbc043] does not support precompilation but is imported by a module that does.
└ @ Base loading.jl:1011
┌ Warning: Module PlotUtils with build ID 10473144384321202 is missing from the cache.
│ This may mean PlotUtils [995b91a9-d308-5afd-9ec6-746e21dbc043] does not support precompilation but is imported by a module that does.
└ @ Base loading.jl:1011
┌ Warning: Module PlotUtils with build ID 10473144541621905 is missing from the cache.
│ This may mean PlotUtils [995b91a9-d308-5afd-9ec6-746e21dbc043] does not support precompilation but is imported by a module that does.
└ @ Base loading.jl:1011
┌ Warning: Module PlotUtils with build ID 10473146490628456 is missing from the cache.
│ This may mean PlotUtils [995b91a9-d308-5afd-9ec6-746e21dbc043] does not support precompilation but is imported by a module that does.
└ @ Base loading.jl:1011
┌ Warning: Module PlotUtils with build ID 10473146465728237 is missing from the cache.
│ This may mean PlotUtils [995b91a9-d308-5afd-9ec6-746e21dbc043] does not support precompilation but is imported by a module that does.
└ @ Base loading.jl:1011
┌ Warning: Module PlotUtils with build ID 10473147492508876 is missing from the cache.
│ This may mean PlotUtils [995b91a9-d308-5afd-9ec6-746e21dbc043] does not support precompilation but is imported by a module that does.
└ @ Base loading.jl:1011
┌ Warning: Module PlotUtils with build ID 10473147559145923 is missing from the cache.
│ This may mean PlotUtils [995b91a9-d308-5afd-9ec6-746e21dbc043] does not support precompilation but is imported by a module that does.
└ @ Base loading.jl:1011
┌ Warning: Module PlotUtils with build ID 10473147317079283 is missing from the cache.
│ This may mean PlotUtils [995b91a9-d308-5afd-9ec6-746e21dbc043] does not support precompilation but is imported by a module that does.
└ @ Base loading.jl:1011
┌ Warning: Module PlotUtils with build ID 10473148053816308 is missing from the cache.
│ This may mean PlotUtils [995b91a9-d308-5afd-9ec6-746e21dbc043] does not support precompilation but is imported by a module that does.
└ @ Base loading.jl:1011
┌ Warning: Module PlotUtils with build ID 10473147746409913 is missing from the cache.
│ This may mean PlotUtils [995b91a9-d308-5afd-9ec6-746e21dbc043] does not support precompilation but is imported by a module that does.
└ @ Base loading.jl:1011
┌ Warning: Module PlotUtils with build ID 10473147688421140 is missing from the cache.
│ This may mean PlotUtils [995b91a9-d308-5afd-9ec6-746e21dbc043] does not support precompilation but is imported by a module that does.
└ @ Base loading.jl:1011
┌ Warning: Module PlotUtils with build ID 10473148385915556 is missing from the cache.
│ This may mean PlotUtils [995b91a9-d308-5afd-9ec6-746e21dbc043] does not support precompilation but is imported by a module that does.
└ @ Base loading.jl:1011
┌ Warning: Module PlotUtils with build ID 10473148656892497 is missing from the cache.
│ This may mean PlotUtils [995b91a9-d308-5afd-9ec6-746e21dbc043] does not support precompilation but is imported by a module that does.
└ @ Base loading.jl:1011
┌ Warning: You appear to be using MPI.jl with the default MPI binary on a cluster.
│ We recommend using the system-provided MPI, see the Configuration section of the MPI.jl docs.
└ @ MPI ~/.julia/packages/MPI/b7MVG/deps/deps.jl:15
┌ Warning: You appear to be using MPI.jl with the default MPI binary on a cluster.
│ We recommend using the system-provided MPI, see the Configuration section of the MPI.jl docs.
└ @ MPI ~/.julia/packages/MPI/b7MVG/deps/deps.jl:15
┌ Warning: You appear to be using MPI.jl with the default MPI binary on a cluster.
│ We recommend using the system-provided MPI, see the Configuration section of the MPI.jl docs.
└ @ MPI ~/.julia/packages/MPI/b7MVG/deps/deps.jl:15
┌ Warning: You appear to be using MPI.jl with the default MPI binary on a cluster.
│ We recommend using the system-provided MPI, see the Configuration section of the MPI.jl docs.
└ @ MPI ~/.julia/packages/MPI/b7MVG/deps/deps.jl:15
┌ Warning: You appear to be using MPI.jl with the default MPI binary on a cluster.
│ We recommend using the system-provided MPI, see the Configuration section of the MPI.jl docs.
└ @ MPI ~/.julia/packages/MPI/b7MVG/deps/deps.jl:15
┌ Warning: You appear to be using MPI.jl with the default MPI binary on a cluster.
│ We recommend using the system-provided MPI, see the Configuration section of the MPI.jl docs.
└ @ MPI ~/.julia/packages/MPI/b7MVG/deps/deps.jl:15
┌ Warning: You appear to be using MPI.jl with the default MPI binary on a cluster.
│ We recommend using the system-provided MPI, see the Configuration section of the MPI.jl docs.
└ @ MPI ~/.julia/packages/MPI/b7MVG/deps/deps.jl:15
┌ Warning: You appear to be using MPI.jl with the default MPI binary on a cluster.
│ We recommend using the system-provided MPI, see the Configuration section of the MPI.jl docs.
└ @ MPI ~/.julia/packages/MPI/b7MVG/deps/deps.jl:15
┌ Warning: You appear to be using MPI.jl with the default MPI binary on a cluster.
│ We recommend using the system-provided MPI, see the Configuration section of the MPI.jl docs.
└ @ MPI ~/.julia/packages/MPI/b7MVG/deps/deps.jl:15
┌ Warning: You appear to be using MPI.jl with the default MPI binary on a cluster.
│ We recommend using the system-provided MPI, see the Configuration section of the MPI.jl docs.
└ @ MPI ~/.julia/packages/MPI/b7MVG/deps/deps.jl:15
┌ Warning: You appear to be using MPI.jl with the default MPI binary on a cluster.
│ We recommend using the system-provided MPI, see the Configuration section of the MPI.jl docs.
└ @ MPI ~/.julia/packages/MPI/b7MVG/deps/deps.jl:15
┌ Warning: You appear to be using MPI.jl with the default MPI binary on a cluster.
│ We recommend using the system-provided MPI, see the Configuration section of the MPI.jl docs.
└ @ MPI ~/.julia/packages/MPI/b7MVG/deps/deps.jl:15
┌ Warning: You appear to be using MPI.jl with the default MPI binary on a cluster.
│ We recommend using the system-provided MPI, see the Configuration section of the MPI.jl docs.
└ @ MPI ~/.julia/packages/MPI/b7MVG/deps/deps.jl:15
┌ Warning: You appear to be using MPI.jl with the default MPI binary on a cluster.
│ We recommend using the system-provided MPI, see the Configuration section of the MPI.jl docs.
└ @ MPI ~/.julia/packages/MPI/b7MVG/deps/deps.jl:15
┌ Warning: You appear to be using MPI.jl with the default MPI binary on a cluster.
│ We recommend using the system-provided MPI, see the Configuration section of the MPI.jl docs.
└ @ MPI ~/.julia/packages/MPI/b7MVG/deps/deps.jl:15
┌ Warning: You appear to be using MPI.jl with the default MPI binary on a cluster.
│ We recommend using the system-provided MPI, see the Configuration section of the MPI.jl docs.
└ @ MPI ~/.julia/packages/MPI/b7MVG/deps/deps.jl:15
┌ Warning: You appear to be using MPI.jl with the default MPI binary on a cluster.
│ We recommend using the system-provided MPI, see the Configuration section of the MPI.jl docs.
└ @ MPI ~/.julia/packages/MPI/b7MVG/deps/deps.jl:15
┌ Warning: You appear to be using MPI.jl with the default MPI binary on a cluster.
│ We recommend using the system-provided MPI, see the Configuration section of the MPI.jl docs.
└ @ MPI ~/.julia/packages/MPI/b7MVG/deps/deps.jl:15
┌ Warning: You appear to be using MPI.jl with the default MPI binary on a cluster.
│ We recommend using the system-provided MPI, see the Configuration section of the MPI.jl docs.
└ @ MPI ~/.julia/packages/MPI/b7MVG/deps/deps.jl:15
┌ Warning: You appear to be using MPI.jl with the default MPI binary on a cluster.
│ We recommend using the system-provided MPI, see the Configuration section of the MPI.jl docs.
└ @ MPI ~/.julia/packages/MPI/b7MVG/deps/deps.jl:15
┌ Warning: You appear to be using MPI.jl with the default MPI binary on a cluster.
│ We recommend using the system-provided MPI, see the Configuration section of the MPI.jl docs.
└ @ MPI ~/.julia/packages/MPI/b7MVG/deps/deps.jl:15
┌ Warning: You appear to be using MPI.jl with the default MPI binary on a cluster.
│ We recommend using the system-provided MPI, see the Configuration section of the MPI.jl docs.
└ @ MPI ~/.julia/packages/MPI/b7MVG/deps/deps.jl:15
┌ Warning: You appear to be using MPI.jl with the default MPI binary on a cluster.
│ We recommend using the system-provided MPI, see the Configuration section of the MPI.jl docs.
└ @ MPI ~/.julia/packages/MPI/b7MVG/deps/deps.jl:15
┌ Warning: You appear to be using MPI.jl with the default MPI binary on a cluster.
│ We recommend using the system-provided MPI, see the Configuration section of the MPI.jl docs.
└ @ MPI ~/.julia/packages/MPI/b7MVG/deps/deps.jl:15
┌ Warning: You appear to be using MPI.jl with the default MPI binary on a cluster.
│ We recommend using the system-provided MPI, see the Configuration section of the MPI.jl docs.
└ @ MPI ~/.julia/packages/MPI/b7MVG/deps/deps.jl:15
┌ Warning: You appear to be using MPI.jl with the default MPI binary on a cluster.
│ We recommend using the system-provided MPI, see the Configuration section of the MPI.jl docs.
└ @ MPI ~/.julia/packages/MPI/b7MVG/deps/deps.jl:15
┌ Warning: You appear to be using MPI.jl with the default MPI binary on a cluster.
│ We recommend using the system-provided MPI, see the Configuration section of the MPI.jl docs.
└ @ MPI ~/.julia/packages/MPI/b7MVG/deps/deps.jl:15
┌ Warning: You appear to be using MPI.jl with the default MPI binary on a cluster.
│ We recommend using the system-provided MPI, see the Configuration section of the MPI.jl docs.
└ @ MPI ~/.julia/packages/MPI/b7MVG/deps/deps.jl:15
