┌ Warning: You appear to be using MPI.jl with the default MPI binary on a cluster.
│ We recommend using the system-provided MPI, see the Configuration section of the MPI.jl docs.
└ @ MPI ~/.julia/packages/MPI/b7MVG/deps/deps.jl:15
┌ Warning: You appear to be using MPI.jl with the default MPI binary on a cluster.
│ We recommend using the system-provided MPI, see the Configuration section of the MPI.jl docs.
└ @ MPI ~/.julia/packages/MPI/b7MVG/deps/deps.jl:15
┌ Warning: You appear to be using MPI.jl with the default MPI binary on a cluster.
│ We recommend using the system-provided MPI, see the Configuration section of the MPI.jl docs.
└ @ MPI ~/.julia/packages/MPI/b7MVG/deps/deps.jl:15
┌ Warning: You appear to be using MPI.jl with the default MPI binary on a cluster.
│ We recommend using the system-provided MPI, see the Configuration section of the MPI.jl docs.
└ @ MPI ~/.julia/packages/MPI/b7MVG/deps/deps.jl:15
┌ Warning: You appear to be using MPI.jl with the default MPI binary on a cluster.
│ We recommend using the system-provided MPI, see the Configuration section of the MPI.jl docs.
└ @ MPI ~/.julia/packages/MPI/b7MVG/deps/deps.jl:15
┌ Warning: You appear to be using MPI.jl with the default MPI binary on a cluster.
│ We recommend using the system-provided MPI, see the Configuration section of the MPI.jl docs.
└ @ MPI ~/.julia/packages/MPI/b7MVG/deps/deps.jl:15
┌ Warning: You appear to be using MPI.jl with the default MPI binary on a cluster.
│ We recommend using the system-provided MPI, see the Configuration section of the MPI.jl docs.
└ @ MPI ~/.julia/packages/MPI/b7MVG/deps/deps.jl:15
┌ Warning: You appear to be using MPI.jl with the default MPI binary on a cluster.
│ We recommend using the system-provided MPI, see the Configuration section of the MPI.jl docs.
└ @ MPI ~/.julia/packages/MPI/b7MVG/deps/deps.jl:15
┌ Warning: You appear to be using MPI.jl with the default MPI binary on a cluster.
│ We recommend using the system-provided MPI, see the Configuration section of the MPI.jl docs.
└ @ MPI ~/.julia/packages/MPI/b7MVG/deps/deps.jl:15
┌ Warning: You appear to be using MPI.jl with the default MPI binary on a cluster.
│ We recommend using the system-provided MPI, see the Configuration section of the MPI.jl docs.
└ @ MPI ~/.julia/packages/MPI/b7MVG/deps/deps.jl:15
┌ Warning: You appear to be using MPI.jl with the default MPI binary on a cluster.
│ We recommend using the system-provided MPI, see the Configuration section of the MPI.jl docs.
└ @ MPI ~/.julia/packages/MPI/b7MVG/deps/deps.jl:15
┌ Warning: You appear to be using MPI.jl with the default MPI binary on a cluster.
│ We recommend using the system-provided MPI, see the Configuration section of the MPI.jl docs.
└ @ MPI ~/.julia/packages/MPI/b7MVG/deps/deps.jl:15
┌ Warning: You appear to be using MPI.jl with the default MPI binary on a cluster.
│ We recommend using the system-provided MPI, see the Configuration section of the MPI.jl docs.
└ @ MPI ~/.julia/packages/MPI/b7MVG/deps/deps.jl:15
┌ Warning: You appear to be using MPI.jl with the default MPI binary on a cluster.
│ We recommend using the system-provided MPI, see the Configuration section of the MPI.jl docs.
└ @ MPI ~/.julia/packages/MPI/b7MVG/deps/deps.jl:15
┌ Warning: You appear to be using MPI.jl with the default MPI binary on a cluster.
│ We recommend using the system-provided MPI, see the Configuration section of the MPI.jl docs.
└ @ MPI ~/.julia/packages/MPI/b7MVG/deps/deps.jl:15
┌ Warning: You appear to be using MPI.jl with the default MPI binary on a cluster.
│ We recommend using the system-provided MPI, see the Configuration section of the MPI.jl docs.
└ @ MPI ~/.julia/packages/MPI/b7MVG/deps/deps.jl:15
┌ Warning: You appear to be using MPI.jl with the default MPI binary on a cluster.
│ We recommend using the system-provided MPI, see the Configuration section of the MPI.jl docs.
└ @ MPI ~/.julia/packages/MPI/b7MVG/deps/deps.jl:15
┌ Warning: You appear to be using MPI.jl with the default MPI binary on a cluster.
│ We recommend using the system-provided MPI, see the Configuration section of the MPI.jl docs.
└ @ MPI ~/.julia/packages/MPI/b7MVG/deps/deps.jl:15
┌ Warning: You appear to be using MPI.jl with the default MPI binary on a cluster.
│ We recommend using the system-provided MPI, see the Configuration section of the MPI.jl docs.
└ @ MPI ~/.julia/packages/MPI/b7MVG/deps/deps.jl:15
┌ Warning: You appear to be using MPI.jl with the default MPI binary on a cluster.
│ We recommend using the system-provided MPI, see the Configuration section of the MPI.jl docs.
└ @ MPI ~/.julia/packages/MPI/b7MVG/deps/deps.jl:15
┌ Warning: You appear to be using MPI.jl with the default MPI binary on a cluster.
│ We recommend using the system-provided MPI, see the Configuration section of the MPI.jl docs.
└ @ MPI ~/.julia/packages/MPI/b7MVG/deps/deps.jl:15
┌ Warning: You appear to be using MPI.jl with the default MPI binary on a cluster.
│ We recommend using the system-provided MPI, see the Configuration section of the MPI.jl docs.
└ @ MPI ~/.julia/packages/MPI/b7MVG/deps/deps.jl:15
┌ Warning: You appear to be using MPI.jl with the default MPI binary on a cluster.
│ We recommend using the system-provided MPI, see the Configuration section of the MPI.jl docs.
└ @ MPI ~/.julia/packages/MPI/b7MVG/deps/deps.jl:15
┌ Warning: You appear to be using MPI.jl with the default MPI binary on a cluster.
│ We recommend using the system-provided MPI, see the Configuration section of the MPI.jl docs.
└ @ MPI ~/.julia/packages/MPI/b7MVG/deps/deps.jl:15
┌ Warning: You appear to be using MPI.jl with the default MPI binary on a cluster.
│ We recommend using the system-provided MPI, see the Configuration section of the MPI.jl docs.
└ @ MPI ~/.julia/packages/MPI/b7MVG/deps/deps.jl:15
┌ Warning: You appear to be using MPI.jl with the default MPI binary on a cluster.
│ We recommend using the system-provided MPI, see the Configuration section of the MPI.jl docs.
└ @ MPI ~/.julia/packages/MPI/b7MVG/deps/deps.jl:15
┌ Warning: You appear to be using MPI.jl with the default MPI binary on a cluster.
│ We recommend using the system-provided MPI, see the Configuration section of the MPI.jl docs.
└ @ MPI ~/.julia/packages/MPI/b7MVG/deps/deps.jl:15
┌ Warning: You appear to be using MPI.jl with the default MPI binary on a cluster.
│ We recommend using the system-provided MPI, see the Configuration section of the MPI.jl docs.
└ @ MPI ~/.julia/packages/MPI/b7MVG/deps/deps.jl:15
