[0] Config.pm:302> INFO - This is Biber 2.9
[0] Config.pm:305> INFO - Logfile is 'main.blg'
[67] biber:313> INFO - === lun. oct. 12, 2020, 14:24:57
[177] Biber.pm:371> INFO - Reading 'main.bcf'
[233] Biber.pm:854> INFO - Using all citekeys in bib section 0
[242] Biber.pm:3981> INFO - Processing section 0
[312] Biber.pm:4154> INFO - Looking for bibtex format file 'main.bib' for section 0
[337] bibtex.pm:1468> INFO - LaTeX decoding ...
[443] bibtex.pm:1294> INFO - Found BibTeX data source 'main.bib'
[446] Utils.pm:169> WARN - Duplicate entry key: 'samuel1988general' in file 'main.bib', skipping ...
[464] Utils.pm:169> WARN - month field 'jul' in entry 'tully1990' is not an integer - this will probably not sort properly.
[589] Utils.pm:169> WARN - month field 'Aug' in entry 'aharonov1959significance' is not an integer - this will probably not sort properly.
[619] Utils.pm:169> WARN - month field 'sep' in entry 'Ford1981gravitational' is not an integer - this will probably not sort properly.
[627] Utils.pm:169> WARN - month field 'Dec' in entry 'Datta1993Geometric' is not an integer - this will probably not sort properly.
[683] Utils.pm:169> WARN - year field 'October 18, 2018' in entry 'top-ins-3' is not an integer - this will probably not sort properly.
[754] Utils.pm:169> WARN - month field 'Oct' in entry 'wilson1974confinement' is not an integer - this will probably not sort properly.
[882] UCollate.pm:68> INFO - Overriding locale 'en-US' defaults 'normalization = NFD' with 'normalization = prenormalized'
[882] UCollate.pm:68> INFO - Overriding locale 'en-US' defaults 'variable = shifted' with 'variable = non-ignorable'
[882] Biber.pm:3809> INFO - Sorting list 'none/global//global/global' of type 'entry' with template 'none' and locale 'en-US'
[883] Biber.pm:3815> INFO - No sort tailoring available for locale 'en-US'
[931] bbl.pm:617> INFO - Writing 'main.bbl' with encoding 'UTF-8'
[958] bbl.pm:720> INFO - Output to main.bbl
[958] Biber.pm:110> INFO - WARNINGS: 7
