^D:\WORK\SYNERGY\SUMMER_SCHOOL\EVALUATIONFUNCTIONS\EVALUATIONFUNCTIONS\STDAFX.CPP
D:\WORK\SYNERGY\SUMMER_SCHOOL\EVALUATIONFUNCTIONS\EVALUATIONFUNCTIONS\RELEASE\EVALUATIONFUNCTIONS.PCH
D:\WORK\SYNERGY\SUMMER_SCHOOL\EVALUATIONFUNCTIONS\EVALUATIONFUNCTIONS\RELEASE\VC140.PDB
D:\WORK\SYNERGY\SUMMER_SCHOOL\EVALUATIONFUNCTIONS\EVALUATIONFUNCTIONS\RELEASE\STDAFX.OBJ
^D:\WORK\SYNERGY\SUMMER_SCHOOL\EVALUATIONFUNCTIONS\EVALUATIONFUNCTIONS\DLLMAIN.CPP
D:\WORK\SYNERGY\SUMMER_SCHOOL\EVALUATIONFUNCTIONS\EVALUATIONFUNCTIONS\RELEASE\VC140.PDB
D:\WORK\SYNERGY\SUMMER_SCHOOL\EVALUATIONFUNCTIONS\EVALUATIONFUNCTIONS\RELEASE\DLLMAIN.OBJ
^D:\WORK\SYNERGY\SUMMER_SCHOOL\EVALUATIONFUNCTIONS\EVALUATIONFUNCTIONS\EVALUATIONFUNCTIONS.CPP
D:\WORK\SYNERGY\SUMMER_SCHOOL\EVALUATIONFUNCTIONS\EVALUATIONFUNCTIONS\RELEASE\VC140.PDB
D:\WORK\SYNERGY\SUMMER_SCHOOL\EVALUATIONFUNCTIONS\EVALUATIONFUNCTIONS\RELEASE\EVALUATIONFUNCTIONS.OBJ
