^D:\WORK\SYNERGY\SUMMER_SCHOOL\EVALUATIONFUNCTIONS\EVALUATIONFUNCTIONS\STDAFX.CPP
/c /Zi /nologo /W3 /WX- /sdl /O2 /Oi /Oy- /GL /D WIN32 /D NDEBUG /D _WINDOWS /D _USRDLL /D EVALUATIONFUNCTIONS_EXPORTS /D _WINDLL /D _UNICODE /D UNICODE /Gm- /EHsc /MD /GS /Gy /fp:precise /Zc:wchar_t /Zc:forScope /Zc:inline /Yc"stdafx.h" /Fp"RELEASE\EVALUATIONFUNCTIONS.PCH" /Fo"RELEASE\\" /Fd"RELEASE\VC140.PDB" /Gd /TP /analyze- D:\WORK\SYNERGY\SUMMER_SCHOOL\EVALUATIONFUNCTIONS\EVALUATIONFUNCTIONS\STDAFX.CPP
^D:\WORK\SYNERGY\SUMMER_SCHOOL\EVALUATIONFUNCTIONS\EVALUATIONFUNCTIONS\DLLMAIN.CPP
/c /Zi /nologo /W3 /WX- /sdl /O2 /Oi /Oy- /GL /D WIN32 /D NDEBUG /D _WINDOWS /D _USRDLL /D EVALUATIONFUNCTIONS_EXPORTS /D _WINDLL /D _UNICODE /D UNICODE /Gm- /EHsc /MD /GS /Gy /fp:precise /Zc:wchar_t /Zc:forScope /Zc:inline /Fo"RELEASE\\" /Fd"RELEASE\VC140.PDB" /Gd /TP /analyze- D:\WORK\SYNERGY\SUMMER_SCHOOL\EVALUATIONFUNCTIONS\EVALUATIONFUNCTIONS\DLLMAIN.CPP
^D:\WORK\SYNERGY\SUMMER_SCHOOL\EVALUATIONFUNCTIONS\EVALUATIONFUNCTIONS\EVALUATIONFUNCTIONS.CPP
/c /Zi /nologo /W3 /WX- /sdl /O2 /Oi /Oy- /GL /D WIN32 /D NDEBUG /D _WINDOWS /D _USRDLL /D EVALUATIONFUNCTIONS_EXPORTS /D _WINDLL /D _UNICODE /D UNICODE /Gm- /EHsc /MD /GS /Gy /fp:precise /Zc:wchar_t /Zc:forScope /Zc:inline /Yu"stdafx.h" /Fp"RELEASE\EVALUATIONFUNCTIONS.PCH" /Fo"RELEASE\\" /Fd"RELEASE\VC140.PDB" /Gd /TP /analyze- D:\WORK\SYNERGY\SUMMER_SCHOOL\EVALUATIONFUNCTIONS\EVALUATIONFUNCTIONS\EVALUATIONFUNCTIONS.CPP
