[
	{
		"valor1" : "ROMERO HERNANDEZ JAIME ANTONIO",
		"valor2" : "COMERCIALIZADORA NATURISTA SA DE CV"
	},
	{
		"valor1" : "SANCHEZ MARTINEZ MARCOS",
		"valor2" : "COMERCIALIZADORA NATURISTA SA DE CV"
	},
	{
		"valor1" : "DE LOZA CERDA ISRAEL",
		"valor2" : "COMERCIALIZADORA NATURISTA SA DE CV"
	},
	{
		"valor1" : "PEREZ SALAZAR IVAN JESUS",
		"valor2" : "COMERCIALIZADORA NATURISTA SA DE CV"
	},
	{
		"valor1" : "CALDERON PIZANO ALFREDO",
		"valor2" : "COMERCIALIZADORA NATURISTA SA DE CV"
	},
	{
		"valor1" : "ESTEVEZ MARTINEZ MOISES",
		"valor2" : "GRUPO INMOBILIARIO SAIDA SA DE CV"
	},
	{
		"valor1" : "HERNANDEZ POSADAS GONZALO",
		"valor2" : "TRANSPORTES SCORPIO LOPEZ GONZALEZ SA DE CV"
	},
	{
		"valor1" : "MARQUEZ RODRIGUEZ ARIEL GUSTAVO",
		"valor2" : "MUNICIPO DE XOCHITEPEC"
	},
	{
		"valor1" : "ORDUÑA PEÑA RODOLFO",
		"valor2" : "MUNICIPO DE XOCHITEPEC"
	},
	{
		"valor1" : "ESPINDOLA HERNANDEZ NELSON BENJAMIN",
		"valor2" : "MUNICIPO DE XOCHITEPEC"
	},
	{
		"valor1" : "DANIEL VELAZQUEZ VICTOR FERNANDO",
		"valor2" : "VALDER SA DE CV"
	},
	{
		"valor1" : "PEREZ HERNANDEZ MAGDALENO ANGEL",
		"valor2" : "ARVIG SA DE CV"
	},
	{
		"valor1" : "CALVILLO SANCHEZ ANGEL FERNANDO",
		"valor2" : "CLEAN SERVICE SA DE CV"
	},
	{
		"valor1" : "MAYA REYES JUAN ALBERTO",
		"valor2" : "GORAT SA DE CV"
	},
	{
		"valor1" : "SANCHEZ CASTILLO ANDRES",
		"valor2" : "GRUPO INMOBILIARIO SAIDA SA DE CV"
	},
	{
		"valor1" : "PIXTA XALA ANDRES",
		"valor2" : "GORAT SA DE CV"
	},
	{
		"valor1" : "JOSE JIMENEZ TEODORO",
		"valor2" : "GORAT SA DE CV"
	},
	{
		"valor1" : "ESTUDILLO SANCHEZ ISIDRO",
		"valor2" : "GORAT SA DE CV"
	},
	{
		"valor1" : "SANCHEZ GARZA JORGE ALONSO",
		"valor2" : "SERVICIOS ALEATORIOS MOCTEZUMA SA DE CV"
	},
	{
		"valor1" : "DE LA CRUZ BALLINAS ALEJANDRO",
		"valor2" : "SERVICIOS ALEATORIOS MOCTEZUMA SA DE CV"
	},
	{
		"valor1" : "MARROQUIN GRAJALES LUIS ENRIQUE",
		"valor2" : "SERVICIOS ALEATORIOS MOCTEZUMA SA DE CV"
	},
	{
		"valor1" : "BALBOA GONZALEZ JORGE ANTONIO",
		"valor2" : "SERVICIOS ALEATORIOS MOCTEZUMA SA DE CV"
	},
	{
		"valor1" : "MARQUEZ RODRIGUEZ CARLOS YANIK",
		"valor2" : "MUNICIPO DE XOCHITEPEC"
	},
	{
		"valor1" : "TORRENTERA FLORES EDGAR NEFTALI",
		"valor2" : "NEGOCIOS EMPRESARIALES ELEOS SA DE CV"
	},
	{
		"valor1" : "ZAMARRIPA MARTINEZ JAQUELINE SUJEY",
		"valor2" : "GRUPO ESRO SA DE CV"
	},
	{
		"valor1" : "ZAVALA CARRILLO JOSE ARTURO",
		"valor2" : "MOVIMIENTO ZAVALA TX SA DE CV"
	},
	{
		"valor1" : "ESPINOZA ROMERO JOSE",
		"valor2" : "JKM EXCHANGE CENTRO CAMBIARIO SA DE CV"
	},
	{
		"valor1" : "CHICO DE GORIBAR HECTOR GERARDO",
		"valor2" : "AVAL DE VALOR INMOBILIARIO SANTA FE, S DE RL DE CV"
	},
	{
		"valor1" : "BRAVO BRAVO CESAR ALEJANDRO",
		"valor2" : "DELOS PROTECT S RL DE CV"
	},
	{
		"valor1" : "VEGA AGUILAR ALEJANDRO",
		"valor2" : "SERVICIOS PROFESIONALES AZUCAREROS SA DE CV"
	},
	{
		"valor1" : "VALDEZ RIOS JAIME ENRIQUE",
		"valor2" : "JKM EXCHANGE CENTRO CAMBIARIO SA DE CV"
	},
	{
		"valor1" : "MARTINEZ ARAIZA ALEJANDRO",
		"valor2" : "SINDICATO NACIONAL ALIMENTICIO Y DE COMERCIO, SIMILARES Y CONEXOS DE LA REPUBLICA MEXICANA"
	},
	{
		"valor1" : "ROSAS SANCHEZ HECTOR HUGO",
		"valor2" : "SERVICIOS INTEGRALES DE COMUNICACIÓN DIGITAL DELOS SA DE CV"
	},
	{
		"valor1" : "ZARATE LEYVA LUIS ANGEL",
		"valor2" : "MARTINEZ TRUCKS SA DE CV"
	},
	{
		"valor1" : "PATRON MUNGUIA CHAIM IXBALANQUE",
		"valor2" : "HC CONSULTORES SA DE CV"
	},
	{
		"valor1" : "BENITEZ GARCIA JOSE JELIN",
		"valor2" : "GRUPO EMPRESARIAL BECODA SA DE CV"
	},
	{
		"valor1" : "HERNANDEZ ROBLEDO IVAN ",
		"valor2" : "ACURGEN SA DE CV"
	},
	{
		"valor1" : "CRUZ BALLADOS JOAQUIN HUMBERTO",
		"valor2" : "ROLMAN SA DE CV"
	},
	{
		"valor1" : "ORDAZ JIMENEZ JOSUE GEOVANNI",
		"valor2" : "GRUPO COSMIC SA DE CV"
	},
	{
		"valor1" : "LELO DE LARREA ROBLES LEON ALEJANDRO",
		"valor2" : "SISTEMAS INTEGRALES DE PROTECCION INVESTIGACION Y RESGUARDO SEGURIDAD PRIVADA SA DE CV"
	},
	{
		"valor1" : "REYES MAYA JAVIER",
		"valor2" : "SERVI BENZIN SA DE CV"
	},
	{
		"valor1" : "CARREÑO ORDAZ DIEGO",
		"valor2" : "LIMPIACERO SA DE CV"
	},
	{
		"valor1" : "LOBATO RAMIREZ MARTIN",
		"valor2" : "INT INTELLIGENCE AND TELECOM TECHNOLOGIES MEXICO SA DE CV"
	},
	{
		"valor1" : "JIMENEZ ROMERO JOSE LUIS",
		"valor2" : "INT INTELLIGENCE AND TELECOM TECHNOLOGIES MEXICO SA DE CV"
	},
	{
		"valor1" : "RAMIREZ HERNANDEZ EDUARDO GESSEL",
		"valor2" : "AGFZ CONSULTORES S.C."
	},
	{
		"valor1" : "LARIOS MAGAÑA FRANCISCO JAVIER",
		"valor2" : "COMERCIALIZADORA NATURISTA SA DE CV"
	},
	{
		"valor1" : "LUNA BERNARDO",
		"valor2" : "MUÑOZ C. Y ASOCIADOS S.A DE C.V"
	},
	{
		"valor1" : "MUÑOZ GARCIA MARTIN",
		"valor2" : "MUÑOZ C. Y ASOCIADOS S.A DE C.V"
	},
	{
		"valor1" : "MORALES GARCIA ISRAEL ALEJANDRO",
		"valor2" : "FEMEXPADEL SA DE CV"
	},
	{
		"valor1" : "ALONSO COLIS EUGENIO",
		"valor2" : "EXECUTIVE LOGISTICS AND SERVICES MEXICO S DE RL DE CV"
	},
	{
		"valor1" : "ENGUILO GUILLEN JUAN MANUEL",
		"valor2" : "VALTAME TRANSLADO DE VALORES S.A DE C.V"
	},
	{
		"valor1" : "RAMIREZ HERNANDEZ CARLOS ENRIQUE",
		"valor2" : "BLINDAJES TECNOLOGICOS 2020 SA DE CV"
	},
	{
		"valor1" : "MARTINEZ ZAMORA FERNANDO",
		"valor2" : "MUÑOZ C. Y ASOCIADOS S.A DE C.V"
	},
	{
		"valor1" : "GOMEZ HERNANDEZ JESUS",
		"valor2" : "MUÑOZ C. Y ASOCIADOS S.A DE C.V"
	},
	{
		"valor1" : "RODRIGUEZ ESPINOZA JOSE GUILLERMO",
		"valor2" : "SERVICIOS ESPECIALIZADOS FINTED SA DE CV"
	},
	{
		"valor1" : "GUTIERREZ ESPARZA OMAR MORONI",
		"valor2" : "CAZVEMEZ SA DE CV"
	},
	{
		"valor1" : "",
		"valor2" : "BINOMIO"
	},
	{
		"valor1" : "MARROQUIN ZARAGOZA FERNANDO MIGUEL",
		"valor2" : "ROLMAN SA DE CV"
	},
	{
		"valor1" : "FARFAN FLORES MACARIO PEDRO",
		"valor2" : "AGFZ CONSULTORES S.C."
	},
	{
		"valor1" : "MENDOZA LARA JERONIMO JAVIER",
		"valor2" : "CONSULTORES E INVESTIGADORES EN ADMINISTRACION S.C"
	},
	{
		"valor1" : "CASTRO VILLEGAS EDSON YAIR",
		"valor2" : "NEGOCIOS INDUSTRIALES DER, SA DE CV"
	},
	{
		"valor1" : "MORENO GARCIA DANIEL",
		"valor2" : "ALTRE S.C CONSULTORES LEGALES"
	},
	{
		"valor1" : "TORRES VILLALOBOS JUAN ALBERTO",
		"valor2" : "ALTRE S.C CONSULTORES LEGALES"
	},
	{
		"valor1" : "JIMENEZ HERAS MISAEL",
		"valor2" : "ALTRE S.C CONSULTORES LEGALES"
	},
	{
		"valor1" : "GUERRA SANCHEZ HUMBERTO EMANUEL",
		"valor2" : "MIA PRODUCTION&LOGISTIC SA DE CV Y/O FAMILIA"
	},
	{
		"valor1" : "SOTO ORDOÑEZ EDWIN ELIUD",
		"valor2" : "MIA PRODUCTION&LOGISTIC SA DE CV Y/O FAMILIA"
	},
	{
		"valor1" : "CANO TERWOGT JUAN CARLOS",
		"valor2" : "CORREDOR INSURGENTES SA DE CV"
	},
	{
		"valor1" : "IBAÑEZ VALADEZ HUGO",
		"valor2" : "CORREDOR INSURGENTES SA DE CV"
	},
	{
		"valor1" : "FLORES DIAZ JESUS DAVID",
		"valor2" : "CORREDOR INSURGENTES SA DE CV"
	},
	{
		"valor1" : "MARTINEZ CASTELAN RICARDO ALAN",
		"valor2" : "CORREDOR INSURGENTES SA DE CV"
	},
	{
		"valor1" : "GONZALEZ RODRIGUEZ MARCO ISRAEL",
		"valor2" : "DBM FACTOR HUMANO SA DE CV"
	},
	{
		"valor1" : "CORDERO MONTIEL ROBERTO CARLOS",
		"valor2" : "DBM FACTOR HUMANO SA DE CV"
	},
	{
		"valor1" : "ORTEGA FLORES ERICK",
		"valor2" : "DBM FACTOR HUMANO SA DE CV"
	},
	{
		"valor1" : "GONZALEZ PEREZ ARTURO",
		"valor2" : "GRUPO VANTERI SA DE CV"
	},
	{
		"valor1" : "ALVAREZ TREJO OMAR",
		"valor2" : "ALTRE S.C CONSULTORES LEGALES"
	},
	{
		"valor1" : "ALVAREZ TREJO CESAR",
		"valor2" : "ALTRE S.C CONSULTORES LEGALES"
	},
	{
		"valor1" : "PEREZ VAZQUEZ GUSTAVO",
		"valor2" : "ACURGEN SA DE CV"
	},
	{
		"valor1" : "GONZALEZ BARRAZA GUILLERMO",
		"valor2" : "ARVIG SA DE CV"
	},
	{
		"valor1" : "OLMOS MAZARIEGOS DAVID HUMBERTO",
		"valor2" : "DBM FACTOR HUMANO SA DE CV"
	},
	{
		"valor1" : "ARCOS EVARISTO FRANCISCO",
		"valor2" : "ARMASEK SA DE CV"
	},
	{
		"valor1" : "HUERTA MORALES GABRIELA VERONICA",
		"valor2" : "AGFZ CONSULTORES S.C."
	},
	{
		"valor1" : "PEREZ SANCHEZ JUAN CANDIDO",
		"valor2" : "CATCAI S DE RL DE CV"
	},
	{
		"valor1" : "CRUZ BRIONES EDUARDO",
		"valor2" : "CINTAS AREDCA SA DE CV"
	},
	{
		"valor1" : "REYES TEJEDA FELIX ADRIAN",
		"valor2" : "RAVIDOS SA DE CV"
	},
	{
		"valor1" : "RODRIGUEZ RODRIGUEZ ANDRES ARMANDO",
		"valor2" : "CONSULTORES ASESORES Y ARRENDADORES KRONE SA DE CV"
	},
	{
		"valor1" : "FRANCO CORZO Y TORRES JULIO CESAR",
		"valor2" : "GRUPO DE INVESTIGACION POLARIS SA DE CV"
	},
	{
		"valor1" : "PRADO ORDOÑEZ ENRIQUE",
		"valor2" : "ACURGEN SA DE CV"
	},
	{
		"valor1" : "RODRIGUEZ URIBE JUAN CARLOS",
		"valor2" : "CORREDOR INSURGENTES SA DE CV"
	},
	{
		"valor1" : "ZUCCOLI ACOSTA ENRIQUE SEBASTIAN",
		"valor2" : "CORREDOR INSURGENTES SA DE CV"
	},
	{
		"valor1" : "ZUÑIGA ISLAS JONATHAN ENRIQUE",
		"valor2" : "AGENCIA CENTRAL DE PROTECCION EJECUTIVA Y PATRIMONIAL SHABAK SA DE CV"
	},
	{
		"valor1" : "MUÑOZ MARTINEZ SALVADOR",
		"valor2" : "RECUPERADORA DE MATERIALES ECOLOGICOS SA DE CV"
	},
	{
		"valor1" : "LINARES CANALES CARLOS ALBERTO",
		"valor2" : "RECUPERADORA DE MATERIALES ECOLOGICOS SA DE CV"
	},
	{
		"valor1" : "IBAÑEZ SANDOVAL JESUS",
		"valor2" : "ORGANIZACIÓN Y COMERCIANTES Y COLONOS SA DE CV"
	},
	{
		"valor1" : "ROSALES HERNANDEZ JULIO CESAR",
		"valor2" : "ORGANIZACIÓN Y COMERCIANTES Y COLONOS SA DE CV"
	},
	{
		"valor1" : "SERNA JIMENEZ SERGIO ARTURO",
		"valor2" : "ACURGEN SA DE CV"
	},
	{
		"valor1" : "ALONSO HERNANDEZ ANDRES",
		"valor2" : "MUÑOZ C. Y ASOCIADOS S.A DE C.V"
	},
	{
		"valor1" : "OCHOA ROLDAN ARTURO",
		"valor2" : "AGFZ CONSULTORES S.C."
	},
	{
		"valor1" : "MONTES RAZO RAMON ALEJANDRO",
		"valor2" : "CORTES, USCANGA RIVERA Y ASOCIADOS SA DE CV"
	},
	{
		"valor1" : "CHAVEZ DONATO MARCO ANTONIO",
		"valor2" : "CORREDOR INSURGENTES SA DE CV"
	},
	{
		"valor1" : "REYNOSO GUERRA ALVARO HUMBERTO",
		"valor2" : "ESRO DIVEX CENTRO CAMBIARIO SA DE CV"
	},
	{
		"valor1" : "HEREDIA CISNEROS IVAN",
		"valor2" : "GRUPO SAN PEDRO S.A. DE C.V."
	},
	{
		"valor1" : "FERNANDEZ BONILLA MARIO",
		"valor2" : "GRUPO SAN PEDRO S.A. DE C.V."
	},
	{
		"valor1" : "BRAVO SANCHEZ OMAR",
		"valor2" : "GRUPO EMPRESARIAL BECODA SA DE CV"
	},
	{
		"valor1" : "RODRIGUEZ VARGAS EFREN",
		"valor2" : "ALFA LACTEOS SA DE CV"
	},
	{
		"valor1" : "CERON VARELA ERNESTO",
		"valor2" : "GRUPO PAKAL DE CHIAPAS SA DE CV"
	},
	{
		"valor1" : "BRAVO SANCHEZ RICARDO",
		"valor2" : "GRUPO EMPRESARIAL BECODA SA DE CV"
	},
	{
		"valor1" : "MARGOLIS SOBOL EDUARDO CUAHTEMOC",
		"valor2" : "LIVERPOOL"
	},
	{
		"valor1" : "ORTIZ GARCIA JOSUE GUILLERMO",
		"valor2" : "DELOS PROTECT S RL DE CV"
	},
	{
		"valor1" : "ZAGAL ARROYO SULMA YANELI",
		"valor2" : "DELOS PROTECT S RL DE CV"
	},
	{
		"valor1" : "PULIDO BLAS SAUL",
		"valor2" : "SEGURIDAD PRIVADA GORAT SA DE CV"
	},
	{
		"valor1" : "GELLER LEIZOREK EITAN",
		"valor2" : "LIVERPOOL"
	},
	{
		"valor1" : "FRANCO LAGARZA RICARDO",
		"valor2" : "COREYMAN SA DE CV"
	},
	{
		"valor1" : "VAZQUEZ CECILIANO IGNACIO JOSE",
		"valor2" : "TAKA CENTRO CAMBIARIO SA DE CV"
	},
	{
		"valor1" : "ZHU ZHAOQUIANG",
		"valor2" : "DRAGON HOUSE ZHU SA DE CV"
	},
	{
		"valor1" : "GONZALEZ ESCOBAR GERARDO",
		"valor2" : "TYL RIDA MEXICO SA DE CV"
	},
	{
		"valor1" : "ATANACIO BOLAÑOS RIGOBERTO",
		"valor2" : "TYL RIDA MEXICO SA DE CV"
	},
	{
		"valor1" : "GUZMAN JACOBO ANTONIO ALEJANDRO",
		"valor2" : "TINTORETTO SA DE CV"
	},
	{
		"valor1" : "CANTU GUERRERO EDGAR EDUARDO ALFREDO",
		"valor2" : "COMERCIALIZADORA GAINNEN SA DE CV"
	},
	{
		"valor1" : "LOMBARD ROSALES HECTOR ALEJANDRO",
		"valor2" : "TYL RIDA MEXICO SA DE CV"
	},
	{
		"valor1" : "PEREZ ABURTO JORGE",
		"valor2" : "SERVICIOS TOGEFORER SA DE CV"
	},
	{
		"valor1" : "ABURTO FLORENTINO EDGAR ARTURO",
		"valor2" : "SERVICIOS TOGEFORER SA DE CV"
	},
	{
		"valor1" : "ALARCON ALARCON CHRISTIAN",
		"valor2" : "INTELIGENCIA ESTRATEGICA EN SEGURIDAD PERSONAL SA DE CV"
	},
	{
		"valor1" : "HERNANDEZ HERNANDEZ ROBERTO",
		"valor2" : "INTELIGENCIA ESTRATEGICA EN SEGURIDAD PERSONAL SA DE CV"
	},
	{
		"valor1" : "CRUZ ORTIZ JESUS",
		"valor2" : "PISAQ SA DE CV"
	},
	{
		"valor1" : "ALCARAZ MEDINA DAVID",
		"valor2" : "PISAQ SA DE CV"
	},
	{
		"valor1" : "AVILA ZAVALA JORGE ALBERTO",
		"valor2" : "INTELIGENCIA ESTRATEGICA EN SEGURIDAD PERSONAL SA DE CV"
	},
	{
		"valor1" : "GARCIA GOMEZ VICTOR ALDO",
		"valor2" : "INTELIGENCIA ESTRATEGICA EN SEGURIDAD PERSONAL SA DE CV"
	},
	{
		"valor1" : "LEZO SERRATO ALEXIS",
		"valor2" : "SERVICIOS ESPECIALIZADOS FINTED SA DE CV"
	},
	{
		"valor1" : "CABRAL PALACIOS HERON ALBERTO",
		"valor2" : "DISTRITO BOX PROMOTIONS SA DE CV"
	},
	{
		"valor1" : "BELTRAN MOLINA GAUDENCIO",
		"valor2" : "DISTRITO BOX PROMOTIONS SA DE CV"
	},
	{
		"valor1" : "CARRILLO HUERTA ERIK EDGAR",
		"valor2" : "DISTRITO BOX PROMOTIONS SA DE CV"
	},
	{
		"valor1" : "HERMOSO Y COLIN LUIS OCTAVIO",
		"valor2" : "ACURGEN SA DE CV"
	},
	{
		"valor1" : "ACOSTA DORADO CESAR ARTURO",
		"valor2" : "PISAQ SA DE CV"
	},
	{
		"valor1" : "PORTILLO TRUJILLO CESAR EMILIO",
		"valor2" : "SERPROSEP SA DE CV"
	},
	{
		"valor1" : "GARFIAS ARREOLA JOEL",
		"valor2" : "SEGURIDAD PRIVADA ARMASEK SA DE CV"
	},
	{
		"valor1" : "BINOMIO",
		"valor2" : "SEGURIDAD PRIVADA ARMASEK SA DE CV"
	},
	{
		"valor1" : "CARDENAS PICOS MAXIMO OMAR DE JESUS",
		"valor2" : "ZUBI SERVICIOS INTEGRALES DE IMPORTACION LOGISTICA Y COMERCIO SA DE CV"
	},
	{
		"valor1" : "MENDOZA HERNANDEZ  MANUEL",
		"valor2" : "SERVICIOS DE COMUNICACIÓN DIGITAL HIVE SAPI DE CV"
	},
	{
		"valor1" : "GARCIA RAMIREZ ISRAEL",
		"valor2" : "GRUPO EMPRESARIAL BECODA SA DE CV"
	},
	{
		"valor1" : "VELAZQUEZ ZAMORA ALBERTO CARLOS",
		"valor2" : "BIOTERRA SA DE CV"
	},
	{
		"valor1" : "REYES LOPEZ JUAN ANTONIO",
		"valor2" : "NUEVA CENTRAL DE BRASIL SA DE CV"
	},
	{
		"valor1" : "MARIN REYES DANIEL",
		"valor2" : "CORTES, USCANGA RIVERA Y ASOCIADOS SA DE CV"
	},
	{
		"valor1" : "YAHUTENTZI ROSALES GERARDO",
		"valor2" : "FULL SERVICES SUPPLIER DEL CENTRO SA DE CV"
	},
	{
		"valor1" : "HERNANDEZ HERNANDEZ DAVID EDUARDO",
		"valor2" : "GRUPO EMPRESARIAL KARA HDEZ SA DE CV"
	},
	{
		"valor1" : "MARTINEZ HERNANDEZ JORGE DANIEL",
		"valor2" : "MARTINEZ HERNANDEZ JORGE DANIEL"
	},
	{
		"valor1" : "GARCIA TORRES ALEJANDRO DONNOVAN",
		"valor2" : "DELOS PROTECT S RL DE CV"
	},
	{
		"valor1" : "TOVAR ZARAGOZA MOISES ANTONIO",
		"valor2" : "GRUPO EMPRESARIAL KARA HDEZ SA DE CV"
	},
	{
		"valor1" : "COBOS ALARCON ENRIQUE",
		"valor2" : "GRUPO EMPRESARIAL KARA HDEZ SA DE CV"
	},
	{
		"valor1" : "BAUTISTA VARGAS JOSE LUIS",
		"valor2" : "DELOS PROTECT S RL DE CV"
	},
	{
		"valor1" : "DE PAZ PEÑA RAQUEL ",
		"valor2" : "GRUPO CORPORATIVO SOLCAT SA DE CV"
	},
	{
		"valor1" : "CRUZ DE JESUS CRISTIAN",
		"valor2" : "DELOS PROTECT S RL DE CV"
	},
	{
		"valor1" : "ALCANTARA CRUZ JUAN ROBERTO",
		"valor2" : "INT INTELLIGENCE AND TELECOM TECHNOLOGIES MEXICO SA DE CV"
	},
	{
		"valor1" : "ZAPATA AYALA JORGE ARTURO",
		"valor2" : "SAJU SA DE CV"
	},
	{
		"valor1" : "CONTRERAS RIOS HECTOR JOSE",
		"valor2" : "GRUPO SEES Y DISTRIBUCION SA DE CV"
	},
	{
		"valor1" : "HERNANDEZ HERNANDEZ ENRIQUE",
		"valor2" : "TRANSPORTES REMYENDO SA DE CV"
	},
	{
		"valor1" : "HERNANDEZ HERNANDEZ RENATO",
		"valor2" : "TRANSPORTES REMYENDO SA DE CV"
	},
	{
		"valor1" : "MORFIN JUAREZ HARNOLDO",
		"valor2" : "SEGURITY PRIVATE, ADVERTISING EVENTS HADES SA DE CV"
	},
	{
		"valor1" : "HERRERA BERMUDEZ HENDERSON ALEXANDER",
		"valor2" : "SERVICIOS ESPECIALIZADOS FINTED SA DE CV"
	},
	{
		"valor1" : "GARCIA MIRANDA RUBEN/LARGA",
		"valor2" : "ORANGE SHOP MEXICO SA DE CV"
	},
	{
		"valor1" : "GARCIA BASTIDA JUAN JOSE",
		"valor2" : "ORANGE SHOP MEXICO SA DE CV"
	},
	{
		"valor1" : "ORNELAS LOPEZ MILTON ",
		"valor2" : "ORANGE SHOP MEXICO SA DE CV"
	},
	{
		"valor1" : "TERVEN ESCOBAR GEOVANI",
		"valor2" : "ORANGE SHOP MEXICO SA DE CV"
	},
	{
		"valor1" : "VALDEZ BELTRAN ALEJANDRO",
		"valor2" : "ORANGE SHOP MEXICO SA DE CV"
	},
	{
		"valor1" : "GALINDO CARMONA ELISEO",
		"valor2" : "ACURGEN SA DE CV"
	},
	{
		"valor1" : "MARTINEZ GUTIERREZ DORIAN",
		"valor2" : "COMGOHE SA DE CV"
	},
	{
		"valor1" : "BUSTAMANTE GUTIERREZ RAUL",
		"valor2" : "COMGOHE SA DE CV"
	},
	{
		"valor1" : "ISLAS OLIVARES RUBEN EDUARDO",
		"valor2" : "ACURGEN SA DE CV"
	},
	{
		"valor1" : "GOMEZ TORRES CARLOS",
		"valor2" : "ACURGEN SA DE CV"
	},
	{
		"valor1" : "ORTEGA LANDA RAYMUNDO",
		"valor2" : "MUNICIPIO DE XOCHITEPEC"
	},
	{
		"valor1" : "GUILLEN LEAL ESAU JONATAN",
		"valor2" : "UIPSA SA DE CV"
	},
	{
		"valor1" : "MENDEZ GUTIERREZ GILBERTO",
		"valor2" : "SERVICIOS DE COMUNICACIÓN DIGITAL HIVE SAPI DE CV"
	},
	{
		"valor1" : "SOTO BARBA JOSE DOMINGO",
		"valor2" : "ULTRA LABORATORIOS"
	},
	{
		"valor1" : "GONZALEZ PALOMARES EDUARDO ULISES",
		"valor2" : "ULTRA LABORATORIOS"
	},
	{
		"valor1" : "FLORES GONZALEZ JONATHAN",
		"valor2" : "ORANGE SHOP MEXICO SA DE CV"
	},
	{
		"valor1" : "RODRIGUEZ GARCIA CARLOS ALBERTO",
		"valor2" : "ORANGE SHOP MEXICO SA DE CV"
	},
	{
		"valor1" : "VARGAS VIVEROS ANGEL",
		"valor2" : "ORANGE SHOP MEXICO SA DE CV"
	},
	{
		"valor1" : "REYNA GARCIA FRANCISCO JAVIER ",
		"valor2" : "ORANGE SHOP MEXICO SA DE CV"
	},
	{
		"valor1" : "ARREOLA ESCORCIA JESUS",
		"valor2" : "ORANGE SHOP MEXICO SA DE CV"
	},
	{
		"valor1" : "MALAGON ARVIZU JOSE RAUL",
		"valor2" : "DESARROLLOS E INVERSIONES WE BUILD SAPI DE CV"
	},
	{
		"valor1" : "RODRIGUEZ ARROYO CRISTIAN MAURICIO",
		"valor2" : "ELECTRODOS INFRA SA DE CV"
	},
	{
		"valor1" : "DIAZ GOVEA UBALDO",
		"valor2" : "ELECTRODOS INFRA SA DE CV"
	},
	{
		"valor1" : "TRINIDAD NAVARRO GILBERTO",
		"valor2" : "GRUPO SAN PEDRO S.A. DE C.V."
	},
	{
		"valor1" : "RAMIREZ YEPEZ MARCO JAIR",
		"valor2" : "UNIGAS SA DE CV"
	},
	{
		"valor1" : "RAMIREZ CHANTACA OCTAVIO",
		"valor2" : "UNIGAS SA DE CV"
	}
]
