[
	{
		"valor1" : "ZALL920331H154424938",
		"valor2" : "ZARATE LEYVA LUIS ANGEL",
		"valor3" : "F289032",
		"valor4" : "100",
		"valor5" : "392"
	},
	{
		"valor1" : "BEGJ700502H155045180",
		"valor2" : "BENITEZ GARCIA JOSE JELIN",
		"valor3" : "F289002",
		"valor4" : "30",
		"valor5" : "392"
	},
	{
		"valor1" : "HERI870316H094907922",
		"valor2" : "HERNANDEZ ROBLEDO IVAN",
		"valor3" : "F286330",
		"valor4" : "30",
		"valor5" : "392"
	},
	{
		"valor1" : "CUBJ671206H305292796",
		"valor2" : "CRUZ BALLADOS JOAQUIN HUMBERTO",
		"valor3" : "F286309",
		"valor4" : "30",
		"valor5" : "392"
	},
	{
		"valor1" : "LERA701028H094104958",
		"valor2" : "LELO DE LARREA ROBLES LEON ALEJANDRO",
		"valor3" : "F286275",
		"valor4" : "200",
		"valor5" : "392"
	},
	{
		"valor1" : "REMJ790112H204157355",
		"valor2" : "REYES MAYA JAVIER",
		"valor3" : "F180816",
		"valor4" : "30",
		"valor5" : "392"
	},
	{
		"valor1" : "CAOD871103H094969859",
		"valor2" : "CARREÑO ORDAZ DIEGO",
		"valor3" : "F288987",
		"valor4" : "30",
		"valor5" : "392"
	},
	{
		"valor1" : "LORM820702H215310653",
		"valor2" : "LOBATO RAMIREZ MARTIN",
		"valor3" : "F288596",
		"valor4" : "30",
		"valor5" : "392"
	},
	{
		"valor1" : "JIRL710512H09710288",
		"valor2" : "JIMENEZ ROMERO JOSE LUIS",
		"valor3" : "F286158",
		"valor4" : "30",
		"valor5" : "392"
	},
	{
		"valor1" : "CASA930212H304916286",
		"valor2" : "CALVILLO SÁNCHEZ ÁNGEL FERNANDO",
		"valor3" : "F180953",
		"valor4" : "200",
		"valor5" : "392"
	},
	{
		"valor1" : "RAHE801208H09715461",
		"valor2" : "RAMIREZ HERNANDEZ EDUARDO GESSEL",
		"valor3" : "F288639",
		"valor4" : "30",
		"valor5" : "392"
	},
	{
		"valor1" : "LAMF860319H09979899",
		"valor2" : "LARIOS MAGAÑA FRANCISCO JAVIER",
		"valor3" : "F289004",
		"valor4" : "30",
		"valor5" : "392"
	},
	{
		"valor1" : "LUXB760427H11543983",
		"valor2" : "LUNA BERNARDO",
		"valor3" : "F180798",
		"valor4" : "30",
		"valor5" : "392"
	},
	{
		"valor1" : "MUGM890404H111088350",
		"valor2" : "MUÑOZ GARCIA MARTIN",
		"valor3" : "F286156",
		"valor4" : "30",
		"valor5" : "392"
	},
	{
		"valor1" : "MOGI900501H094834861",
		"valor2" : "MORALES GARCIA ISRAEL ALEJANDRO",
		"valor3" : "F286157",
		"valor4" : "30",
		"valor5" : "392"
	},
	{
		"valor1" : "AOCE871212H204342003",
		"valor2" : "ALONSO COLIS EUGENIO",
		"valor3" : "F289000",
		"valor4" : "30",
		"valor5" : "392"
	},
	{
		"valor1" : "EUGJ900812H094954898",
		"valor2" : "ENGUILO GUILLEN JUAN MANUEL",
		"valor3" : "F186012",
		"valor4" : "30",
		"valor5" : "392"
	},
	{
		"valor1" : "RAHC840522H271001477",
		"valor2" : "RAMIREZ HERNANDEZ CARLOS ENRIQUE",
		"valor3" : "F288189",
		"valor4" : "30",
		"valor5" : "392"
	},
	{
		"valor1" : "MAZF750414H30293345",
		"valor2" : "MARTINEZ ZAMORA FERNANDO",
		"valor3" : "F180977",
		"valor4" : "30",
		"valor5" : "392"
	},
	{
		"valor1" : "GOHJ761008H20996627",
		"valor2" : "GOMEZ HERNANDEZ JESUS",
		"valor3" : "F186004",
		"valor4" : "30",
		"valor5" : "392"
	},
	{
		"valor1" : "ROEG750210H115291553",
		"valor2" : "RODRIGUEZ ESPINOZA JOSE GUILLERMO",
		"valor3" : "F180966",
		"valor4" : "30",
		"valor5" : "392"
	},
	{
		"valor1" : "BAPM871102H095004832",
		"valor2" : "BARRERA PEDRAZA MIGUEL ANGEL",
		"valor3" : "F180847",
		"valor4" : "30",
		"valor5" : "392"
	},
	{
		"valor1" : "RABM831129H154978475",
		"valor2" : "RAMIREZ BARRIENTOS MARCOS",
		"valor3" : "F288977",
		"valor4" : "30",
		"valor5" : "392"
	},
	{
		"valor1" : "GUEO851016H095035092",
		"valor2" : "GUTIERREZ ESPARZA OMAR MORONI",
		"valor3" : "F286261",
		"valor4" : "200",
		"valor5" : "392"
	},
	{
		"valor1" : "MAZF880929H165292795",
		"valor2" : "MARROQUIN ZARAGOZA FERNANDO MIGUEL",
		"valor3" : "F288133",
		"valor4" : "45",
		"valor5" : "392"
	},
	{
		"valor1" : "FAFM570102H0940634 ",
		"valor2" : "FARFAN FLORES MACARIO PEDRO",
		"valor3" : "F286218",
		"valor4" : "30",
		"valor5" : "392"
	},
	{
		"valor1" : "MELJ640930H095291774",
		"valor2" : "MENDOZA LARA JERONIMO JAVIER",
		"valor3" : "F180878",
		"valor4" : "30",
		"valor5" : "392"
	},
	{
		"valor1" : "CAVE930328H175301623",
		"valor2" : "CASTRO VILLEGAS EDSON YAIR",
		"valor3" : "F180874",
		"valor4" : "30",
		"valor5" : "392"
	},
	{
		"valor1" : "MOGD670912H09751822",
		"valor2" : "MORENO GARCIA DANIEL",
		"valor3" : "F180852",
		"valor4" : "30",
		"valor5" : "392"
	},
	{
		"valor1" : "TOVJ730228H094056340",
		"valor2" : "TORRES VILLALOBOS JUAN ALBERTO",
		"valor3" : "F289037",
		"valor4" : "30",
		"valor5" : "392"
	},
	{
		"valor1" : "JIHM741216H20411832",
		"valor2" : "JIMENEZ HERAS MISAEL",
		"valor3" : "F186036",
		"valor4" : "30",
		"valor5" : "392"
	},
	{
		"valor1" : "GUSH940813H195312116",
		"valor2" : "GUERRA SANCHEZ HUMBERTO EMANUEL",
		"valor3" : "F288640",
		"valor4" : "30",
		"valor5" : "392"
	},
	{
		"valor1" : "SOOE891102H195312112",
		"valor2" : "SOTO ORDOÑEZ EDWIN ELIUD",
		"valor3" : "F288558",
		"valor4" : "30",
		"valor5" : "392"
	},
	{
		"valor1" : "CATJ670209H094800867",
		"valor2" : "CANO TERWOGT JUAN CARLOS",
		"valor3" : "F288599",
		"valor4" : "30",
		"valor5" : "392"
	},
	{
		"valor1" : "IAVH750811H094800869",
		"valor2" : "IBAÑEZ VALADEZ HUGO",
		"valor3" : "F180855",
		"valor4" : "30",
		"valor5" : "392"
	},
	{
		"valor1" : "FODJ681219H09770278",
		"valor2" : "FLORES DIAZ JESUS DAVID",
		"valor3" : "F180812",
		"valor4" : "30",
		"valor5" : "392"
	},
	{
		"valor1" : "MACR790403H095304074",
		"valor2" : "MARTINEZ CASTELAN RICARDO ALAN",
		"valor3" : "F288995",
		"valor4" : "30",
		"valor5" : "392"
	},
	{
		"valor1" : "GORM701205H094796657",
		"valor2" : "GONZALEZ RODRIGUEZ MARCO ISRAEL",
		"valor3" : "F288136",
		"valor4" : "30",
		"valor5" : "392"
	},
	{
		"valor1" : "COMR900417H134514150",
		"valor2" : "CORDERO MONTIEL ROBERTO CARLOS",
		"valor3" : "F286259",
		"valor4" : "30",
		"valor5" : "392"
	},
	{
		"valor1" : "OEFE810907H29274259",
		"valor2" : "ORTEGA FLORES ERICK",
		"valor3" : "F180811",
		"valor4" : "30",
		"valor5" : "392"
	},
	{
		"valor1" : "GOPA680428H094978448",
		"valor2" : "GONZALEZ PEREZ ARTURO",
		"valor3" : "F286346",
		"valor4" : "30",
		"valor5" : "392"
	},
	{
		"valor1" : "MAFJ770806H095323873",
		"valor2" : "MAURICIO FLORES JOSE JESUS",
		"valor3" : "F180870",
		"valor4" : "30",
		"valor5" : "392"
	},
	{
		"valor1" : "OIZM900106H094262510",
		"valor2" : "OSIO ZAMORA MIGUEL ANGEL",
		"valor3" : "F186037",
		"valor4" : "30",
		"valor5" : "392"
	},
	{
		"valor1" : "SAZS920422H094879932",
		"valor2" : "SAINZ DE LA MAZA ZUÑIGA SANDALIO ALFONSO",
		"valor3" : "F286252",
		"valor4" : "200",
		"valor5" : "392"
	},
	{
		"valor1" : "AATO761023H095327861",
		"valor2" : "ALVAREZ TREJO OMAR",
		"valor3" : "F180957",
		"valor4" : "30",
		"valor5" : "392"
	},
	{
		"valor1" : "OOMD720918H154812822",
		"valor2" : "OLMOS MAZARIEGOS DAVID HUMBERTO",
		"valor3" : "F288609",
		"valor4" : "30",
		"valor5" : "392"
	},
	{
		"valor1" : "AOF650812H21152281 ",
		"valor2" : "ARCOS EVARISTO FRANCISCO",
		"valor3" : "F289005",
		"valor4" : "30",
		"valor5" : "392"
	},
	{
		"valor1" : "PESJ790513H095338109",
		"valor2" : "PEREZ SANCHEZ JUAN CANDIDO",
		"valor3" : "F180866",
		"valor4" : "38",
		"valor5" : "392"
	},
	{
		"valor1" : "CUBE741018H091055689",
		"valor2" : "CRUZ BRIONES EDUARDO",
		"valor3" : "F180863",
		"valor4" : "30",
		"valor5" : "392"
	},
	{
		"valor1" : "RORA831130H95283702",
		"valor2" : "RODRIGUEZ RODRIGUEZ ANDRES ARMANDO",
		"valor3" : "F286256",
		"valor4" : "30",
		"valor5" : "392"
	},
	{
		"valor1" : "FATJ720714H215288897",
		"valor2" : "FRANCO CORZO Y TORRES JULIO CESAR",
		"valor3" : "F186086",
		"valor4" : "30",
		"valor5" : "392"
	},
	{
		"valor1" : "REGA990603H195338110",
		"valor2" : "REYNOSO GUERRA ALVARO HUMBERTO",
		"valor3" : "F286278",
		"valor4" : "30",
		"valor5" : "392"
	},
	{
		"valor1" : "HECI970731H095338444",
		"valor2" : "HEREDIA CISNEROS IVAN",
		"valor3" : "F180945",
		"valor4" : "30",
		"valor5" : "392"
	},
	{
		"valor1" : "FEBM650912H095338446",
		"valor2" : "FERNANDEZ BONILLA MARIO",
		"valor3" : "F180959",
		"valor4" : "30",
		"valor5" : "392"
	},
	{
		"valor1" : "OIGJ910822H154532041",
		"valor2" : "ORTIZ GARCIA JOSUE GUILLERMO",
		"valor3" : "F288178",
		"valor4" : "30",
		"valor5" : "392"
	},
	{
		"valor1" : "ROHJ801122H09721550",
		"valor2" : "ROMERO HERNANDEZ JAIME ANTONIO",
		"valor3" : "F186011",
		"valor4" : "30",
		"valor5" : "392"
	},
	{
		"valor1" : "EEMM841029H095292794",
		"valor2" : "ESTEVEZ MARTINEZ MOISES",
		"valor3" : "BAME325",
		"valor4" : "30",
		"valor5" : "392"
	},
	{
		"valor1" : "SACA830720H094817103",
		"valor2" : "SANCHEZ CASTILLO ANDRES",
		"valor3" : "H73156Y",
		"valor4" : "26",
		"valor5" : "392"
	},
	{
		"valor1" : "PIXA871204H305033294",
		"valor2" : "PIXTA XALA ANDRES",
		"valor3" : "676668 ",
		"valor4" : "5 ",
		"valor5" : "392"
	},
	{
		"valor1" : "JOJT671028H20271184",
		"valor2" : "JOSE JIMENEZ TEODORO",
		"valor3" : "676667 ",
		"valor4" : "5 ",
		"valor5" : "392"
	},
	{
		"valor1" : "EUSI860515H304306883",
		"valor2" : "ESTUDILLO SÁNCHEZ ISIDRO",
		"valor3" : "676665 ",
		"valor4" : "5 ",
		"valor5" : "392"
	},
	{
		"valor1" : "MARC931125H175291567",
		"valor2" : "MARQUEZ RODRIGUEZ CARLOS YANIK",
		"valor3" : "H69920 ",
		"valor4" : "26",
		"valor5" : "392"
	},
	{
		"valor1" : "TOFE850430H095292798",
		"valor2" : "TORRENTERA FLORES EDGAR NEFTALI",
		"valor3" : "H73159Y",
		"valor4" : "26",
		"valor5" : "392"
	},
	{
		"valor1" : "ZAMJ810815M094706216",
		"valor2" : "ZAMARRIPA MARTINEZ JAQUELINE SUJEY",
		"valor3" : "H69939 ",
		"valor4" : "26",
		"valor5" : "392"
	},
	{
		"valor1" : "ZACA800619H095291564",
		"valor2" : "ZAVALA CARRILLO JOSE ARTURO",
		"valor3" : "H73153Y",
		"valor4" : "26",
		"valor5" : "392"
	},
	{
		"valor1" : "EIRJ710425H095291559",
		"valor2" : "ESPINOZA ROMERO JOSE",
		"valor3" : "H69894Y",
		"valor4" : "26",
		"valor5" : "392"
	},
	{
		"valor1" : "CIGH610108H095197013",
		"valor2" : "CHICO DE GORIBAR HECTOR GERARDO",
		"valor3" : "H73161Y",
		"valor4" : "26",
		"valor5" : "392"
	},
	{
		"valor1" : "BABC830108H155292800",
		"valor2" : "BRAVO BRAVO CESAR ALEJANDRO",
		"valor3" : "H73036Y",
		"valor4" : "26",
		"valor5" : "392"
	},
	{
		"valor1" : "VEAA750328H25254942",
		"valor2" : "VEGA AGUILAR ALEJANDRO",
		"valor3" : "H73157Y",
		"valor4" : "26",
		"valor5" : "392"
	},
	{
		"valor1" : "VARJ780715H285291754",
		"valor2" : "VALDEZ RIOS JAIME ENRIQUE",
		"valor3" : "H69893Y",
		"valor4" : "26",
		"valor5" : "392"
	},
	{
		"valor1" : "DUEF820805H495194120",
		"valor2" : "DURAN ESCOBAR FELIX",
		"valor3" : "H73034Y",
		"valor4" : "26",
		"valor5" : "392"
	},
	{
		"valor1" : "PAMC870904H095291560",
		"valor2" : "PATRON MUNGUIA CHAM IXBALANQUE",
		"valor3" : "F286243",
		"valor4" : "100",
		"valor5" : "392"
	},
	{
		"valor1" : "MAAA830804H095057585",
		"valor2" : "MARTINEZ ARAIZA ALEJANDRO",
		"valor3" : "H69899Y",
		"valor4" : "26",
		"valor5" : "392"
	},
	{
		"valor1" : "ROSH900328H155292802",
		"valor2" : "ROSAS SANCHEZ HECTOR HUGO",
		"valor3" : "H69895Y",
		"valor4" : "26",
		"valor5" : "392"
	},
	{
		"valor1" : "ZAAS861015M154486580",
		"valor2" : "ZAGAL ARROYO SULMA YANELI",
		"valor3" : "F286213",
		"valor4" : "30",
		"valor5" : "392"
	},
	{
		"valor1" : "PUBS911128H154611502",
		"valor2" : "PULIDO BLAS SAUL",
		"valor3" : "F180961",
		"valor4" : "30",
		"valor5" : "392"
	},
	{
		"valor1" : "ROSH900328H155292802",
		"valor2" : "ROSAS SANCHEZ HECTOR HUGO",
		"valor3" : "F286257",
		"valor4" : "30",
		"valor5" : "392"
	},
	{
		"valor1" : "ZUXZ731026H985350805",
		"valor2" : "ZHU ZHAOQIANG",
		"valor3" : "H69895Y",
		"valor4" : "30",
		"valor5" : "392"
	},
	{
		"valor1" : "PEAJ680310H095353314",
		"valor2" : "PEREZ ABURTO JORGE",
		"valor3" : "F286271",
		"valor4" : "30",
		"valor5" : "392"
	},
	{
		"valor1" : "AUFE890227H095353313",
		"valor2" : "ABURTO FLORENTINO EDGAR ARTURO",
		"valor3" : "F288595",
		"valor4" : "30",
		"valor5" : "392"
	},
	{
		"valor1" : "AAAC930105H304959506",
		"valor2" : "ALARCON ALARCON CHRISTIAN",
		"valor3" : "F286268",
		"valor4" : "30",
		"valor5" : "392"
	},
	{
		"valor1" : "HEHR810917H30854173",
		"valor2" : "HERNANDEZ HERNANDEZ ROBERTO",
		"valor3" : "F286237",
		"valor4" : "30",
		"valor5" : "392"
	},
	{
		"valor1" : "AIZJ891003H145353533",
		"valor2" : "AVILA ZAVALA JORGE ALBERTO",
		"valor3" : "F286328",
		"valor4" : "30",
		"valor5" : "392"
	},
	{
		"valor1" : "GAGV810310H145353535",
		"valor2" : "GARCIA GOMEZ VICTOR ALDO",
		"valor3" : "F286267",
		"valor4" : "30",
		"valor5" : "392"
	},
	{
		"valor1" : "BEMG660830H1736507 ",
		"valor2" : "BELTRAN MOLINA GAUDENCIO",
		"valor3" : "F286323",
		"valor4" : "30",
		"valor5" : "392"
	},
	{
		"valor1" : "CAHE880320H094301102",
		"valor2" : "CARRILLO HUERTA ERIK EDGAR",
		"valor3" : "F286326",
		"valor4" : "30",
		"valor5" : "392"
	},
	{
		"valor1" : "CAPH770203H094877108",
		"valor2" : "CABRAL PALACIOS HERON ALBERTO",
		"valor3" : "F286321",
		"valor4" : "30",
		"valor5" : "392"
	},
	{
		"valor1" : "HECL760403H095338447",
		"valor2" : "HERMOSO Y COLIN LUIS OCTAVIO",
		"valor3" : "F286297",
		"valor4" : "30",
		"valor5" : "392"
	},
	{
		"valor1" : "POTC920204H094497305",
		"valor2" : "PORTILLO TRUJILLO CESAR EMILIO",
		"valor3" : "F289039",
		"valor4" : "30",
		"valor5" : "392"
	},
	{
		"valor1" : "SALH700212H155354530",
		"valor2" : "SARABIA LUNA HUMBERTO",
		"valor3" : "F286284",
		"valor4" : "30",
		"valor5" : "392"
	},
	{
		"valor1" : "ZACJ891208H094967359",
		"valor2" : "ZAVALA CRUZ JULIO CESAR",
		"valor3" : "08531",
		"valor4" : "30",
		"valor5" : "392"
	},
	{
		"valor1" : "RELJ720624H09322673",
		"valor2" : "REYES LOPEZ JUAN ANTONIO",
		"valor3" : "07826",
		"valor4" : "40",
		"valor5" : "392"
	},
	{
		"valor1" : "VAEF790404H095361057",
		"valor2" : "VARGAS ESQUIVEL FABIO PREM",
		"valor3" : "UDW196 ",
		"valor4" : "30",
		"valor5" : "392"
	},
	{
		"valor1" : "IAOJ851224H094967361",
		"valor2" : "ISLAS OLIVARES JOSE DE JESUS",
		"valor3" : "07823",
		"valor4" : "40",
		"valor5" : "392"
	},
	{
		"valor1" : "GAAJ720306H095355699",
		"valor2" : "GARFIAS ARREOLA JOEL",
		"valor3" : "07824",
		"valor4" : "40",
		"valor5" : "392"
	},
	{
		"valor1" : "CACV780510H09576078",
		"valor2" : "CARDONA CARDONA VICTOR HUGO",
		"valor3" : "07825",
		"valor4" : "40",
		"valor5" : "392"
	},
	{
		"valor1" : "null",
		"valor2" : "YAHUTENZI ROSALES GERARDO",
		"valor3" : "07827",
		"valor4" : "40",
		"valor5" : "392"
	},
	{
		"valor1" : "AATC730224H095327860",
		"valor2" : "ALVAREZ TREJO CESAR",
		"valor3" : "F288630",
		"valor4" : "30",
		"valor5" : "392"
	},
	{
		"valor1" : "RASJ940604H094631108",
		"valor2" : "RAMIREZ SANCHEZ JHORDAN",
		"valor3" : "F288999",
		"valor4" : "200",
		"valor5" : "392"
	},
	{
		"valor1" : "PEVG780430H295291586",
		"valor2" : "PEREZ VAZQUEZ GUSTAVO",
		"valor3" : "F286348",
		"valor4" : "30",
		"valor5" : "392"
	},
	{
		"valor1" : "ROBH740808H09709153",
		"valor2" : "RODRIGUEZ BASURTO HUGO",
		"valor3" : "F180867",
		"valor4" : "100",
		"valor5" : "392"
	},
	{
		"valor1" : "AEPJ890216H094874839",
		"valor2" : "ALBERTS PONCE JORGE ENRIQUE",
		"valor3" : "H69896Y",
		"valor4" : "100",
		"valor5" : "392"
	},
	{
		"valor1" : "BASO820506H094534367",
		"valor2" : "BRAVO SANCHEZ OMAR",
		"valor3" : "F186086",
		"valor4" : "30",
		"valor5" : "392"
	},
	{
		"valor1" : "SAMM760614H15711757",
		"valor2" : "SANCHEZ MARTINEZ MARCOS",
		"valor3" : "BAYN514",
		"valor4" : "20",
		"valor5" : "391"
	},
	{
		"valor1" : "LOCI810616H094954886",
		"valor2" : "DE LOZA CERDA ISRAEL",
		"valor3" : "BAYN509",
		"valor4" : "20",
		"valor5" : "391"
	},
	{
		"valor1" : "PESI811223H151170008",
		"valor2" : "PEREZ SALAZAR IVAN JESUS",
		"valor3" : "BAYN512",
		"valor4" : "20",
		"valor5" : "391"
	},
	{
		"valor1" : "CAPA751110H15708239",
		"valor2" : "CALDERON PIZANO ALFREDO",
		"valor3" : "BAYN513",
		"valor4" : "20",
		"valor5" : "391"
	},
	{
		"valor1" : "VIGI880130H095291558",
		"valor2" : "VILLATORO GOMEZ ISAAC IVAN",
		"valor3" : "BAYN533",
		"valor4" : "20",
		"valor5" : "391"
	},
	{
		"valor1" : "HEPG871114H215162188",
		"valor2" : "HERNANDEZ POSADAS GONZALO",
		"valor3" : "BAYN528",
		"valor4" : "20",
		"valor5" : "391"
	},
	{
		"valor1" : "MARA971119H175291757",
		"valor2" : "MARQUEZ RODRIGUEZ ARIEL GUSTAVO",
		"valor3" : "01312",
		"valor4" : "70",
		"valor5" : "391"
	},
	{
		"valor1" : "OUPR720105H175291565",
		"valor2" : "ORDUÑA PEÑA RODOLFO",
		"valor3" : "BAME330",
		"valor4" : "30",
		"valor5" : "391"
	},
	{
		"valor1" : "EIHN800210H125291566",
		"valor2" : "ESPÍNDOLA HERNÁNDEZ NELSON BENJAMÍN",
		"valor3" : "BAYN527",
		"valor4" : "20",
		"valor5" : "391"
	},
	{
		"valor1" : "AVV790514H215291551",
		"valor2" : "DANIEL VELÁZQUEZ VÍCTOR FERNANDO",
		"valor3" : "BAYN516",
		"valor4" : "20",
		"valor5" : "391"
	},
	{
		"valor1" : "HEPM750722H095084098",
		"valor2" : "HERNÁNDEZ PÉREZ MAGDALENO ANGEL",
		"valor3" : "676681 ",
		"valor4" : "5 ",
		"valor5" : "391"
	},
	{
		"valor1" : "CASA930212H530897864",
		"valor2" : "CALVILLO SÁNCHEZ ÁNGEL FERNANDO",
		"valor3" : "BAYN531",
		"valor4" : "50",
		"valor5" : "391"
	},
	{
		"valor1" : "MARJ910407H304489344",
		"valor2" : "MAYA REYES JUAN ALBERTO",
		"valor3" : "ES428327 ",
		"valor4" : "14",
		"valor5" : "391"
	},
	{
		"valor1" : "SAGJ930824H195292797",
		"valor2" : "SANCHEZ GARZA JORGE ALONSO",
		"valor3" : "UDW197 ",
		"valor4" : "30",
		"valor5" : "391"
	},
	{
		"valor1" : "CUBA780711H074553567",
		"valor2" : "DE LA CRUZ BALLINAS ALEJANDRO",
		"valor3" : "UDW189 ",
		"valor4" : "30",
		"valor5" : "391"
	},
	{
		"valor1" : "MAGL770922H075291568",
		"valor2" : "MARROQUIN GRAJALES LUIS ENRIQUE",
		"valor3" : "BAYN520",
		"valor4" : "20",
		"valor5" : "391"
	},
	{
		"valor1" : "BAGJ930807H075229483",
		"valor2" : "BALBOA GONZALEZ JORGE ANTONIO",
		"valor3" : "BAYN521",
		"valor4" : "20",
		"valor5" : "391"
	},
	{
		"valor1" : "OAJJ840125H15898699",
		"valor2" : "ORDAZ JIMENEZ JOSUE GEOVANNI",
		"valor3" : "M222924",
		"valor4" : "38",
		"valor5" : "391"
	},
	{
		"valor1" : "GOBG690321H215335115",
		"valor2" : "GONZALEZ BARRAZA GUILLERMO",
		"valor3" : "BAYN511",
		"valor4" : "20",
		"valor5" : "391"
	},
	{
		"valor1" : "HUMG921030M055338108",
		"valor2" : "HUERTA MORALES GABRIELA VERONICA",
		"valor3" : "M222925",
		"valor4" : "38",
		"valor5" : "391"
	},
	{
		"valor1" : "RETF810513H094837604",
		"valor2" : "REYES TEJEDA FELIX ADRIAN",
		"valor3" : "M222926",
		"valor4" : "38",
		"valor5" : "391"
	},
	{
		"valor1" : "PAOE810920H095292801",
		"valor2" : "PRADO ORDOÑEZ ENRIQUE",
		"valor3" : "M222922",
		"valor4" : "38",
		"valor5" : "391"
	},
	{
		"valor1" : "ROUJ680311H094800870",
		"valor2" : "RODRIGUEZ URIBE JUAN CARLOS",
		"valor3" : "M222923",
		"valor4" : "38",
		"valor5" : "391"
	},
	{
		"valor1" : "ZUAE710222H094800849",
		"valor2" : "ZUCCOLI ACOSTA ENRIQUE SEBASTIAN",
		"valor3" : "M222933",
		"valor4" : "38",
		"valor5" : "391"
	},
	{
		"valor1" : "ZUIJ850623H095339743",
		"valor2" : "ZUÑIGA ISLAS JONATHAN ENRIQUE",
		"valor3" : "M222927",
		"valor4" : "38",
		"valor5" : "391"
	},
	{
		"valor1" : "MUMS850318H09818157",
		"valor2" : "MUÑOZ MARTINEZ SALVADOR",
		"valor3" : "M222929",
		"valor4" : "38",
		"valor5" : "391"
	},
	{
		"valor1" : "LICC900716H154233353",
		"valor2" : "LINARES CANALES CARLOS ALBERTO",
		"valor3" : "M222931",
		"valor4" : "38",
		"valor5" : "391"
	},
	{
		"valor1" : "IASJ850118H095338445",
		"valor2" : "IBAÑEZ SANDOVAL JESUS",
		"valor3" : "M222930",
		"valor4" : "38",
		"valor5" : "391"
	},
	{
		"valor1" : "ROHJ831012H155338465",
		"valor2" : "ROSALES HERNANDEZ JULIO CESAR",
		"valor3" : "M222928",
		"valor4" : "38",
		"valor5" : "391"
	},
	{
		"valor1" : "SEJS710819H762340321",
		"valor2" : "SERNA JIMENEZ SERGIO ARTURO",
		"valor3" : "M222932",
		"valor4" : "38",
		"valor5" : "391"
	},
	{
		"valor1" : "AOHA691130H11513045",
		"valor2" : "ALONSO HERNANDEZ ANDRES",
		"valor3" : "M222915",
		"valor4" : "38",
		"valor5" : "391"
	},
	{
		"valor1" : "OORA751015H095292792",
		"valor2" : "OCHOA ROLDAN ARTURO",
		"valor3" : "M222935",
		"valor4" : "38",
		"valor5" : "391"
	},
	{
		"valor1" : "MORR940804H095339363",
		"valor2" : "MONTES RAZO RAMON ALEJANDRO",
		"valor3" : "M222939",
		"valor4" : "38",
		"valor5" : "391"
	},
	{
		"valor1" : "CADM600525H115312114",
		"valor2" : "CHAVEZ DONATO MARCO ANTONIO",
		"valor3" : "M222945",
		"valor4" : "38",
		"valor5" : "391"
	},
	{
		"valor1" : "BASO820506H094534367",
		"valor2" : "BRAVO SANCHEZ OMAR",
		"valor3" : "M222938",
		"valor4" : "38",
		"valor5" : "391"
	},
	{
		"valor1" : "ROVE800912H763480321",
		"valor2" : "RODRIGUEZ VARGAS EFREN",
		"valor3" : "M222936",
		"valor4" : "38",
		"valor5" : "391"
	},
	{
		"valor1" : "CEVC770317H09616163",
		"valor2" : "CERON VARELA ERNESTO",
		"valor3" : "M222909",
		"valor4" : "38",
		"valor5" : "391"
	},
	{
		"valor1" : "BASR771209H09415096",
		"valor2" : "BRAVO SANCHEZ RICARDO",
		"valor3" : "M222943",
		"valor4" : "38",
		"valor5" : "391"
	},
	{
		"valor1" : "COLC661116H094967362",
		"valor2" : "COLINDRES LAOS CIRILO",
		"valor3" : "M222934",
		"valor4" : "38",
		"valor5" : "391"
	},
	{
		"valor1" : "GOGE881024HDFMND09 ",
		"valor2" : "GOMEZ GONZALEZ EDGAR EDUARDO",
		"valor3" : "M222940",
		"valor4" : "38",
		"valor5" : "391"
	},
	{
		"valor1" : "GELE870724H094248687",
		"valor2" : "GELLER LEIZOREK EITAN",
		"valor3" : "M222917",
		"valor4" : "30",
		"valor5" : "391"
	},
	{
		"valor1" : "FALR721112H095160031",
		"valor2" : "FRANCO LAGARZA RICARDO",
		"valor3" : "M222937",
		"valor4" : "30",
		"valor5" : "391"
	},
	{
		"valor1" : "GOEG741003H09418892",
		"valor2" : "GONZALEZ ESCOBAR GERARDO",
		"valor3" : "M222942",
		"valor4" : "38",
		"valor5" : "391"
	},
	{
		"valor1" : "AABR800204H15517033",
		"valor2" : "ATANACIO BOLAÑOS RIGOBERTO",
		"valor3" : "M222941",
		"valor4" : "38",
		"valor5" : "391"
	},
	{
		"valor1" : "GUJA781203H095351679",
		"valor2" : "GUZMAN JACOBO ANTONIO ALEJANDRO",
		"valor3" : "M222921",
		"valor4" : "38",
		"valor5" : "391"
	},
	{
		"valor1" : "MARA971119H175291757",
		"valor2" : "MARQUEZ RODRIGUEZ ARIEL GUSTAVO",
		"valor3" : "M222913",
		"valor4" : "38",
		"valor5" : "391"
	},
	{
		"valor1" : "CAGE801026H19436011",
		"valor2" : "CANTU GUERRERO EDGAR EDGARDO ALFREDO",
		"valor3" : "M222914",
		"valor4" : "  ",
		"valor5" : "391"
	},
	{
		"valor1" : "LORH930819H135349256",
		"valor2" : "LOMBARD ROSALES HECTOR ALEJANDRO",
		"valor3" : "M222920",
		"valor4" : "38",
		"valor5" : "391"
	},
	{
		"valor1" : "CUOJ930825H155350701",
		"valor2" : "CRUZ ORTIZ JESUS",
		"valor3" : "M222916",
		"valor4" : "38",
		"valor5" : "391"
	},
	{
		"valor1" : "AAMD721128H09712002",
		"valor2" : "ALCARAZ MEDINA DAVID",
		"valor3" : "M222912",
		"valor4" : "38",
		"valor5" : "391"
	},
	{
		"valor1" : "LESA890124H094779252",
		"valor2" : "LEZO SERRATO ALEXIS",
		"valor3" : "M222911",
		"valor4" : "38",
		"valor5" : "391"
	},
	{
		"valor1" : "PEVJ911022H094858727",
		"valor2" : "PEÑA VELAZQUEZ JESUS OSWALDO",
		"valor3" : "M222909",
		"valor4" : "38",
		"valor5" : "391"
	},
	{
		"valor1" : "AODC760224H30711943",
		"valor2" : "ACOSTA DORADO CESAR ARTURO",
		"valor3" : "H73116Y",
		"valor4" : "30",
		"valor5" : "391"
	},
	{
		"valor1" : "GAAJ720306H095355699",
		"valor2" : "GARFIAS ARREOLA JOEL",
		"valor3" : "H69974Y",
		"valor4" : "30",
		"valor5" : "391"
	},
	{
		"valor1" : "NUAS801110H164064327",
		"valor2" : "NUÑEZ ALTAMIRANO SIGIFREDO",
		"valor3" : "H73115Y",
		"valor4" : "30",
		"valor5" : "391"
	},
	{
		"valor1" : "CAPM870330H285356317",
		"valor2" : "CARDENAS PICOS MAXIMO OMAR DE JESUS",
		"valor3" : "H69973Y",
		"valor4" : "30",
		"valor5" : "391"
	},
	{
		"valor1" : "MEHM870506H275351680",
		"valor2" : "MENDOZA HERNANDEZ MANUEL",
		"valor3" : "H69994Y",
		"valor4" : "30",
		"valor5" : "391"
	},
	{
		"valor1" : "GARI860605H165358859",
		"valor2" : "GARCIA RAMIREZ ISRAEL",
		"valor3" : "M222944",
		"valor4" : "38",
		"valor5" : "391"
	},
	{
		"valor1" : "VEZA950625H155359741",
		"valor2" : "VELAZQUEZ ZAMORA ALBERTO CARLOS",
		"valor3" : "H730814",
		"valor4" : "38",
		"valor5" : "391"
	},
	{
		"valor1" : "CACD760706H30251000",
		"valor2" : "CHACHA CHACHA DANIEL",
		"valor3" : "BAYN531",
		"valor4" : "20",
		"valor5" : "391"
	},
	{
		"valor1" : "MARD731002H095362058",
		"valor2" : "MARIN REYES DANIEL",
		"valor3" : "M222919",
		"valor4" : "38",
		"valor5" : "391"
	},
	{
		"valor1" : "null",
		"valor2" : "RAMIREZ HERNANDEZ EDUARDO CESAR",
		"valor3" : "08484",
		"valor4" : "70",
		"valor5" : "null"
	},
	{
		"valor1" : "null",
		"valor2" : "HERNANDEZ HERNANDEZ DAVID EDUARDO",
		"valor3" : "8640 ",
		"valor4" : "40",
		"valor5" : "null"
	},
	{
		"valor1" : "null",
		"valor2" : "MARTINEZ HERNANDEZ JORGE DANIEL",
		"valor3" : "07828",
		"valor4" : "40",
		"valor5" : "null"
	},
	{
		"valor1" : "GATA920205H155363612",
		"valor2" : "GARCIA TORRES ALEJANDRO DONNOVAN",
		"valor3" : "F288178",
		"valor4" : "30",
		"valor5" : "null"
	},
	{
		"valor1" : "GUEO851016H0 95035092  ",
		"valor2" : "GUTIERREZ ESPARZA OMAR MORONI",
		"valor3" : "08657",
		"valor4" : "40",
		"valor5" : "null"
	},
	{
		"valor1" : "null",
		"valor2" : "COBOS ALARCON ENRIQUE",
		"valor3" : "08663",
		"valor4" : "40",
		"valor5" : "null"
	},
	{
		"valor1" : "null",
		"valor2" : "BAUTISTA VARGAS JOSE LUIS",
		"valor3" : "08659",
		"valor4" : "40",
		"valor5" : "null"
	},
	{
		"valor1" : "CAOD871103H094969859",
		"valor2" : "CARREÑO ORDAZ DIEGO",
		"valor3" : "08488",
		"valor4" : "50",
		"valor5" : "null"
	},
	{
		"valor1" : "null",
		"valor2" : "TORRES VILLALOBOS JUAN ALBERTO",
		"valor3" : "08656",
		"valor4" : "40",
		"valor5" : "null"
	},
	{
		"valor1" : "null",
		"valor2" : "DE PAZ PEÑA RAFAEL",
		"valor3" : "M222946",
		"valor4" : "38",
		"valor5" : "null"
	},
	{
		"valor1" : "null",
		"valor2" : "TOVAR ZARAGOZA MOISES ANTONIO",
		"valor3" : "08658",
		"valor4" : "40",
		"valor5" : "null"
	},
	{
		"valor1" : "null",
		"valor2" : "CRUZ DE JESUS CRISTIAN",
		"valor3" : "08661",
		"valor4" : "40",
		"valor5" : "null"
	},
	{
		"valor1" : "null",
		"valor2" : "ALCANTARA CRUZ JUAN ROBERTO",
		"valor3" : "M222911",
		"valor4" : "38",
		"valor5" : "null"
	},
	{
		"valor1" : "null",
		"valor2" : "ZAPATA AYALA JORGE ARTURO",
		"valor3" : "M222918",
		"valor4" : "38",
		"valor5" : "null"
	},
	{
		"valor1" : "null",
		"valor2" : "CRUZ BALLADOS JOAQUIN HUMBERTO",
		"valor3" : "08660",
		"valor4" : "40",
		"valor5" : "null"
	},
	{
		"valor1" : "null",
		"valor2" : "CONTRERAS RICO HECTOR JOSE",
		"valor3" : "08664",
		"valor4" : "40",
		"valor5" : "null"
	},
	{
		"valor1" : "null",
		"valor2" : "HERNANDEZ HERNANDEZ ENRIQUE",
		"valor3" : "F286284",
		"valor4" : "30",
		"valor5" : "null"
	},
	{
		"valor1" : "null",
		"valor2" : "HERNANDEZ HERNANDEZ RENATO",
		"valor3" : "F180955",
		"valor4" : "30",
		"valor5" : "null"
	},
	{
		"valor1" : "null",
		"valor2" : "MORFIN JUAREZ HARIPOLDO",
		"valor3" : "08665",
		"valor4" : "40",
		"valor5" : "null"
	},
	{
		"valor1" : "null",
		"valor2" : "HERRERA BERMUDEZ HENDERSON ALEXANDER",
		"valor3" : "08487",
		"valor4" : "70",
		"valor5" : "null"
	},
	{
		"valor1" : "null",
		"valor2" : "GARCIA MIRANDA RUBEN",
		"valor3" : "08655",
		"valor4" : "40",
		"valor5" : "null"
	},
	{
		"valor1" : "null",
		"valor2" : "GARCIA BASTIDA JUAN JOSE",
		"valor3" : "07874",
		"valor4" : "40",
		"valor5" : "null"
	},
	{
		"valor1" : "null",
		"valor2" : "GRANADOS LOPEZ MILTON",
		"valor3" : "07875",
		"valor4" : "40",
		"valor5" : "null"
	},
	{
		"valor1" : "null",
		"valor2" : "TERVEN ESCOBAR GEOVANI",
		"valor3" : "08662",
		"valor4" : "40",
		"valor5" : "null"
	},
	{
		"valor1" : "null",
		"valor2" : "VALDEZ BELTRAN ALEJANDRO",
		"valor3" : "07867",
		"valor4" : "40",
		"valor5" : "null"
	},
	{
		"valor1" : "null",
		"valor2" : "GALINDO CARMONA ELISEO",
		"valor3" : "08485",
		"valor4" : "70",
		"valor5" : "null"
	},
	{
		"valor1" : "null",
		"valor2" : "BUSTAMANTE GUTIERREZ RAUL",
		"valor3" : "07869",
		"valor4" : "40",
		"valor5" : "null"
	},
	{
		"valor1" : "null",
		"valor2" : "MARTINEZ GUTIERREZ DORIAN",
		"valor3" : "07870",
		"valor4" : "40",
		"valor5" : "null"
	},
	{
		"valor1" : "null",
		"valor2" : "ISLAS OLIVARES RUBEN EDUARDO",
		"valor3" : "08482",
		"valor4" : "70",
		"valor5" : "null"
	},
	{
		"valor1" : "null",
		"valor2" : "GOMEZ TORRES CARLOS",
		"valor3" : "08489",
		"valor4" : "70",
		"valor5" : "null"
	},
	{
		"valor1" : "null",
		"valor2" : "ORTEGA LANDA RAYMUNDO",
		"valor3" : "07868",
		"valor4" : "40",
		"valor5" : "null"
	},
	{
		"valor1" : "null",
		"valor2" : "GOMEZ ISLAS ESAU JONATAN",
		"valor3" : " ",
		"valor4" : "40",
		"valor5" : "null"
	},
	{
		"valor1" : "null",
		"valor2" : "MENDEZ GUTIERREZ GILBERTO",
		"valor3" : "07876",
		"valor4" : "40",
		"valor5" : "null"
	},
	{
		"valor1" : "null",
		"valor2" : "GONZALEZ PEREZ ARTURO",
		"valor3" : "08528",
		"valor4" : "70",
		"valor5" : "null"
	},
	{
		"valor1" : "null",
		"valor2" : "SOTO BARBA JOSE DOMINGO",
		"valor3" : "07831",
		"valor4" : "40",
		"valor5" : "null"
	},
	{
		"valor1" : "null",
		"valor2" : "GONZALEZ PALOMARES EDUARDO ULISES",
		"valor3" : "08313",
		"valor4" : "40",
		"valor5" : "null"
	},
	{
		"valor1" : "null",
		"valor2" : "FLORES GONZALEZ JONATHAN",
		"valor3" : "08636",
		"valor4" : "40",
		"valor5" : "null"
	},
	{
		"valor1" : "null",
		"valor2" : "RODRIGUEZ GARCIA CARLOS",
		"valor3" : "08316",
		"valor4" : "40",
		"valor5" : "null"
	},
	{
		"valor1" : "null",
		"valor2" : "VARGAS VIVEROS ANGEL",
		"valor3" : "08315",
		"valor4" : "40",
		"valor5" : "null"
	},
	{
		"valor1" : "null",
		"valor2" : "REYNA GARCIA FRANCISCO JAVIER",
		"valor3" : "08314",
		"valor4" : "40",
		"valor5" : "null"
	},
	{
		"valor1" : "null",
		"valor2" : "ARREOLA ESCORCIA JESUS",
		"valor3" : "08637",
		"valor4" : "40",
		"valor5" : "null"
	},
	{
		"valor1" : "null",
		"valor2" : "MALAGON ARVIZU JOSE RAUL",
		"valor3" : "07877",
		"valor4" : "40",
		"valor5" : "null"
	},
	{
		"valor1" : "null",
		"valor2" : "RODRIGUEZ ARROYO CRISTIAN MAURICIO",
		"valor3" : "07829",
		"valor4" : "40",
		"valor5" : "null"
	},
	{
		"valor1" : "null",
		"valor2" : "DIAZ GOVEA UBALDO",
		"valor3" : "07830",
		"valor4" : "40",
		"valor5" : "null"
	},
	{
		"valor1" : "null",
		"valor2" : "TRINIDAD NAVARRO GILBERTO",
		"valor3" : "07878",
		"valor4" : "40",
		"valor5" : "null"
	},
	{
		"valor1" : "null",
		"valor2" : "GARCIA TORRES ALEJANDRO DONNOVAN",
		"valor3" : "08659",
		"valor4" : "40",
		"valor5" : "null"
	},
	{
		"valor1" : "null",
		"valor2" : "BAUTISTA VARGAS JOSE LUIS",
		"valor3" : "F288178",
		"valor4" : "70",
		"valor5" : "null"
	},
	{
		"valor1" : "null",
		"valor2" : "CELALLOS RIOS JUAN CARLOS",
		"valor3" : "08486",
		"valor4" : "70",
		"valor5" : "null"
	},
	{
		"valor1" : "null",
		"valor2" : "RAMIREZ LOPEZ MARCO JAIR",
		"valor3" : "08646",
		"valor4" : "40",
		"valor5" : "null"
	},
	{
		"valor1" : "null",
		"valor2" : "RAMIREZ CHANTACA OCTAVIO",
		"valor3" : "08647",
		"valor4" : "40",
		"valor5" : "null"
	},
	{
		"valor1" : "null",
		"valor2" : "VELAZQUEZ RUIZ DANIEL",
		"valor3" : "56H22YD000147",
		"valor4" : "10",
		"valor5" : "null"
	},
	{
		"valor1" : "null",
		"valor2" : "CEBALLOS MORALES JHOVANNY",
		"valor3" : "59H22YD000148",
		"valor4" : "10",
		"valor5" : "null"
	},
	{
		"valor1" : "null",
		"valor2" : "RETANA ALVARADO ALEXIS",
		"valor3" : "59H22YD000149",
		"valor4" : "10",
		"valor5" : "null"
	},
	{
		"valor1" : "null",
		"valor2" : "RETANA RETANA LUIS YAEL",
		"valor3" : "59H22YD000150",
		"valor4" : "10",
		"valor5" : "null"
	},
	{
		"valor1" : "null",
		"valor2" : "MARTINEZ AGUILAR JOSE MANUEL",
		"valor3" : "08479",
		"valor4" : "70",
		"valor5" : "null"
	},
	{
		"valor1" : "null",
		"valor2" : "FLORES MARTINEZ LUIS ALBERTO",
		"valor3" : "08480",
		"valor4" : "70",
		"valor5" : "null"
	},
	{
		"valor1" : "null",
		"valor2" : "ARREOLA ESCORCIA JESUS",
		"valor3" : "08635",
		"valor4" : "40",
		"valor5" : "null"
	},
	{
		"valor1" : "null",
		"valor2" : "VARELA CESAR ERNESTO",
		"valor3" : "M222909",
		"valor4" : "38",
		"valor5" : "null"
	},
	{
		"valor1" : "null",
		"valor2" : "CORDERO TORICES MIGUEL ANGEL",
		"valor3" : "08648",
		"valor4" : "40",
		"valor5" : "null"
	},
	{
		"valor1" : "null",
		"valor2" : "BARRERA PEDRAZA MIGUEL ANGEL",
		"valor3" : "08528",
		"valor4" : "70",
		"valor5" : "null"
	},
	{
		"valor1" : "null",
		"valor2" : "RAMIREZ SANCHEZ JHORDAN",
		"valor3" : "08484",
		"valor4" : "70",
		"valor5" : "null"
	},
	{
		"valor1" : "null",
		"valor2" : "RODRIGUEZ BASURTO HUGO",
		"valor3" : "08481",
		"valor4" : "70",
		"valor5" : "null"
	}
]
