{
  "type": "service_account",
  "project_id": "api-project-722138969808",
  "private_key_id": "9e4b89826a8bb92d31b4afe3c004652efb14f40c",
  "private_key": "-----BEGIN PRIVATE KEY-----\nMIIEvAIBADANBgkqhkiG9w0BAQEFAASCBKYwggSiAgEAAoIBAQDCekZhYnm5q0Do\nR9fS/N1DK+Rx6zEZkTKChsv7UedFzgQ3GOOz0YB5qbQJuiM6eOepI62L6QfgEl1b\nNcR64rqp0H3JBE1we4hyi2rANXcwfVbR+EagaTyZz3oCBeEQ9ME6LWneApveuWEr\nUyoWeQ81jW4EyT2BnHW2v4weGiWQWwhnLs5GaKJV7+tyNhiow9ix7nz0wFKnmt+2\n47qg2U5IxqTkBKQ89SCWnF29BhPWOEMhM6S6yOx1ZjMTor42fXfjE1xX3gr1DqSX\nkoiwButml06tGHTyXVRAG8ldK2RIYnPK4Mwwnyf5QTlz5O08g96mtn4aev5deCZK\n5yCKPNPfAgMBAAECggEALHW0ulW/e0Vd6NxnyEnbsZwKtUpt5qjtka6MWo++XhR7\nnTb482Z9RxMXYDPoEtmKKH5KEha7oKvCIPR5TxifUOwjnX140LLFHl6mEHwInBLD\ncuweBVUZsBYhD+5VJkG2HP092y3ggXoC71srX4jcg8Mp+DkjcQqaVKWUvFsA5G+t\nRf7DywUZWYJ4eUhBGyZRXpQwuw4qfu2rVfSA78lUm4VThLOov7iZCSCwj8lhZ8le\nzznonF/i8LaB+1Zh1EHPSijGCjC1Xa34dD0nuEgG5vgX/y7zwv046/s5N6sYcvkE\nb+koCLJWKPeqrbe9Y7FuK+zI2OCDGpVo0gA6tgIIqQKBgQDgJJjXRnGBCcUyxu+1\n1FQBk59EABzmetpwnDrZKyxSHLOjIT7DdtfGRPhM67vF5HHz13P5YpzngcUXWFkE\nWiQjwDvQjcimzViTFTH19jKhE//q/rjr/FmO0RJAvOAVjuSK609vPCiW//qu0wlI\n/58En0XdG4nvSymuW6c6+XbH9wKBgQDeHk9vWl9VvjS3oYgckBVOfuYkpNzgGOTt\nLO2SGJMm5CY6h9RnCK2aH/3t74amrBuc6S4YIUXSwhIOVG3RkOaTAbxQrc0N3HTA\nqROXFYUxfMCr0xfZXx1cJIL0y3MXdyDH2syPghZwhWWt6gYxo6FWFruz6HDkgdSd\n9ltVjjtpWQKBgDGrin8yKhb5TkzZTueRXOhYiVOtXroogV2xEU1sxs6Pc7Nzu4/f\nNyPFxuxs1Nieri3mEdoy4yheVom810UioJ2XjOnDcbKdEMLPUJn76+5MG0s9FUee\nTU5bwFq+QD4mwziRurGguDH2GdxCAe2+T8Pbc8TyxFdV5a+wuddUzuCzAoGANGMP\ntyKoc4+d3WWStbHh5JaXbzMXCR+19p5vFdMH+dc7kPhyRy7Lyxsah+DDcFINXS+9\n+GD4l+G/4nNVR2UWjLuPD7Q+NbO2Ma5u+WZQ+MAErUHnURRW12GhJV1KstEdASYA\nsyQqaLV9qswUU+bU6XoJIUCER9C7Ndph5kbailkCgYAw3eXsqSNKPEECBHvuk9MY\nv3gpS52GKEZS71vkAtz4Hdl2OWH9CrM9xYNX8loyVeH4AvAx/KbDLRBkGKB/iRZ2\nY2oElOoKMKF3ZaDOqh1C6ETVODfK2dZDfj+2SKcKWEhk98DOSyl8KThQWruZhhYl\n4+qCgE6ApqFTAPyr+kg+Pg==\n-----END PRIVATE KEY-----\n",
  "client_email": "curso-devops@api-project-722138969808.iam.gserviceaccount.com",
  "client_id": "108667958909803196030",
  "auth_uri": "https://accounts.google.com/o/oauth2/auth",
  "token_uri": "https://oauth2.googleapis.com/token",
  "auth_provider_x509_cert_url": "https://www.googleapis.com/oauth2/v1/certs",
  "client_x509_cert_url": "https://www.googleapis.com/robot/v1/metadata/x509/curso-devops%40api-project-722138969808.iam.gserviceaccount.com",
  "universe_domain": "googleapis.com"
}