{
  "project_info": {
    "project_number": "87480246171",
    "project_id": "lazarilloapp-9b101",
    "storage_bucket": "lazarilloapp-9b101.appspot.com"
  },
  "client": [
    {
      "client_info": {
        "mobilesdk_app_id": "1:87480246171:android:5d1c1f38c9d1f318a44b3e",
        "android_client_info": {
          "package_name": "com.lazarillo.lazarilloapp"
        }
      },
      "oauth_client": [
        {
          "client_id": "87480246171-7hrr5ju48j0g07b7uqslk4jt6li05ulh.apps.googleusercontent.com",
          "client_type": 3
        }
      ],
      "api_key": [
        {
          "current_key": "AIzaSyCxCRLBtxKRsRRxXkHnLQ4HNL8ycuEU7hQ"
        }
      ],
      "services": {
        "appinvite_service": {
          "other_platform_oauth_client": [
            {
              "client_id": "87480246171-7hrr5ju48j0g07b7uqslk4jt6li05ulh.apps.googleusercontent.com",
              "client_type": 3
            }
          ]
        }
      }
    }
  ],
  "configuration_version": "1"
}