  ____            _       _   _                         _       _               _   _                _
 |  _ \    __ _  (_)   __| | (_)   __ _   _ __ ___     | |     (_)  _ __ ___   (_) | |_    ___    __| |
 | |_) |  / _` | | |  / _` | | |  / _` | | '_ ` _ \    | |     | | | '_ ` _ \  | | | __|  / _ \  / _` |
 |  _ <  | (_| | | | | (_| | | | | (_| | | | | | | |   | |___  | | | | | | | | | | | |_  |  __/ | (_| |
 |_| \_\  \__,_| |_|  \__,_| |_|  \__,_| |_| |_| |_|   |_____| |_| |_| |_| |_| |_|  \__|  \___|  \__,_|

   ___                             ___
  / _ \   _ __     ___   _ __     |_ _|  _ __    ___   _   _   _ __    __ _   _ __     ___    ___
 | | | | | '_ \   / _ \ | '_ \     | |  | '_ \  / __| | | | | | '__|  / _` | | '_ \   / __|  / _ \
 | |_| | | |_) | |  __/ | | | |    | |  | | | | \__ \ | |_| | | |    | (_| | | | | | | (__  |  __/
  \___/  | .__/   \___| |_| |_|   |___| |_| |_| |___/  \__,_| |_|     \__,_| |_| |_|  \___|  \___|
         |_|
${application.title} ${application.version}
