{
  "swagger": "2.0",
  "info": {
    "version": "1.0.0",
    "title": "Vizir Challange service"
  },
  "host": "127.0.0.1:3333",
  "basePath": "/api/v1",
  "tags": [
    {
      "name": "Cost"
    }
  ],
  "schemes": [
    "http"
  ],
  "consumes": [
    "application/json"
  ],
  "produces": [
    "application/json"
  ],
  "paths": {
    "/cost": {
      "post": {
        "tags": [
          "Cost"
        ],
        "description": "Get information about cost",
        "parameters": [
          {
            "name": "cost",
            "in": "body",
            "schema": {
              "$ref": "#/definitions/Cost"
            }
          }
        ],
        "produces": [
          "application/json"
        ],
        "responses": {
          "200": {
            "description": "Response from Cost information",
            "schema": {
              "$ref": "#/definitions/CostResponse"
            }
          }
        }
      }
    },
    "/charge-data": {
      "get": {
        "tags": [
          "ChargeData"
        ],
        "description": "Get information about all charge data created in Database",
        "produces": [
          "application/json"
        ],
        "responses": {
          "200": {
            "description": "All Charges Datas Information",
            "schema": {
              "$ref": "#/definitions/ChargeDataResponse"
            }
          }
        }
      },
      "post": {
        "tags": [
          "ChargeData"
        ],
        "description": "Create a new charge data",
        "parameters": [
          {
            "name": "cost",
            "in": "body",
            "schema": {
              "$ref": "#/definitions/ChargeData"
            }
          }
        ],
        "produces": [
          "application/json"
        ],
        "responses": {
          "200": {
            "description": "All Charges Datas Information",
            "schema": {
              "$ref": "#/definitions/ChargeDataResponse"
            }
          }
        }
      }
    },
    "/charge-data/{id}": {
      "get": {
        "tags": [
          "ChargeData"
        ],
        "description": "Get information about specific charge data created in Database",
        "parameters": [
          {
            "name": "id",
            "in": "path",
            "schema": {
              "id": {"type": "number"}
            }
          }
        ],
        "produces": [
          "application/json"
        ],
        "responses": {
          "200": {
            "description": "All Charges Datas Information",
            "schema": {
              "$ref": "#/definitions/ChargeDataResponse"
            }
          }
        }
      },
      "put": {
        "tags": [
          "ChargeData"
        ],
        "description": "Update charge data information",
        "parameters": [
          {
            "name": "id",
            "in": "path",
            "schema": {
              "id": {"type": "number"}
            }
          },
          {
            "name": "cost",
            "in": "body",
            "schema": {
              "$ref": "#/definitions/ChargeData"
            }
          }
        ],
        "produces": [
          "application/json"
        ],
        "responses": {
          "200": {
            "description": "Charge Data Information",
            "schema": {
              "$ref": "#/definitions/ChargeDataUpdateResponse"
            }
          }
        }
      },
      "delete": {
        "tags": [
          "ChargeData"
        ],
        "description": "Delete charge data information",
        "parameters": [
          {
            "name": "id",
            "in": "path",
            "schema": {
              "id": {"type": "number"}
            }
          }
        ],
        "produces": [
          "application/json"
        ],
        "responses": {
          "200": {
            "description": "Charge Data Information",
            "schema": {
              "$ref": "#/definitions/ChargeDataDeleteResponse"
            }
          }
        }
      }
    },
    "/plans": {
      "get": {
        "tags": [
          "Plans"
        ],
        "description": "Get information about all Plain created in Database",
        "produces": [
          "application/json"
        ],
        "responses": {
          "200": {
            "description": "All Plans Information",
            "schema": {
              "$ref": "#/definitions/PlansResponse"
            }
          }
        }
      },
      "post": {
        "tags": [
          "Plans"
        ],
        "description": "Create a new Plain",
        "parameters": [
          {
            "name": "cost",
            "in": "body",
            "schema": {
              "$ref": "#/definitions/Plans"
            }
          }
        ],
        "produces": [
          "application/json"
        ],
        "responses": {
          "200": {
            "description": "All Plans Information",
            "schema": {
              "$ref": "#/definitions/PlansResponse"
            }
          }
        }
      }
    },
    "/plans/{id}": {
      "get": {
        "tags": [
          "Plans"
        ],
        "description": "Get information about specific Plain created in Database",
        "parameters": [
          {
            "name": "id",
            "in": "path",
            "schema": {
              "id": {"type": "number"}
            }
          }
        ],
        "produces": [
          "application/json"
        ],
        "responses": {
          "200": {
            "description": "All Plans Information",
            "schema": {
              "$ref": "#/definitions/PlansResponse"
            }
          }
        }
      },
      "put": {
        "tags": [
          "Plans"
        ],
        "description": "Update Plain information",
        "parameters": [
          {
            "name": "id",
            "in": "path",
            "schema": {
              "id": {"type": "number"}
            }
          },
          {
            "name": "cost",
            "in": "body",
            "schema": {
              "$ref": "#/definitions/Plans"
            }
          }
        ],
        "produces": [
          "application/json"
        ],
        "responses": {
          "200": {
            "description": "Plain Information",
            "schema": {
              "$ref": "#/definitions/PlansUpdateResponse"
            }
          }
        }
      },
      "delete": {
        "tags": [
          "Plans"
        ],
        "description": "Delete Plain information",
        "parameters": [
          {
            "name": "id",
            "in": "path",
            "schema": {
              "id": {"type": "number"}
            }
          }
        ],
        "produces": [
          "application/json"
        ],
        "responses": {
          "200": {
            "description": "Plain Information",
            "schema": {
              "$ref": "#/definitions/PlansDeleteResponse"
            }
          }
        }
      }
    }
  },
  "definitions": {
    "Cost": {
      "required": [
        "dddFrom",
        "dddTo",
        "callTime",
        "plain"
      ],
      "properties": {
        "dddFrom": {
          "type": "number"
        },
        "dddTo": {
          "type": "number"
        },
        "callTime": {
          "type": "number"
        },
        "plain": {
          "type": "string"
        }
      }
    },
    "CostResponse": {
      "properties": {
        "From": {
          "type": "number"
        },
        "To": {
          "type": "number"
        },
        "time": {
          "type": "number"
        },
        "plain": {
          "type": "string"
        },
        "withPlain": {
          "type": "number"
        },
        "withoutPlain": {
          "type": "number"
        }
      }
    },
    "ChargeData": {
      "required": [
        "dddFrom",
        "dddTo",
        "cost"
      ],
      "properties": {
        "dddFrom": {
          "type": "number"
        },
        "dddTo": {
          "type": "number"
        },
        "cost": {
          "type": "number"
        }
      }
    },
    "ChargeDataResponse": {
      "properties": {
        "id": {
          "type": "number"
        },
        "dddFrom": {
          "type": "number"
        },
        "dddTo": {
          "type": "number"
        },
        "cost": {
          "type": "number"
        },
        "created_at": {
          "type": "string",
          "example": "2020-09-09T20:38:54.139Z"
        },
        "updated_at": {
          "type": "string",
          "example": "2020-09-09T20:38:54.139Z"
        }
      }
    },
    "ChargeDataUpdateResponse": {
      "properties": {
        "generatedMaps": {
          "type": "array",
          "items": {}
        },
        "raw": {
          "type": "array",
          "items": {}
        }
      }
    },
    "ChargeDataDeleteResponse": {
      "properties": {
        "data": {
          "type": "string",
          "example": "Charge Data has been successfully deleted"
        }
      }
    },
    "Plans": {
      "required": [
        "name",
        "time"
      ],
      "properties": {
        "name": {
          "type": "string"
        },
        "time": {
          "type": "number"
        }
      }
    },
    "PlansResponse": {
      "properties": {
        "id": {
          "type": "number"
        },
        "name": {
          "type": "string"
        },
        "time": {
          "type": "number"
        },
        "created_at": {
          "type": "string",
          "example": "2020-09-09T20:38:54.139Z"
        },
        "updated_at": {
          "type": "string",
          "example": "2020-09-09T20:38:54.139Z"
        }
      }
    },
    "PlansUpdateResponse": {
      "properties": {
        "generatedMaps": {
          "type": "array",
          "items": {}
        },
        "raw": {
          "type": "array",
          "items": {}
        }
      }
    },
    "PlansDeleteResponse": {
      "properties": {
        "data": {
          "type": "string",
          "example": "Plain has been successfully deleted"
        }
      }
    }
  }
}