{
    "menus": [
      {
        "section": "Modules",
        "items": [
          {
            "title":"TrainingPlan",
            "icon":"glyphicon-align-justify",
            "url":"\/training_plan\/training-plan"
          },
          {
            "title": "ProductionUnit",
            "icon": "glyphicon-align-left",
            "url": "/productionUnit/production-unit"
          },
          {
            "title": "Program",
            "icon": "glyphicon-align-left",
            "url": "/program/program"
          },
          {
            "title": "WorkStation",
            "icon": "glyphicon-adjust",
            "url": "/work_station/work-station"
          },
          {
            "title": "ManufacturingInstruction",
            "icon": "glyphicon-align-justify",
            "url": "/manufacturing_instruction/manufacturing-instruction"
          },
          {
            "title": "CompanyInstructor",
            "icon": "glyphicon-align-left",
            "url": "/company_instructor/company-instructor"
          },
          {
            "title": "Instructor",
            "icon": "glyphicon-asterisk",
            "url": "/instructor/instructor"
          },
        
          {
            "title": "Training",
            "icon": "glyphicon-align-center",
            "url": "/training/training"
          },
          {
            "title": "Competive",
            "icon": "glyphicon-edit",
            "url": "/competive/competive"
          },
          {
            "title": "Specs",
            "icon": "glyphicon-align-justify",
            "url": "/specs/specs"
          },
          {
            "title": "TradeRol",
            "icon": "glyphicon-align-justify",
            "url": "/trade_rol/trade-rol"
          },
          {"title":"TrainingRequest",
            "icon":"glyphicon-adjust",
            "url":"\/training_request\/training-request"},

            {"title":"trainingplan",
              "icon":"glyphicon-adjust",
              "url":"\/training_plan\/training-plan"},
            {
              "title":"Headcount",
              "icon":"glyphicon-align-justify",
              "url":"\/head_count\/head-count"
            },
            {
              "title": "skillmatriz",
              "titulo": "Skill Matrix",
              "icon": "glyphicon-align-justify",
              "url": "/skill_matriz/skill-matriz"
            },
            {
              "title":"Imagen",
              "icon":"glyphicon-align-justify",
              "url":"\/head_count\/head-count"
            },
            {
              "title":"trainingreigstrer",
              "icon":"glyphicon-align-justify",
              "url":"\/head_count\/head-count"
            }

            

      
        ]
        
         
      
              
      }
    ]
  }
