{
  "menus": [
    {
      "section": "Modules",
      "items": [
        {
          "title":"TrainingPlan",
          "titulo":"Training Plan",
          "icon":"glyphicon-align-justify",
          "url":"\/training_plan\/training-plan"
        },
        {"title":"TrainingRequest",
          "icon":"glyphicon-adjust",
          "titulo":"Training Request",
          "url":"\/training_request\/training-request"},
        {
          "title": "SkillMatrix",
          "titulo": "Skill Matrix",
          "icon": "glyphicon-align-justify",
          "url": "/skill_matriz/skill-matriz"
        }
      ],
      "catalogue": [
         
          {
            "title": "ProductionUnit",
            "titulo": "Production Unit",
            "icon": "glyphicon-align-left",
            "url": "/productionUnit/production-unit"
          },
          {
            "title": "Program",
            "titulo": "Program",
            "icon": "glyphicon-align-left",
            "url": "/program/program"
          },
          {
            "title": "WorkStation",
            "titulo": "WorkStation",
            "icon": "glyphicon-adjust",
            "url": "/work_station/work-station"
          },
          {
            "title": "ManufacturingInstruction",
            "titulo": "Manufacturing Instruction",
            "icon": "glyphicon-align-justify",
            "url": "/manufacturing_instruction/manufacturing-instruction"
          }
          
        ],
        "catalogue2": [
          {
              "title": "CompanyInstructor",
              "titulo": "Company Instructor",
              "icon": "glyphicon-align-left",
              "url": "/company_instructor/company-instructor"
            },
            {
              "title": "Instructor",
              "titulo": "Instructor",
              "icon": "glyphicon-asterisk",
              "url": "/instructor/instructor"
            },
          
            {
              "title": "Training",
              "titulo": "Training",
              "icon": "glyphicon-align-center",
              "url": "/training/training"
            },
            {
              "title": "Competive",
              "titulo": "Competive",
              "icon": "glyphicon-edit",
              "url": "/competive/competive"
            }
        ],

        "catalogue3": [
            
        {
          "title": "Specs",
          "titulo": "Specs",
          "icon": "glyphicon-align-justify",
          "url": "/specs/specs"
        },
          {
            "title": "TradeRol",
            "titulo": "Trade Rol",
            "icon": "glyphicon-align-justify",
            "url": "/trade_rol/trade-rol"
          }
        ],
        "ccertificate": [
            
          {
            "title": "AdministrationSM",
            "titulo": "Administration SM",
            "icon": "glyphicon-align-justify",
            "url": "/specs/specs"
          },
            {
              "title": "DATAsheet",
              "titulo": "DATA sheet",
              "icon": "glyphicon-align-justify",
              "url": "/trade_rol/trade-rol"
            },
            {
              "title": "Documents",
              "titulo": "Documents",
              "icon": "glyphicon-align-justify",
              "url": "/trade_rol/trade-rol"
            }
          ]

       
    }
  ]
}
