[
  {
    "type": "get",
    "url": "/pruebabeacon",
    "title": "Prueba del controlador BEACON",
    "name": "pruebas",
    "group": "BEACON",
    "success": {
      "fields": {
        "Success 200": [
          {
            "group": "Success 200",
            "type": "String",
            "optional": false,
            "field": "Accion",
            "description": "<p>de pruebas BEACON.</p>"
          }
        ]
      }
    },
    "version": "0.0.0",
    "filename": "routes/beacon.js",
    "groupTitle": "BEACON"
  },
  {
    "type": "post",
    "url": "/beacon_save",
    "title": "Registrar un nuevo beacon",
    "name": "saveBeacon",
    "group": "BEACON",
    "parameter": {
      "fields": {
        "Parameter": [
          {
            "group": "Parameter",
            "type": "String",
            "optional": false,
            "field": "beacon",
            "description": "<p>Es el JSON con la inforamcion de beacon.</p>"
          }
        ]
      }
    },
    "success": {
      "fields": {
        "Success 200": [
          {
            "group": "Success 200",
            "type": "String",
            "optional": false,
            "field": "correcto",
            "description": "<p>Es larepuesta correcta.</p>"
          }
        ]
      }
    },
    "version": "0.0.0",
    "filename": "routes/beacon.js",
    "groupTitle": "BEACON"
  },
  {
    "type": "post",
    "url": "/save_etapa",
    "title": "Guardar la etapa",
    "version": "1.0.0",
    "name": "etapaSave",
    "group": "Etapa",
    "parameter": {
      "fields": {
        "Parameter": [
          {
            "group": "Parameter",
            "type": "String",
            "optional": false,
            "field": "nombre",
            "description": "<p>nombre.</p>"
          }
        ]
      }
    },
    "success": {
      "fields": {
        "Success 200": [
          {
            "group": "Success 200",
            "type": "String",
            "optional": false,
            "field": "nombre",
            "description": "<p>nombre.</p>"
          }
        ]
      }
    },
    "filename": "routes/etapa.js",
    "groupTitle": "Etapa"
  },
  {
    "type": "get",
    "url": "/get_etapas",
    "title": "Regresar las etapas",
    "version": "1.0.0",
    "name": "get_etapas",
    "group": "Etapa",
    "success": {
      "fields": {
        "Success 200": [
          {
            "group": "Success 200",
            "type": "JSON",
            "optional": false,
            "field": "servicios",
            "description": "<p>Devolver los servicos dados de alta.</p>"
          }
        ]
      }
    },
    "filename": "routes/etapa.js",
    "groupTitle": "Etapa"
  },
  {
    "type": "get",
    "url": "/pruebaServicio",
    "title": "Prueba del controlador etapa",
    "version": "1.0.0",
    "name": "pruebaServicio",
    "group": "Etapa",
    "success": {
      "fields": {
        "Success 200": [
          {
            "group": "Success 200",
            "type": "String",
            "optional": false,
            "field": "Hola",
            "description": "<p>Mundo desde etapa.</p>"
          }
        ]
      }
    },
    "filename": "routes/etapa.js",
    "groupTitle": "Etapa"
  },
  {
    "type": "post",
    "url": "/parte_save",
    "title": "Registrar ua nueva parte con sus tiempo",
    "version": "1.0.0",
    "name": "SaveParte",
    "group": "Parte",
    "parameter": {
      "fields": {
        "Parameter": [
          {
            "group": "Parameter",
            "type": "String",
            "optional": false,
            "field": "component",
            "description": "<p>component</p>"
          }
        ]
      }
    },
    "success": {
      "fields": {
        "Success 200": [
          {
            "group": "Success 200",
            "type": "String",
            "optional": false,
            "field": "component",
            "description": "<p>component</p>"
          }
        ]
      }
    },
    "filename": "routes/parte.js",
    "groupTitle": "Parte"
  },
  {
    "type": "get",
    "url": "/get_partes",
    "title": "Regresa  las partes ingresadas",
    "version": "1.0.0",
    "name": "get_partes",
    "group": "Parte",
    "success": {
      "fields": {
        "Success 200": [
          {
            "group": "Success 200",
            "type": "String",
            "optional": false,
            "field": "partes",
            "description": "<p>Devolver partes ingresadas en el sistema.</p>"
          }
        ]
      }
    },
    "filename": "routes/parte.js",
    "groupTitle": "Parte"
  },
  {
    "type": "get",
    "url": "/parte_servicio/:tailNum",
    "title": "Regresa  las partes ingresadas",
    "version": "1.0.0",
    "parameter": {
      "fields": {
        "Parameter": [
          {
            "group": "Parameter",
            "type": "String",
            "optional": false,
            "field": "tailNum",
            "description": "<p>El taill number del avion.</p>"
          }
        ]
      }
    },
    "name": "get_partes",
    "group": "Parte",
    "success": {
      "fields": {
        "Success 200": [
          {
            "group": "Success 200",
            "type": "String",
            "optional": false,
            "field": "Devolver",
            "description": "<p>partes.</p>"
          }
        ]
      }
    },
    "filename": "routes/parte.js",
    "groupTitle": "Parte"
  },
  {
    "type": "get",
    "url": "/prueba_partes",
    "title": "Prueba del controlador Parte",
    "version": "1.0.0",
    "name": "prueba",
    "group": "Parte",
    "success": {
      "fields": {
        "Success 200": [
          {
            "group": "Success 200",
            "type": "String",
            "optional": false,
            "field": "Accion",
            "description": "<p>de pruebas parte.</p>"
          }
        ]
      }
    },
    "filename": "routes/parte.js",
    "groupTitle": "Parte"
  },
  {
    "type": "post",
    "url": "/update_partes",
    "title": "Ingresa las partes de nombre de las partes, el numService y el rfid",
    "version": "1.0.0",
    "name": "update_partes",
    "group": "Parte",
    "parameter": {
      "fields": {
        "Parameter": [
          {
            "group": "Parameter",
            "type": "String",
            "optional": false,
            "field": "rfid",
            "description": "<p>El Rfid con el que se va a ligar.</p>"
          },
          {
            "group": "Parameter",
            "type": "parte",
            "optional": false,
            "field": "parte",
            "description": "<p>El nombre de la parte.</p>"
          },
          {
            "group": "Parameter",
            "type": "String",
            "optional": false,
            "field": "numService",
            "description": "<p>numService.</p>"
          }
        ]
      }
    },
    "success": {
      "fields": {
        "Success 200": [
          {
            "group": "Success 200",
            "type": "String",
            "optional": false,
            "field": "rfid",
            "description": "<p>Devolver el rfid.</p>"
          },
          {
            "group": "Success 200",
            "type": "String",
            "optional": false,
            "field": "parte",
            "description": "<p>DEvolver el id de la parte.</p>"
          },
          {
            "group": "Success 200",
            "type": "String",
            "optional": false,
            "field": "numService",
            "description": "<p>Devolver el id del Servicio.</p>"
          }
        ]
      }
    },
    "filename": "routes/parte.js",
    "groupTitle": "Parte"
  },
  {
    "type": "post",
    "url": "/rfidsave",
    "title": "Registrar un nuevo rfid",
    "version": "1.0.0",
    "name": "GetUser",
    "group": "RFID",
    "parameter": {
      "fields": {
        "Parameter": [
          {
            "group": "Parameter",
            "type": "String",
            "optional": false,
            "field": "idRFID",
            "description": "<p>idRFID.</p>"
          },
          {
            "group": "Parameter",
            "type": "String",
            "optional": false,
            "field": "aparato",
            "description": "<p>aparato.</p>"
          },
          {
            "group": "Parameter",
            "type": "String",
            "optional": false,
            "field": "aparatoIdentificador",
            "description": "<p>aparatoIdentificador.</p>"
          }
        ]
      }
    },
    "success": {
      "fields": {
        "Success 200": [
          {
            "group": "Success 200",
            "type": "String",
            "optional": false,
            "field": "idRFID",
            "description": "<p>idRFID.</p>"
          },
          {
            "group": "Success 200",
            "type": "String",
            "optional": false,
            "field": "aparato",
            "description": "<p>aparato.</p>"
          },
          {
            "group": "Success 200",
            "type": "String",
            "optional": false,
            "field": "aparatoIdentificador",
            "description": "<p>aparatoIdentificador.</p>"
          }
        ]
      }
    },
    "filename": "routes/rfid.js",
    "groupTitle": "RFID"
  },
  {
    "type": "post",
    "url": "/findLastRfid",
    "title": "Obtener el ultimo RFID",
    "version": "1.0.0",
    "name": "findLastRfid",
    "group": "RFID",
    "parameter": {
      "fields": {
        "Parameter": [
          {
            "group": "Parameter",
            "type": "String",
            "optional": false,
            "field": "idRFID",
            "description": "<p>idRFID.</p>"
          },
          {
            "group": "Parameter",
            "type": "String",
            "optional": false,
            "field": "aparatoIdentificador",
            "description": "<p>aparatoIdentificador.</p>"
          }
        ]
      }
    },
    "success": {
      "fields": {
        "Success 200": [
          {
            "group": "Success 200",
            "type": "JSON",
            "optional": false,
            "field": "status",
            "description": "<p>Se sabe si ya hubo antes</p>"
          }
        ]
      }
    },
    "filename": "routes/rfid.js",
    "groupTitle": "RFID"
  },
  {
    "type": "post",
    "url": "/findRfid",
    "title": "Obtener la parte",
    "version": "1.0.0",
    "name": "findRfid",
    "group": "RFID",
    "parameter": {
      "fields": {
        "Parameter": [
          {
            "group": "Parameter",
            "type": "String",
            "optional": false,
            "field": "rfid",
            "description": "<p>El id a buscar.</p>"
          }
        ]
      }
    },
    "success": {
      "fields": {
        "Success 200": [
          {
            "group": "Success 200",
            "type": "JSON",
            "optional": false,
            "field": "parte",
            "description": "<p>Se obtiene que parte pertenece a ese ifrfid</p>"
          }
        ]
      }
    },
    "filename": "routes/rfid.js",
    "groupTitle": "RFID"
  },
  {
    "type": "get",
    "url": "/getAlarmas",
    "title": "Obtener el ultimo RFID",
    "version": "1.0.0",
    "name": "getAlarmas",
    "group": "RFID",
    "success": {
      "fields": {
        "Success 200": [
          {
            "group": "Success 200",
            "type": "JSON",
            "optional": false,
            "field": "alertas",
            "description": "<p>Las alertas</p>"
          }
        ]
      }
    },
    "filename": "routes/rfid.js",
    "groupTitle": "RFID"
  },
  {
    "type": "get",
    "url": "/getRFID",
    "title": "Obtener los RFIDs",
    "version": "1.0.0",
    "name": "getRFID",
    "group": "RFID",
    "success": {
      "fields": {
        "Success 200": [
          {
            "group": "Success 200",
            "type": "JSON",
            "optional": false,
            "field": "rfids",
            "description": "<p>Se obtiene una lista de los rfids que han ingresado al sistema agrupados por aparatoIdentificador</p>"
          }
        ]
      }
    },
    "filename": "routes/rfid.js",
    "groupTitle": "RFID"
  },
  {
    "type": "get",
    "url": "/pruebarfid",
    "title": "Prueba del controlador RFID",
    "version": "1.0.0",
    "name": "pruebas",
    "group": "RFID",
    "success": {
      "fields": {
        "Success 200": [
          {
            "group": "Success 200",
            "type": "String",
            "optional": false,
            "field": "Accion",
            "description": "<p>de pruebas rfid.</p>"
          }
        ]
      }
    },
    "filename": "routes/rfid.js",
    "groupTitle": "RFID"
  },
  {
    "type": "get_partes",
    "url": "}",
    "title": "Regresar los servicios ingresadas",
    "version": "1.0.0",
    "name": "get_servicios",
    "group": "Servicio",
    "success": {
      "fields": {
        "Success 200": [
          {
            "group": "Success 200",
            "type": "JSON",
            "optional": false,
            "field": "servicios",
            "description": "<p>Devolver los servicos dados de alta.</p>"
          }
        ]
      }
    },
    "filename": "routes/servicio.js",
    "groupTitle": "Servicio"
  },
  {
    "type": "get",
    "url": "/pruebaServicio",
    "title": "Prueba del controlador servicio",
    "version": "1.0.0",
    "name": "pruebaServicio",
    "group": "Servicio",
    "success": {
      "fields": {
        "Success 200": [
          {
            "group": "Success 200",
            "type": "String",
            "optional": false,
            "field": "Hola",
            "description": "<p>Mundo desde avion.</p>"
          }
        ]
      }
    },
    "filename": "routes/servicio.js",
    "groupTitle": "Servicio"
  },
  {
    "type": "servicioSave",
    "url": "Guardar",
    "title": "el servicio",
    "version": "1.0.0",
    "name": "servicioSave",
    "group": "Servicio",
    "parameter": {
      "fields": {
        "Parameter": [
          {
            "group": "Parameter",
            "type": "String",
            "optional": false,
            "field": "model",
            "description": "<p>model.</p>"
          },
          {
            "group": "Parameter",
            "type": "String",
            "optional": false,
            "field": "tailNum",
            "description": "<p>tailNum.</p>"
          },
          {
            "group": "Parameter",
            "type": "String",
            "optional": false,
            "field": "type",
            "description": "<p>type.</p>"
          },
          {
            "group": "Parameter",
            "type": "String",
            "optional": false,
            "field": "airline",
            "description": "<p>airline.</p>"
          },
          {
            "group": "Parameter",
            "type": "String",
            "optional": false,
            "field": "date1",
            "description": "<p>date1.</p>"
          },
          {
            "group": "Parameter",
            "type": "String",
            "optional": false,
            "field": "date2",
            "description": "<p>date2.</p>"
          },
          {
            "group": "Parameter",
            "type": "String",
            "optional": false,
            "field": "lineService",
            "description": "<p>lineService.</p>"
          }
        ]
      }
    },
    "success": {
      "fields": {
        "Success 200": [
          {
            "group": "Success 200",
            "type": "String",
            "optional": false,
            "field": "model",
            "description": "<p>model.</p>"
          },
          {
            "group": "Success 200",
            "type": "String",
            "optional": false,
            "field": "tailNum",
            "description": "<p>tailNum.</p>"
          },
          {
            "group": "Success 200",
            "type": "String",
            "optional": false,
            "field": "type",
            "description": "<p>type.</p>"
          },
          {
            "group": "Success 200",
            "type": "String",
            "optional": false,
            "field": "airline",
            "description": "<p>airline.</p>"
          },
          {
            "group": "Success 200",
            "type": "String",
            "optional": false,
            "field": "date1",
            "description": "<p>date1.</p>"
          },
          {
            "group": "Success 200",
            "type": "String",
            "optional": false,
            "field": "date2",
            "description": "<p>date2.</p>"
          },
          {
            "group": "Success 200",
            "type": "String",
            "optional": false,
            "field": "lineService",
            "description": "<p>lineService.</p>"
          },
          {
            "group": "Success 200",
            "type": "String",
            "optional": false,
            "field": "created_at",
            "description": "<p>created_at.</p>"
          }
        ]
      }
    },
    "filename": "routes/servicio.js",
    "groupTitle": "Servicio"
  },
  {
    "type": "get",
    "url": "/user/:id",
    "title": "Registrar un nuevo usuario",
    "version": "1.0.0",
    "name": "GetUser",
    "group": "User",
    "parameter": {
      "fields": {
        "Parameter": [
          {
            "group": "Parameter",
            "type": "Number",
            "optional": false,
            "field": "id",
            "description": "<p>Users unique ID.</p>"
          }
        ]
      }
    },
    "success": {
      "fields": {
        "Success 200": [
          {
            "group": "Success 200",
            "type": "String",
            "optional": false,
            "field": "firstname",
            "description": "<p>Firstname of the User.</p>"
          },
          {
            "group": "Success 200",
            "type": "String",
            "optional": false,
            "field": "lastname",
            "description": "<p>Lastname of the User.</p>"
          }
        ]
      }
    },
    "filename": "routes/user.js",
    "groupTitle": "User"
  },
  {
    "type": "get",
    "url": "/user/:id",
    "title": "Registrar un nuevo usuario",
    "version": "1.0.0",
    "name": "GetUser",
    "group": "User",
    "parameter": {
      "fields": {
        "Parameter": [
          {
            "group": "Parameter",
            "type": "Number",
            "optional": false,
            "field": "id",
            "description": "<p>Users unique ID.</p>"
          }
        ]
      }
    },
    "success": {
      "fields": {
        "Success 200": [
          {
            "group": "Success 200",
            "type": "String",
            "optional": false,
            "field": "firstname",
            "description": "<p>Firstname of the User.</p>"
          },
          {
            "group": "Success 200",
            "type": "String",
            "optional": false,
            "field": "lastname",
            "description": "<p>Lastname of the User.</p>"
          }
        ]
      }
    },
    "filename": "routes/user.js",
    "groupTitle": "User"
  },
  {
    "type": "get",
    "url": "/user/:id",
    "title": "Registrar un nuevo usuario",
    "version": "1.0.0",
    "name": "GetUser",
    "group": "User",
    "parameter": {
      "fields": {
        "Parameter": [
          {
            "group": "Parameter",
            "type": "Number",
            "optional": false,
            "field": "id",
            "description": "<p>Users unique ID.</p>"
          }
        ]
      }
    },
    "success": {
      "fields": {
        "Success 200": [
          {
            "group": "Success 200",
            "type": "String",
            "optional": false,
            "field": "firstname",
            "description": "<p>Firstname of the User.</p>"
          },
          {
            "group": "Success 200",
            "type": "String",
            "optional": false,
            "field": "lastname",
            "description": "<p>Lastname of the User.</p>"
          }
        ]
      }
    },
    "filename": "routes/user.js",
    "groupTitle": "User"
  },
  {
    "type": "get",
    "url": "/user/:id",
    "title": "Registrar un nuevo usuario",
    "version": "1.0.0",
    "name": "GetUser",
    "group": "User",
    "parameter": {
      "fields": {
        "Parameter": [
          {
            "group": "Parameter",
            "type": "Number",
            "optional": false,
            "field": "id",
            "description": "<p>Users unique ID.</p>"
          }
        ]
      }
    },
    "success": {
      "fields": {
        "Success 200": [
          {
            "group": "Success 200",
            "type": "String",
            "optional": false,
            "field": "firstname",
            "description": "<p>Firstname of the User.</p>"
          },
          {
            "group": "Success 200",
            "type": "String",
            "optional": false,
            "field": "lastname",
            "description": "<p>Lastname of the User.</p>"
          }
        ]
      }
    },
    "filename": "routes/user.js",
    "groupTitle": "User"
  },
  {
    "type": "get",
    "url": "/user/:id",
    "title": "Registrar un nuevo usuario",
    "version": "1.0.0",
    "name": "GetUser",
    "group": "User",
    "parameter": {
      "fields": {
        "Parameter": [
          {
            "group": "Parameter",
            "type": "Number",
            "optional": false,
            "field": "id",
            "description": "<p>Users unique ID.</p>"
          }
        ]
      }
    },
    "success": {
      "fields": {
        "Success 200": [
          {
            "group": "Success 200",
            "type": "String",
            "optional": false,
            "field": "firstname",
            "description": "<p>Firstname of the User.</p>"
          },
          {
            "group": "Success 200",
            "type": "String",
            "optional": false,
            "field": "lastname",
            "description": "<p>Lastname of the User.</p>"
          }
        ]
      }
    },
    "filename": "routes/user.js",
    "groupTitle": "User"
  },
  {
    "type": "get",
    "url": "/user/:id",
    "title": "Registrar un nuevo usuario",
    "version": "1.0.0",
    "name": "GetUser",
    "group": "User",
    "parameter": {
      "fields": {
        "Parameter": [
          {
            "group": "Parameter",
            "type": "Number",
            "optional": false,
            "field": "id",
            "description": "<p>Users unique ID.</p>"
          }
        ]
      }
    },
    "success": {
      "fields": {
        "Success 200": [
          {
            "group": "Success 200",
            "type": "String",
            "optional": false,
            "field": "firstname",
            "description": "<p>Firstname of the User.</p>"
          },
          {
            "group": "Success 200",
            "type": "String",
            "optional": false,
            "field": "lastname",
            "description": "<p>Lastname of the User.</p>"
          }
        ]
      }
    },
    "filename": "routes/user.js",
    "groupTitle": "User"
  },
  {
    "type": "get",
    "url": "/user/:id",
    "title": "Registrar un nuevo usuario",
    "version": "1.0.0",
    "name": "GetUser",
    "group": "User",
    "parameter": {
      "fields": {
        "Parameter": [
          {
            "group": "Parameter",
            "type": "Number",
            "optional": false,
            "field": "id",
            "description": "<p>Users unique ID.</p>"
          }
        ]
      }
    },
    "success": {
      "fields": {
        "Success 200": [
          {
            "group": "Success 200",
            "type": "String",
            "optional": false,
            "field": "firstname",
            "description": "<p>Firstname of the User.</p>"
          },
          {
            "group": "Success 200",
            "type": "String",
            "optional": false,
            "field": "lastname",
            "description": "<p>Lastname of the User.</p>"
          }
        ]
      }
    },
    "filename": "routes/user.js",
    "groupTitle": "User"
  }
]
