{
  "rabbit_version": "3.7.7",
  "users": [
    {
      "name": "guest",
      "password_hash": "o2MJjT8UKSRM7eoLDMWvm4LxqaFvDxd2wLg1KQQQ2jXfG5UE",
      "hashing_algorithm": "rabbit_password_hashing_sha256",
      "tags": "administrator"
    }
  ],
  "vhosts": [
    {
      "name": "/"
    },
    {
      "name": "/vh1"
    }
  ],
  "permissions": [
    {
      "user": "guest",
      "vhost": "/",
      "configure": ".*",
      "write": ".*",
      "read": ".*"
    },
    {
      "user": "guest",
      "vhost": "/vh1",
      "configure": ".*",
      "write": ".*",
      "read": ".*"
    }
  ],
  "parameters": [],
  "policies": [],
  "queues": [
    {
      "name": "queue-default",
      "vhost": "/",
      "durable": true,
      "auto_delete": false,
      "arguments": {
        "x-ha-policy": "all"
      }
    },
    {
      "name": "queue-vh1",
      "vhost": "/vh1",
      "durable": true,
      "auto_delete": false,
      "arguments": {
        "x-ha-policy": "all"
      }
    },
    {
      "name": "queue-vh1a",
      "vhost": "/vh1",
      "durable": true,
      "auto_delete": false,
      "arguments": {
        "x-ha-policy": "all"
      }
    }
  ],
  "exchanges": [],
  "bindings": [
    {
      "source": "amq.direct",
      "vhost": "/",
      "destination": "queue-default",
      "destination_type": "queue",
      "routing_key": "logstash",
      "arguments": {}
    },
    {
      "source": "amq.direct",
      "vhost": "/",
      "destination": "queue-default",
      "destination_type": "queue",
      "routing_key": "default",
      "arguments": {}
    },
    {
      "source": "amq.direct",
      "vhost": "/vh1",
      "destination": "queue-vh1",
      "destination_type": "queue",
      "routing_key": "logstash",
      "arguments": {}
    },
    {
      "source": "amq.direct",
      "vhost": "/vh1",
      "destination": "queue-vh1",
      "destination_type": "queue",
      "routing_key": "default",
      "arguments": {}
    }
  ]
}