<svg xmlns="http://www.w3.org/2000/svg" xmlns:xlink="http://www.w3.org/1999/xlink" width="253" height="63" viewBox="0 0 253 63">
  <defs>
    <linearGradient id="linear-gradient" x1="0.934" y1="0.06" x2="0.049" y2="0.89" gradientUnits="objectBoundingBox">
      <stop offset="0" stop-color="#ffe26d"/>
      <stop offset="1" stop-color="#ffcb3b"/>
    </linearGradient>
    <filter id="Rectangle_14" x="0" y="0" width="253" height="63" filterUnits="userSpaceOnUse">
      <feOffset dy="3" input="SourceAlpha"/>
      <feGaussianBlur stdDeviation="3" result="blur"/>
      <feFlood flood-opacity="0.2"/>
      <feComposite operator="in" in2="blur"/>
      <feComposite in="SourceGraphic"/>
    </filter>
  </defs>
  <g id="Bouton_important" data-name="Bouton important" transform="translate(9 6)">
    <g transform="matrix(1, 0, 0, 1, -9, -6)" filter="url(#Rectangle_14)">
      <rect id="Rectangle_14-2" data-name="Rectangle 14" width="235" height="45" rx="22.5" transform="translate(9 6)" fill="url(#linear-gradient)"/>
    </g>
    <text id="Contactez-nous" transform="translate(117.5 28)" fill="#02544d" font-size="16" font-family="OpenSans-Bold, Open Sans" font-weight="700"><tspan x="-61.848" y="0">Contactez-nous</tspan></text>
  </g>
</svg>
