<?xml version="1.0" encoding="UTF-8" standalone="no"?>
<!-- Created with Inkscape (http://www.inkscape.org/) -->

<svg
   xmlns:dc="http://purl.org/dc/elements/1.1/"
   xmlns:cc="http://creativecommons.org/ns#"
   xmlns:rdf="http://www.w3.org/1999/02/22-rdf-syntax-ns#"
   xmlns:svg="http://www.w3.org/2000/svg"
   xmlns="http://www.w3.org/2000/svg"
   xmlns:sodipodi="http://sodipodi.sourceforge.net/DTD/sodipodi-0.dtd"
   xmlns:inkscape="http://www.inkscape.org/namespaces/inkscape"
   width="134.9375mm"
   height="126.80224mm"
   viewBox="0 0 134.9375 126.80224"
   version="1.1"
   id="svg8"
   inkscape:version="0.92.3 (2405546, 2018-03-11)"
   sodipodi:docname="shifumiCluster.svg">
  <title
     id="title4547">shifumiCluster</title>
  <defs
     id="defs2" />
  <sodipodi:namedview
     id="base"
     pagecolor="#ffffff"
     bordercolor="#666666"
     borderopacity="1.0"
     inkscape:pageopacity="0.0"
     inkscape:pageshadow="2"
     inkscape:zoom="1"
     inkscape:cx="223.14444"
     inkscape:cy="169.25252"
     inkscape:document-units="mm"
     inkscape:current-layer="layer1"
     showgrid="false"
     inkscape:window-width="3056"
     inkscape:window-height="1755"
     inkscape:window-x="-13"
     inkscape:window-y="-13"
     inkscape:window-maximized="1" />
  <metadata
     id="metadata5">
    <rdf:RDF>
      <cc:Work
         rdf:about="">
        <dc:format>image/svg+xml</dc:format>
        <dc:type
           rdf:resource="http://purl.org/dc/dcmitype/StillImage" />
        <dc:title>shifumiCluster</dc:title>
      </cc:Work>
    </rdf:RDF>
  </metadata>
  <g
     inkscape:label="Calque 1"
     inkscape:groupmode="layer"
     id="layer1"
     transform="translate(-47.889583,-66.812492)">
    <g
       id="g4545"
       inkscape:export-xdpi="96"
       inkscape:export-ydpi="96">
      <rect
         y="66.812492"
         x="73.554161"
         height="65.110535"
         width="45.772911"
         id="rect4520"
         style="opacity:0.41000001;fill:#d3b07f;fill-opacity:0.99079751;stroke-width:0.28803802" />
      <circle
         r="22.357292"
         cy="127.00521"
         cx="75.009369"
         id="path4518"
         style="opacity:1;fill:#000000;fill-opacity:0.99079751;stroke-width:0.26458332" />
      <path
         inkscape:connector-curvature="0"
         id="path4522"
         d="M 182.82708,82.687497 C 127.26458,171.85208 47.889583,168.14792 47.889583,168.14792 Z"
         style="fill:#c1c2c3;fill-opacity:1;stroke:none;stroke-width:0.26458332px;stroke-linecap:butt;stroke-linejoin:miter;stroke-opacity:1" />
      <path
         inkscape:connector-curvature="0"
         id="path4522-3"
         d="M 68.020804,193.61473 C 89.736384,90.823937 165.5914,67.156857 165.5914,67.156857 Z"
         style="fill:#7a797d;fill-opacity:1;stroke:none;stroke-width:0.26458332px;stroke-linecap:butt;stroke-linejoin:miter;stroke-opacity:1" />
    </g>
  </g>
</svg>
