00:00:00.342940 VirtualBox GUI VM Selector Window 6.1.38_Ubuntu r153438 linux.amd64 (Sep  7 2022 11:18:57) release log
00:00:00.342941 Log opened 2022-10-03T23:59:45.709880000Z
00:00:00.342941 Build Type: release
00:00:00.342945 OS Product: Linux
00:00:00.342945 OS Release: 5.15.0-48-generic
00:00:00.342946 OS Version: #54-Ubuntu SMP Fri Aug 26 13:26:29 UTC 2022
00:00:00.342964 DMI Product Name: 20VK001SUS
00:00:00.342968 DMI Product Version: ThinkPad L13 Yoga Gen 2
00:00:00.342974 Firmware type: UEFI
00:00:00.343336 Secure Boot: Disabled
00:00:00.343365 Host RAM: 15670MB (15.3GB) total, 14518MB (14.1GB) available
00:00:00.343369 Executable: /usr/lib/virtualbox/VirtualBox
00:00:00.343369 Process ID: 31007
00:00:00.343369 Package type: LINUX_64BITS_GENERIC (OSE)
00:00:00.343394 Qt version: 5.15.3
00:00:00.364327 GUI: UIMediumEnumerator: Medium-enumeration started...
00:00:00.625199 GUI: UIDesktopWidgetWatchdog::sltHandleHostScreenAvailableGeometryCalculated: Screen 0 work area is actually resized to: 0x0 x 1920x1040
00:00:00.628374 GUI: UIDesktopWidgetWatchdog::sltHandleHostScreenAvailableGeometryCalculated: Screen 1 work area is actually resized to: 1920x0 x 1920x1080
00:00:00.647007 GUI: UIMediumEnumerator: Medium-enumeration finished!
00:41:09.056054 GUI: UIMediumEnumerator: Medium-enumeration finished!
