{
    "extName": {
        "message": "Simple = Select + Search",
        "description": "Extension's name. Use   instead of spaces."
    },
    "extDescription": {
        "message": "Clique no botão direito do rato no texto selecionado para pesquisar em vários motores de pesquisa para o Chrome.",
        "description": ""
    },
    "bg_searchStringOn": {
        "message": "Pesquisar '%s' em",
        "description": ""
    },
    "bg_searchEverywhere": {
        "message": "Pesquisar em todos os lugares!",
        "description": ""
    },
    "bg_openOnNewTab": {
        "message": "Abrir em novo separador",
        "description": ""
    },
    "bg_options": {
        "message": "Opções...",
        "description": ""
    },
    "bg_extensionBlog": {
        "message": "Blogue desta extensão...",
        "description": ""
    },
    "bg_installMessage": {
        "message": "Extensão instalada com êxito. <br/> Veja a página de Opções para configurá-la e para saber sobre diferentes formas de apoiar o seu humilde desenvolvedor ;)",
        "description": ""
    },
    "bg_updateMessage": {
        "message": "Extensão atualizada com sucesso para {VersionNumber}<br/>Visite <a href=http://simpleselectsearch.blogspot.com>o meu blogue</a> para obter a lista das atualizações.",
        "description": ""
    },
    "o_name": {
        "message": "Nome",
        "description": ""
    },
    "o_searchURL": {
        "message": "Pesquisar URL",
        "description": ""
    },
    "o_cancel": {
        "message": "cancelar",
        "description": ""
    },
    "o_edit": {
        "message": "editar",
        "description": ""
    },
    "o_new": {
        "message": "novo",
        "description": ""
    },
    "o_ok": {
        "message": "ok",
        "description": ""
    },
    "o_sureYouWantToDelete": {
        "message": "Tem a certeza que deseja excluir esta linha?",
        "description": ""
    },
    "o_confirmImport": {
        "message": "Estou prestes a testar e analisar o texto na sua caixa de texto de importação/exportação... se algo correr mal... basta clicar sobre o botão *Desfazer a última importação*. Eu também recomendo que mantenha uma cópia de segurança desta configuração... apenas no caso de... :)",
        "description": ""
    },
    "o_importSuccesfull": {
        "message": "Importação bem sucedida. Antes de recarregar esta página, verifique a sua lista de Motores de Pesquisa para ter a certeza que tudo corre bem. Se estiver vazio, clique no botão *desfazer última importação*.",
        "description": ""
    },
    "o_confirmRestore": {
        "message": "Estou prestes a tentar restaurar a configuração guardada na última vez que clicou no botão *importação*",
        "description": ""
    },
    "o_restoreSuccesfull": {
        "message": "A configuração guardada antes da última importação foi agora restaurada... se isso não ajudar, pode sempre redefinir as opções para as definições padrão com o botão na página 'Definições avançadas'... ou pode tentar recuperar a cópia de segurança da configuração, se fez uma antes ;)",
        "description": ""
    },
    "o_nothingToRestore": {
        "message": "Desculpe, não tenho nada para restaurar",
        "description": ""
    },
    "o_thankYou": {
        "message": "Obrigado!",
        "description": ""
    },
    "o_type": {
        "message": "Tipo",
        "description": ""
    },
    "o_language": {
        "message": "Idioma",
        "description": ""
    },
    "o_moreSearchEngines": {
        "message": "Mais Motores de Pesquisa",
        "description": ""
    },
    "o_selectAURL": {
        "message": "Por favor selecione um URL",
        "description": ""
    },
    "o_mySearchEngines": {
        "message": "Os Meus Motores de Pesquisa",
        "description": ""
    },
    "o_mySearchEnginesDesc": {
        "message": "Estes são os motores de pesquisa configurados. Selecione outros Motores de Pesquisa presentes na lista abaixo ou crie os seus próprios. Consulte a Ajuda para obter instruções.",
        "description": ""
    },
    "o_featuredSearchEngines": {
        "message": "Motores de Pesquisa Recomendados",
        "description": ""
    },
    "o_featuredSearchEngnesDesc": {
        "message": "Clique num URL para o incluir na lista dos Motores de Pesquisa.",
        "description": ""
    },
    "o_groupBy": {
        "message": "Agrupar por:&nbsp;&nbsp;  ",
        "description": ""
    },
    "o_ungrouped": {
        "message": "Desagrupado",
        "description": ""
    },
    "o_helpHowDoI": {
        "message": "Ajuda! Como edito a lista dos Motores de Pesquisa?",
        "description": ""
    },
    "o_helpHowDoIDescription": {
        "message": "It's really easy! <br />  Just click on any row's edit icon (the one with the little pencil) or just click the \"name\" column and edit its values.  <ul>    <li>The \"name\" column refers to what you'll see on the context menu.</li>    <li>The \"Search URL\" refers to what the search engine needs to run your query.</li>    <li>The <span class=\"searchString\">%s</span> symbol will be replaced with the selected text on your browser.</li>  </ul>  You can decide the order of your search engines by dragging them up and down... do it over the \"#\" column, where the up and down arrows appear. Your mouse pointer will change when you're over the right spot, and you'll figure it out.  <h2>Here's a simple way to create a Search URL of your own:</h2>  <ul>    <li>On your preferred site, perform a search for the word \"TESTSEARCH\".</li>    <li> Then just copy the URL that was generated within the site, that might look like this, for example, on IMDB: http://www.imdb.com/find?s=all;q=<span class=\"searchString\">TESTSEARCH</span>.</li>    <li>Now just replace <span class=\"searchString\">TESTSEARCH</span> with <span class=\"searchString\">%s</span> and paste it here, on the \"Search URL\" column.</li>    <li>Then indicate a name to that Search URL and you're done!</li>  </ul>  Make sure you check first if the site you'd like to add is on the \"Other search engines\" table. I'm updating that table every now and the. If you have any suggestions for that list, they are more than welcome.  <br/>  <br/> You can sort the URLs order by hovering over the first column.",
        "description": ""
    },
    "o_SupportThisHumble": {
        "message": "Apoie este humilde desenvolvedor de extensões",
        "description": ""
    },
    "o_SupportThisHumbleDescription": {
        "message": "Of course, this extension is for free -I built it to use it myself, actually-... but if you really enjoy using it, and you'd like to show your appreciation, here's a list of things that might make me happy :)  <ul>    <li><b>Show me the money:</b> Hit the <b>donate</b> button at the top right of this page... and send me a few bucks!</li>    <li><b>Use Amazon's featured links:</b> Use any of the Amazon links featured on the options page, search stuff using my extension and buy it! If you used one of my links -it doesn't work if you created the link by yourself, it will cost you the same, and Amazon will pay me a handsome reward! :D... and did I mention it costs you zero!?</li>    <li><b>Guerrilla advertising:</b> <a href=\"http://twitter.com/home?status=OMG! I'm using Simple=Select+Search extension on Chrome and it rocks! http://bit.ly/HzSP8p @frenetix_\" title=\"Click to send this page to Twitter!\" target=\"_blank\">Share on Twitter</a>, <a href=\"https://www.facebook.com/sharer/sharer.php?u=http%3A%2F%2Fbit.ly%2FHzSP8p\" target=\"_blank\">post on Facebook</a>, G+ or wherever you feel this extension might be well received</li>    <li><b>More Guerrilla advertising:</b> Visit my blog, post a comment link to any of those posts. G+ the posts you like.</li>    <li><b>Boost my self esteem:</b> Rate the extension on Google's webstore, say how much you love it!</li>  </ul>",
        "description": ""
    },
    "o_importExport": {
        "message": "Importar/Exportar Configuração",
        "description": ""
    },
    "o_importExportDescription": {
        "message": "Here's all the config info. Just copy & save it on any text file...<br />  If you want to import your previously saved config, just paste it here and click on the import button.<br /><br />",
        "description": ""
    },
    "importConfig": {
        "message": "Importar",
        "description": ""
    },
    "undoLastImport": {
        "message": "Desfazer a última importação",
        "description": ""
    },
    "o_otherStuffYouCan": {
        "message": "Outras coisas que você pode configurar",
        "description": ""
    },
    "o_openLinksInNewTab": {
        "message": "Abrir os links em novo separador.",
        "description": ""
    },
    "o_giveNewTabFocus": {
        "message": "Exibir novo separador.",
        "description": ""
    },
    "o_newTabPosition": {
        "message": "Posição do novo separador:",
        "description": ""
    },
    "o_last": {
        "message": "Último",
        "description": ""
    },
    "o_first": {
        "message": "Primeiro",
        "description": ""
    },
    "o_next": {
        "message": "Seguinte",
        "description": ""
    },
    "o_previous": {
        "message": "Anterior",
        "description": ""
    },
    "o_trackSearchEngines": {
        "message": "Envia informações estatísticas sobre os motores de pesquisa.",
        "description": ""
    },
    "o_leavingThisCheckbox": {
        "message": "Tracked information is used by me, only for statistical analysis purposes.  <br/>No user information is being tracked.  <br/>No search terms are being tracked (only the search engine used). You can read more about this on <a href=\"http://simpleselectsearch.blogspot.com/\" target=\"_blank\">my blog</a>.",
        "description": ""
    },
    "eraseOptions": {
        "message": "Restaurar as opções padrão",
        "description": ""
    },
    "o_developedBy": {
        "message": "   Developed by <a href=\"https://plus.google.com/u/0/100927641416387074874/about\" target=\"_blank\">Diego Presno</a>. Follow me on Twitter <a href=\"http://twitter.com/#!/frenetix_\" target=\"_blank\">@frenetix_</a>  <br />  All images/icons designed by <a href=\"http://germanrivas.com/\" target=\"_blank\">germanrivas.com</a>.<br/><br />  <h2>Disclaimer</h2>  Please, be warned: the usage of this extension is being tracked by Google Analytics.  It also tracks which search engines are the most used by users, so I can then be able to add them to the featured Search Engines list.<br/>  The extension does not track the identity of its user, nor what terms they're looking for.  Only the search URL syntax is being recorded.<br/>  No individual information will be shared with third parties. The only information published will be about the most used sites. An example of the published information can be found on my <a href=\"http://simpleselectsearch.blogspot.com/\" target=\"_blank\">blog</a>.",
        "description": ""
    },
    "o_searchEngines": {
        "message": "Motores de pesquisa",
        "description": ""
    },
    "o_help": {
        "message": "Ajuda",
        "description": ""
    },
    "o_supportMe": {
        "message": "Apoia-me :)",
        "description": ""
    },
    "o_advancedConfig": {
        "message": "Definições avançadas",
        "description": ""
    },
    "o_credits": {
        "message": "Créditos/Aviso Legal",
        "description": ""
    },
    "o_checkOutMyBlog": {
        "message": "Visite o meu blogue para mais informações.",
        "description": ""
    },
    "o_sort": {
        "message": "Ordenar",
        "description": ""
    },
    "o_incognito": {
        "message": "Incógnito",
        "description": ""
    },
    "o_resetDefaultSuccess": {
        "message": "Possui agora as definições padrão :)",
        "description": ""
    },
    "o_areYouSure": {
        "message": "Tem a certeza?",
        "description": ""
    },
    "o_helpMeTranslate": {
        "message": "Ajude-me a traduzir!",
        "description": ""
    },
    "o_GitHubContributors": {
        "message": "Super incrível <a href='https://github.com/frenetix/SimpleSelectSearch' target='_blank'>GitHub</a> colaboradores",
        "description": ""
    },
    "o_CrowdinContributors": {
        "message": "Super incrível <a href='https://crowdin.com/project/simpleselectsearch' target='_blank'>Crowdin</a> contribuintes (tradutores)",
        "description": ""
    },
    "o_plusExplain": {
        "message": "Mais versus espaço: alguns motores de pesquisa usam '+' em vez de um espaço ao separar as palavras que pesquisa.",
        "description": ""
    },
    "o_cannotAddDuplicates": {
        "message": "Desculpe, não posso adicionar um nome já utilizado.",
        "description": ""
    },
    "o_group": {
        "message": "Grupo",
        "description": ""
    },
    "o_groupsUsed": {
        "message": "Grupos utilizados",
        "description": ""
    },
    "o_showSearchEverywhere": {
        "message": "Mostrar a opção 'Pesquise em todos'.",
        "description": ""
    },
    "o_showSearchEverywhereGroups": {
        "message": "Mostrar a opção 'Pesquise em todos' dentro dos grupos.",
        "description": ""
    },
    "o_tabs": {
        "message": "Separadores",
        "description": ""
    },
    "o_sortBy": {
        "message": "Ordenar por:",
        "description": ""
    }
}