67:11:26.074095 Log continuation - Log started 2022-09-29T00:33:41.902720000Z
67:11:26.079753 GUI: UIDesktopWidgetWatchdog::sltHandleHostScreenWorkAreaResized: Screen 2 work area is formally resized to: 0x0 x 0x0
67:11:26.087160 GUI: UIDesktopWidgetWatchdog::sltHandleHostScreenWorkAreaResized: Screen 0 work area is formally resized to: 0x0 x 1920x1040
67:11:26.436301 GUI: UIDesktopWidgetWatchdog::sltHandleHostScreenAvailableGeometryCalculated: Screen 1 work area is actually resized to: 1920x0 x 1920x1080
67:11:26.442845 GUI: UIDesktopWidgetWatchdog::sltHandleHostScreenAvailableGeometryCalculated: Screen 2 work area is actually resized to: 3840x0 x 1920x1080
67:11:26.452199 GUI: UIDesktopWidgetWatchdog::sltHandleHostScreenAvailableGeometryCalculated: Screen 0 work area is actually resized to: 0x0 x 1920x1040
67:11:26.455984 GUI: UIDesktopWidgetWatchdog::sltHandleHostScreenWorkAreaResized: Screen 2 work area is formally resized to: 3840x0 x 1920x1040
67:11:26.504095 GUI: UIDesktopWidgetWatchdog::sltHandleHostScreenAvailableGeometryCalculated: Screen 2 work area is actually resized to: 3840x0 x 1920x1080
67:12:17.800066 GUI: UIDesktopWidgetWatchdog::sltHandleHostScreenResized: Screen 0 is formally resized to: 0x0 x 1920x1080
67:12:17.804396 GUI: UIDesktopWidgetWatchdog::sltHandleHostScreenWorkAreaResized: Screen 0 work area is formally resized to: 0x0 x 1920x1040
67:12:18.592465 GUI: UIDesktopWidgetWatchdog::sltHandleHostScreenAvailableGeometryCalculated: Screen 1 work area is actually resized to: 3839x539 x 1920x1080
67:12:18.598990 GUI: UIDesktopWidgetWatchdog::sltHandleHostScreenAvailableGeometryCalculated: Screen 0 work area is actually resized to: 0x0 x 1920x1040
