{
   "bg_extensionBlog": {
      "description": "",
      "message": "Blog van deze uitbreiding..."
   },
   "bg_installMessage": {
      "description": "",
      "message": "Uitbreiding met succes geïnstalleerd! \u003Cbr/> Bekijk de Opties... pagina om deze te configureren, en om er achter te komen op welke manieren U allemaal Uw nederige uitbreiding verlener kan ondersteunen. ;)"
   },
   "bg_openOnNewTab": {
      "description": "",
      "message": "Open in nieuw tabblad"
   },
   "bg_options": {
      "description": "",
      "message": "Opties..."
   },
   "bg_searchEverywhere": {
      "description": "",
      "message": "Zoek overal!"
   },
   "bg_searchStringOn": {
      "description": "",
      "message": "Zoeken naar '%s'"
   },
   "bg_updateMessage": {
      "description": "",
      "message": "Uitbreiding met succes bijgewerkt naar {VersionNumber}\u003Cbr/> Bezoek \u003Ca href=http://simpleselectsearch.blogspot.com>Mijn blog\u003C/a> voor de lijst met verbeteringen."
   },
   "eraseOptions": {
      "description": "",
      "message": "Standaard instellingen herstellen"
   },
   "extDescription": {
      "description": "",
      "message": "Klik met rechts op de tekst om met meerdere zoekmachines te zoeken in Chrome. Ondersteunt grouping engines, incongito, en meer."
   },
   "extName": {
      "description": "Extension's name. Use   instead of spaces.",
      "message": "Simple = Select + Search"
   },
   "importConfig": {
      "description": "",
      "message": "importeren"
   },
   "o_CrowdinContributors": {
      "description": "",
      "message": "Super coole \u003Ca href='https://crowdin.com/project/simpleselectsearch' target='_blank'> Crowdin\u003C/a> mensen (vertalers)"
   },
   "o_GitHubContributors": {
      "description": "",
      "message": "Erg coole mensen die \u003Ca href='https://github.com/frenetix/SimpleSelectSearch' target='_blank'> GitHub\u003C/a> hebben geholpen"
   },
   "o_SupportThisHumble": {
      "description": "",
      "message": "Ondersteun deze bescheiden extensie ontwikkelaar"
   },
   "o_SupportThisHumbleDescription": {
      "description": "",
      "message": "Natuurlijk, is deze uitbreiding gratis - Ik bouwde het eigenlijk om zelf te gebruiken... maar als je er echt tevreden over bent, en je wilt graag je blijk van waardering laten zien, heb ik hier een lijst van dingen de mij gelukkig maken :) \u003Cul> \u003Cli>\u003Cb>Show me the money:\u003C/b> Klik op de \u003Cb>Doneer\u003C/b> knop rechts bovenaan deze pagina... en stuur me een paar euro's!\u003C/li> \u003Cli>\u003Cb>Gebruik Amazon's voorgestelde links:\u003C/b> Gebruik een link van Amazon op de optie pagina, gebruik de zoek uitbreiding om naar leuke spullen te zoeken op Amazon en koop het! Als U een van mijn Amazon links gebruikt om iets te kopen, zal Amazon mij een mooie beloning geven, en dat terwijl het U helemaal niets extra's kost@!\u003C/li>\u003Cli>\u003Cb>Guerrilla advertising:\u003C/b> \u003Ca href=\"http://twitter.com/home?status=OMG! I'm using Simple=Select+Search extension on Chrome and it rocks! http://bit.ly/HzSP8p @frenetix_\" title=\"Click to send this page to Twitter!\" target=\"_blank\">Deel op Twitter\u003C/a>, \u003Ca href=\"https://www.facebook.com/sharer/sharer.php?u=http%3A%2F%2Fbit.ly%2FHzSP8p\" target=\"_blank\">Deel op Facebook\u003C/a>, G+ of waar jij denkt dat deze uitbreiding goed ontvangen zal worden\u003C/li> \u003Cli>\u003Cb>Meer Guerrilla reclame:\u003C/b> bezoek aan mijn blog, plaats commentaar met een link naar een van deze berichten. G+ de berichten die jij leuk vind.\u003C/li>\u003Cli>\u003Cb>Stimuleer mijn gevoel van eigenwaarde:\u003C/b> Stem op de uitbreiding op Google's webstore, en zeg hoeveel u er van houd!\u003C/li> \u003C/ul>"
   },
   "o_advancedConfig": {
      "description": "",
      "message": "Geavanceerde configuratie"
   },
   "o_areYouSure": {
      "description": "",
      "message": "Weet je het zeker?"
   },
   "o_cancel": {
      "description": "",
      "message": "Annuleren"
   },
   "o_cannotAddDuplicates": {
      "description": "",
      "message": "Sorry, namen kunnen niet gelijk zijn."
   },
   "o_checkOutMyBlog": {
      "description": "",
      "message": "Bekijk mijn blog voor meer."
   },
   "o_confirmImport": {
      "description": "",
      "message": "Ik ga nu de tekst invoeren... Mocht er iets mis gaan, klik dan op *laatste invoer ongedaan maken*. Ik zou je ook adviseren altijd een back-up te bewaren van de configuratie...  In het geval er iets mis mocht gaan :)"
   },
   "o_confirmRestore": {
      "description": "",
      "message": "Ik ga nu de configuratie herstellen naar de laatste keer dat u op de *invoer* knop klikte."
   },
   "o_credits": {
      "description": "",
      "message": "Credits/Disclaimer"
   },
   "o_developedBy": {
      "description": "",
      "message": "   Ontwikkeld door \u003Ca href=\"https://plus.google.com/u/0/100927641416387074874/about\" target=\"_blank\"> Diego Presno\u003C/a>. Volg mij op Twitter \u003Ca href=\"http://twitter.com/#!/frenetix_\" target=\"_blank@frenetix_\u003C/a> \u003Cbr/> Alle afbeeldingen/pictogrammen ontworpen door \u003Ca href=\"http://germanrivas.com/\" target=\"_blank\">germanrivas.com\u003C/a>.\u003Cbr/>\u003Cbr/> \u003Ch2>Disclaimer\u003C/h2> Alstublieft, wees gewaarschuwd: het gebruik van deze uitbreiding wordt bijgehouden door Google Analytics. Het volgt ook welke zoekmachines het meest door de gebruikers gebruikt worden, waardoor ik in staat ben deze later toe te voegen op de Aanbevolen Zoekmachine lijst.\u003Cbr/> De uitbreiding onthoud niet de identiteit van de gebruiker, noch waar er naar gezocht word. Alleen de zoekopdracht URL-syntaxis wordt opgenomen.\u003Cbr/> Geen individuele informatie zal worden gedeeld met derden. De enige gepubliceerde informatie zullen de meest gebruikte sites zijn. Een voorbeeld van de gepubliceerde informatie is te vinden op mijn \u003Ca href=\"http://simpleselectsearch.blogspot.com/\" target=\"_blank\">blog\u003C/a>."
   },
   "o_edit": {
      "description": "",
      "message": "Bewerken"
   },
   "o_featuredSearchEngines": {
      "description": "",
      "message": "Aanbevolen zoekmachines"
   },
   "o_featuredSearchEngnesDesc": {
      "description": "",
      "message": "Klik op een URL om hem op te nemen in uw zoekmachine lijst."
   },
   "o_first": {
      "description": "",
      "message": "Eerste"
   },
   "o_giveNewTabFocus": {
      "description": "",
      "message": "Nieuwe tab focus geven."
   },
   "o_group": {
      "description": "",
      "message": "Groep"
   },
   "o_groupBy": {
      "description": "",
      "message": "Groeperen op:&nbsp;&nbsp;  "
   },
   "o_groupsUsed": {
      "description": "",
      "message": "Gebruikte groepen"
   },
   "o_help": {
      "description": "",
      "message": "Hulp"
   },
   "o_helpHowDoI": {
      "description": "",
      "message": "Help! Hoe bewerk ik de zoekmachines lijst?"
   },
   "o_helpHowDoIDescription": {
      "description": "",
      "message": "Het is erg gemakkelijk!\u003Cbr /> Klik op het pictogram Bewerken (diegene met het potloodje) of klik op de \"naam\" kolom om de waarden te bewerken. \u003Cul> \u003Cli> De \"naam\" kolom verwijst naar wat je ziet in het context-menu.\u003C/li>\u003Cli>De \"Zoek URL\" verwijst naar wat de zoekmachine nodig heeft om uw verzoek uit te voeren.\u003C/li> \u003C/ul>Het\u003Cspan class=\"searchString\">%s\u003C/span>symbool zal worden vervangen door de door U geselecteerde tekst.\u003C/li> \u003C/ul>U kunt de volgorde van de zoekmachines bepalen door ze via de \"#\"-kolom op en neer te slepen... (waar de pijlen omhoog en omlaag worden weergegeven). Uw muisaanwijzer verandert als je op de juiste plek zit, je ziet het vanzelf! \u003Ch2>Hier is een eenvoudige manier om een Zoek URL van je zelf te maken:\u003C/h2> \u003Cul> \u003Cli>Ga naar Uw favoriete website, en zoek hier naar het woord \"TESTSEARCH\".\u003C/li> \u003Cli> Kopieer dan de URL die bovenin de adresbalk staat, bijvoorbeeld op IMDB: http://www.imdb.com/find?s=all;q=\u003Cspan class=\"searchString\">TESTSEARCH\u003C/span>.\u003C/li> \u003Cli>Nu vervangt U \u003Cspan class=\"searchString\">TESTSEARCH\u003C/span> met \u003Cspan class=\"searchString\">%s\u003C/span> en plakt U deze hier in de \"Zoek URL\" kolom.\u003C/li> \u003Cli>Geef Uw nieuwe Zoekmachine een naam, en klaar is Kees! \u003C/li> \u003C/ul> Controleer even van te voren of Uw Zoekmachine niet al op de \"Andere Zoekmachine's lijst\" staat, deze update ik regelmatig. Als U suggesties heeft voor de lijst bent U meer dan welkom om deze aan mij door te geven. \u003Cbr/> U kunt de URL's te sorteren door met de muis over de eerste kolom te gaan."
   },
   "o_helpMeTranslate": {
      "description": "",
      "message": "Help me vertalen!"
   },
   "o_importExport": {
      "description": "",
      "message": "Importeer/Exporteer configuratie"
   },
   "o_importExportDescription": {
      "description": "",
      "message": "Hier is alle configuratie info. Gewoon kopiëren & plakken/opslaan in een tekstbestand... \u003Cbr/> als je je vorige opgeslagen configuratie wilt invoeren, plak je het gewoon hier en klik je op de Invoer knop.\u003Cbr/>\u003Cbr/>"
   },
   "o_importSuccesfull": {
      "description": "",
      "message": "Invoer succesvol! Voordat U de pagina herlaad, controleer de zoekmachine lijst om er zeker van te zijn dat alles goed werkt. Als de lijst leeg is, klik dan op *laatste invoer ongedaan maken*."
   },
   "o_incognito": {
      "description": "",
      "message": "Incognito"
   },
   "o_language": {
      "description": "",
      "message": "Taal"
   },
   "o_last": {
      "description": "",
      "message": "Laatste"
   },
   "o_leavingThisCheckbox": {
      "description": "",
      "message": "Als je dit vakje gemarkeerd laat staan, kan ik volgen hoe je de zoekmachines gebruikt. \u003Cbr/>The verkregen informatie is word alleen door mij gebruikt, en alleen voor statische analyse doeleinden, \u003Cbr/>Geen gebruiker informatie word opgeslagen \u003Cbr/>Ook kan ik niet zien naar wát er precies gezocht word (alleen welke zoekmachine je gebruikt). Wil je hier meer over weten, lees dan mijn \u003Ca href=\"http://simpleselectsearch.blogspot.com/\" target=\"_blank\">blog\u003C/a>."
   },
   "o_moreSearchEngines": {
      "description": "",
      "message": "Meer zoekmachines"
   },
   "o_mySearchEngines": {
      "description": "",
      "message": "Mijn zoekmachines"
   },
   "o_mySearchEnginesDesc": {
      "description": "",
      "message": "Dit zijn uw geconfigureerde zoekmachines. Selecteer andere zoekmachines uit de Aanbevolen Zoekmachines lijst hieronder of maak er zelf een. Bekijk help voor instructies."
   },
   "o_name": {
      "description": "",
      "message": "Naam"
   },
   "o_new": {
      "description": "",
      "message": "Nieuw"
   },
   "o_newTabPosition": {
      "description": "",
      "message": "Nieuwe tab positie:"
   },
   "o_next": {
      "description": "",
      "message": "Volgende"
   },
   "o_nothingToRestore": {
      "description": "",
      "message": "Sorry, ik heb niets om te herstellen."
   },
   "o_ok": {
      "description": "",
      "message": "OK"
   },
   "o_openLinksInNewTab": {
      "description": "",
      "message": "Koppelingen in nieuw tabblad openen."
   },
   "o_otherStuffYouCan": {
      "description": "",
      "message": "Andere dingen die u kunt configureren"
   },
   "o_plusExplain": {
      "description": "",
      "message": "Plus of spatie: sommige search engines gebruiken ' +' in plaats van een spatie om de woorden te scheiden die U zoekt."
   },
   "o_previous": {
      "description": "",
      "message": "Vorige"
   },
   "o_resetDefaultSuccess": {
      "description": "",
      "message": "U hebt nu standaard instellingen :)"
   },
   "o_restoreSuccesfull": {
      "description": "",
      "message": "Configuratie hersteld naar het punt vóór de laatste invoer... Als dit niet helpt, kunt U nog altijd de instellingen resetten naar de Standaard instellingen -zie de knop onderaan deze pagina-... Of U kunt Uw back-up configuratie gebruiken, als U die heeft ;)"
   },
   "o_searchEngines": {
      "description": "",
      "message": "Zoekmachines"
   },
   "o_searchURL": {
      "description": "",
      "message": "Zoek URL"
   },
   "o_selectAURL": {
      "description": "",
      "message": "Selecteer een URL"
   },
   "o_showSearchEverywhere": {
      "description": "",
      "message": "Toon 'Zoek overal' optie."
   },
   "o_showSearchEverywhereGroups": {
      "description": "",
      "message": "Toon 'Zoek overal' optie binnen de groepen."
   },
   "o_sort": {
      "description": "",
      "message": "Sorteer"
   },
   "o_sortBy": {
      "description": "",
      "message": "Sorteer op:"
   },
   "o_supportMe": {
      "description": "",
      "message": "Steun mij :)"
   },
   "o_sureYouWantToDelete": {
      "description": "",
      "message": "Weet U zeker dat U deze rij wilt verwijderen?"
   },
   "o_tabs": {
      "description": "",
      "message": "Tabbladen"
   },
   "o_thankYou": {
      "description": "",
      "message": "Hartelijk dank!"
   },
   "o_trackSearchEngines": {
      "description": "",
      "message": " Volg zoekmachines gebruik."
   },
   "o_type": {
      "description": "",
      "message": "Type"
   },
   "o_ungrouped": {
      "description": "",
      "message": "Niet-gegroepeerd"
   },
   "undoLastImport": {
      "description": "",
      "message": "Maak laatste invoer ongedaan"
   }
}
