{
   "bg_extensionBlog": {
      "description": "",
      "message": "Udvidelsens blog..."
   },
   "bg_installMessage": {
      "description": "",
      "message": "Udvidelsen succesfuldt installeret. \u003Cbr/> Check siden med indstillinger for at konfigurere den, og for at få at vide om forskellige måder at støtte din ydmyge udvidelse udbyder ;)"
   },
   "bg_openOnNewTab": {
      "description": "",
      "message": "Åbn på ny fane"
   },
   "bg_options": {
      "description": "",
      "message": "Indstillinger..."
   },
   "bg_searchEverywhere": {
      "description": "",
      "message": "Søg overalt!"
   },
   "bg_searchStringOn": {
      "description": "",
      "message": "Søg efter '%s' på"
   },
   "bg_updateMessage": {
      "description": "",
      "message": "Udvidelse succesfuldt opdateret til {VersionNumber}\u003Cbr/>Besøg\u003Ca href=http://simpleselectsearch.blogspot.com>min blog\u003C/a> for en liste over forbedringer."
   },
   "eraseOptions": {
      "description": "",
      "message": "Gendan standardindstillingerne"
   },
   "extDescription": {
      "description": "",
      "message": "Højreklik på markeret tekst for at søge på flere søgemaskiner til Chrome. Understøtter gruppering af søgemaskiner, inkognito og meget mere."
   },
   "extName": {
      "description": "Extension's name. Use   instead of spaces.",
      "message": "Simple = Select + Search"
   },
   "importConfig": {
      "description": "",
      "message": "Importér"
   },
   "o_CrowdinContributors": {
      "description": "",
      "message": "Super fantastiske \u003Ca href='https://crowdin.com/project/simpleselectsearch' target='_blank'>Crowdin\u003C/a> bidragydere (oversættere)"
   },
   "o_GitHubContributors": {
      "description": "",
      "message": "Super fantastiske \u003Ca href='https://github.com/frenetix/SimpleSelectSearch' target='_blank'>GitHub\u003C/a> bidragydere"
   },
   "o_SupportThisHumble": {
      "description": "",
      "message": "Understøt denne ydmyge udvidelse-udvikler"
   },
   "o_SupportThisHumbleDescription": {
      "description": "",
      "message": "Denne udvidelse er naturligvis gratis - faktisk har jeg har lavet den for at bruge den selv... men hvis du er glad for  at bruge den og du ønsker at vise din påskønnelse er her en liste over ting, der kan gøre mig glad :)  \u003Cul>\u003Cli>\u003Cb>Vis mig pengene:\u003C/b> Tryk på \u003Cb>donate\u003C/b>-knappen nederst til venstre på denne side... og send mig et par kroner!\u003C/li>\u003Cli>\u003Cb>Brug udvalgte Amazon-links:\u003C/b> Brug et af Amazon-links'ne fra siden med valgmuligheder, find ting ved hjælp af min udvidelse og køb det! Hvis du har brugt en af mine links virker det ikke hvis du selv oprettede linket - det vil koste dig det samme og Amazon vil give mig en belønning! :D... og nævnte jeg at det ikke koster dig noget!?\u003C/li>\u003Cli>\u003Cb>Guerrilla markedsføring:\u003C/b> \u003Ca href=\"http://twitter.com/home?status=OMG! Jeg bruger Simple=Select+Search-udvidelsen i Chrome og det styrer! http://bit.ly/HzSP8p @frenetix_\" title=\"Klik for at sende denne side til Twitter!\" target=\"_blank\">Share on Twitter\u003C/a>, \u003Ca href=\"https://www.facebook.com/sharer/sharer.php?u=http%3A%2F%2Fbit.ly%2FHzSP8p\" target=\"_blank\">post på Facebook\u003C/a>, G+ eller hvor du synes den udvidelse vil blive godt modtaget\u003C/li>\u003Cli>\u003Cb>Mere guerilla markedsføring:\u003C/b> Besøge min blog og post et link til en af disse posts. G+ indlæg du synes om.\u003C/li>\u003Cli>\u003Cb>Øg mit selvværd:\u003C/b> Vurder udvidelsen på Googles webbutik og fortæl hvor meget du elsker den!\u003C/li>  \u003C/ul>"
   },
   "o_advancedConfig": {
      "description": "",
      "message": "Avanceret opsætning"
   },
   "o_areYouSure": {
      "description": "",
      "message": "Er du sikker?"
   },
   "o_cancel": {
      "description": "",
      "message": "Annuller"
   },
   "o_cannotAddDuplicates": {
      "description": "",
      "message": "Desværre, jeg kan ikke jeg tilføje poster med duplikerede navne."
   },
   "o_checkOutMyBlog": {
      "description": "",
      "message": "Tjek min blog for mere."
   },
   "o_confirmImport": {
      "description": "",
      "message": "Jeg vil prøve at analysere teksten på din import/eksport tekstboks... Hvis noget går galt... bare klik på *Fortryd sidste import* knappen. Jeg vil også anbefale at du gemmer en sikkerhedskopi af denne opsætning... for at være på den sikre side :)"
   },
   "o_confirmRestore": {
      "description": "",
      "message": "Jeg vil nu prøve at genoprette konfigurationen der blev gemt sidste gang du klikkede på *importér*-knappen"
   },
   "o_credits": {
      "description": "",
      "message": "Anerkendelser/Ansvarsfraskrivelse"
   },
   "o_developedBy": {
      "description": "",
      "message": "   Udviklet af \u003Ca href=\"https://plus.google.com/u/0/100927641416387074874/about\" target=\"_blank\">Diego Presno\u003C/a>. Følg mig på Twitter \u003Ca href=\"http://twitter.com/#!/frenetix_\" target=\"_blank\">@frenetix_\u003C/a>  \u003Cbr /> Alle billeder/ikoner designet af \u003Ca href=\"http://germanrivas.com/\" target=\"_blank\">germanrivas.com\u003C/a>.\u003Cbr/>\u003Cbr/>  \u003Ch2>Ansvarsfraskrivelse\u003C/h2> Vær venligst opmærksom på: brugen af denne udvidelse registreres af Google Analytics. Det registreres også hvilke søgemaskiner der er de mest anvendte af brugerne så jeg er i stand til at tilføje dem til listen med udvalgte søgemaskiner.\u003Cbr/>  Udvidelsen registrerer ikke brugerens identitet eller hvad de søger efter.  Kun søgningens URL-syntaks registreres.\u003Cbr/>  Ingen individuelle oplysninger vil blive delt med tredjepart. De eneste oplysninger der offentliggøres vil være om de mest anvendte websteder. Et eksempel på de offentliggjorte oplysninger kan findes på min \u003Ca href=\"http://simpleselectsearch.blogspot.com/\" target=\"_blank\">blog\u003C/a>."
   },
   "o_edit": {
      "description": "",
      "message": "Redigér"
   },
   "o_featuredSearchEngines": {
      "description": "",
      "message": "Udvalgte søgemaskiner"
   },
   "o_featuredSearchEngnesDesc": {
      "description": "",
      "message": "Klik på en URL for at medtage den i din søgemaskine-liste."
   },
   "o_first": {
      "description": "",
      "message": "Første"
   },
   "o_giveNewTabFocus": {
      "description": "",
      "message": "Giv nye fane fokus."
   },
   "o_group": {
      "description": "",
      "message": "Gruppe"
   },
   "o_groupBy": {
      "description": "",
      "message": "Gruppér efter:&nbsp;&nbsp;  "
   },
   "o_groupsUsed": {
      "description": "",
      "message": "Anvendte grupper"
   },
   "o_help": {
      "description": "",
      "message": "Hjælp"
   },
   "o_helpHowDoI": {
      "description": "",
      "message": "Hjælp! Hvordan redigerer jeg listen med søgemaskiner?"
   },
   "o_helpHowDoIDescription": {
      "description": "",
      "message": "Det er virkelig nemt!\u003Cbr/> Bare klik på en rækkes redigeringsikon (det med den lille blyant) eller bare klik på kolonnen \"navn\" og redigér dets værdier.  \u003Cul>    \u003Cli>\"Navn\"-kolonnen henviser til hvad du vil se i kontekstmenuen.\u003C/li>    \u003Cli>\"Søge-URL\" refererer til den forespørgsel søgemaskinen skal foretage.\u003C/li>    \u003Cli>\u003Cspan class=\"searchString\">%s\u003C/span> symbolet vil blive erstattet med den markerede tekst i din browser.\u003C/li>  \u003C/ul>  Du kan bestemme rækkefølgen af dine søgemaskiner ved at trække dem op og ned... gør det i kolonnen \"#\" hvor op og ned pilene vises. Musemarkøren ændres når du er over det rigtige sted og du vil kunne regne det ud.  \u003Ch2>Her er en enkel måde at oprette din egen søge-URL:\u003C/h2>  \u003Cul>\u003Cli>Foretag en søgning på dit foretrukne websted efter ordet \"TESTSØGNING\".\u003C/li>    \u003Cli>Derefter kopieres URL'en der blev generet - det ser måske ud som det eksempel på IMDB: http://www.imdb.com/find?s=all;q=\u003Cspan class=\"searchString\">TESTSØGNING\u003C/span>.\u003C/li>    \u003Cli>Herefter erstattes \u003Cspan class=\"searchString\">TESTSØGNING\u003C/span> med \u003Cspan class=\"searchString\">%s\u003C/span> og indsæt det i kolonnen \"Søge-URL\".\u003C/li>    \u003Cli>Derefter angives et navn til denne søge-URL og du er færdig!\u003C/li>  \u003C/ul>  Sørg for at checke først at siden du vil tilføje ikke findes på listen over udvalgte søgemaskiner. Jeg opdaterer tabellen fra tid til anden. Hvis du har forslag til denne liste er de mere end velkommne.  \u003Cbr/> \u003Cbr/> Du kan sortere URL'ernes rækkefølge ved at holde musen over første kolonne."
   },
   "o_helpMeTranslate": {
      "description": "",
      "message": "Hjælp mig med at oversætte!"
   },
   "o_importExport": {
      "description": "",
      "message": "Importér/Eksportér konfiguration"
   },
   "o_importExportDescription": {
      "description": "",
      "message": "Her er alle konfigurations-informationen. Bare kopier & gem den i en hvilken som helst tekstfil...\u003Cbr/> Hvis du ønsker at importere din tidligere gemte konfiguration bare indsæt den her og klik på importér-knappen.\u003Cbr/>\u003Cbr/>"
   },
   "o_importSuccesfull": {
      "description": "",
      "message": "Import succesfuld. Før genindlæsning af denne side skal du kontrollere din liste iver søgemaskiner for at sikre alt går godt. Hvis den er tom, så klik på *Fortryd sidste import* knappen."
   },
   "o_incognito": {
      "description": "",
      "message": "Inkognito"
   },
   "o_language": {
      "description": "",
      "message": "Sprog"
   },
   "o_last": {
      "description": "",
      "message": "Sidste"
   },
   "o_leavingThisCheckbox": {
      "description": "",
      "message": "Registrerede oplysninger bliver udelukkende brugt af mig til statistisk analyseformål.  \u003Cbr/>Ingen brugeroplysninger bliver registreret.  \u003Cbr/>Ingen søgetermer registreres (kun den søgemaskine der anvendes). Du kan læse mere om dette på \u003Ca href=\"http://simpleselectsearch.blogspot.com/\" target=\"_blank\">min blog\u003C/a>."
   },
   "o_moreSearchEngines": {
      "description": "",
      "message": "Flere søgemaskiner"
   },
   "o_mySearchEngines": {
      "description": "",
      "message": "Min søgemaskiner"
   },
   "o_mySearchEnginesDesc": {
      "description": "",
      "message": "Disse er dine konfigurerede søgemaskiner. Vælg andre søgemaskiner fra listen med udvalgte søgemaskiner nedenfor eller opret din egen. Se hjælp for instruktioner."
   },
   "o_name": {
      "description": "",
      "message": "Navn"
   },
   "o_new": {
      "description": "",
      "message": "ny"
   },
   "o_newTabPosition": {
      "description": "",
      "message": "Ny fanes position:"
   },
   "o_next": {
      "description": "",
      "message": "Næste"
   },
   "o_nothingToRestore": {
      "description": "",
      "message": "Desværre er der ikke noget at gendanne"
   },
   "o_ok": {
      "description": "",
      "message": "ok"
   },
   "o_openLinksInNewTab": {
      "description": "",
      "message": "Åbn links på ny fane."
   },
   "o_otherStuffYouCan": {
      "description": "",
      "message": "Andre ting du kan konfigurere"
   },
   "o_plusExplain": {
      "description": "",
      "message": "Plus versus mellemrum: nogle søgemaskiner anvender '+' i stedet for et mellemrum til at adskille ord du leder efter."
   },
   "o_previous": {
      "description": "",
      "message": "Tidligere"
   },
   "o_resetDefaultSuccess": {
      "description": "",
      "message": "Du har nu standardindstillingerne :)"
   },
   "o_restoreSuccesfull": {
      "description": "",
      "message": "Konfigurationen gemt før sidste import er netop genoprettet... hvis dette ikke hjælper kan du altid nulstille indstillingerne til standardindstillingerne med knappen på siden 'Avancerede indstillinger'... eller måske prøve og indlæse en tidligere backup af konfigurationen hvis du har lavet en tidligere ;)"
   },
   "o_searchEngines": {
      "description": "",
      "message": "Søgemaskiner"
   },
   "o_searchURL": {
      "description": "",
      "message": "Søge-URL"
   },
   "o_selectAURL": {
      "description": "",
      "message": "Vælg venligst en URL"
   },
   "o_showSearchEverywhere": {
      "description": "",
      "message": "Vis \"Søg overalt\" valgmulighed."
   },
   "o_showSearchEverywhereGroups": {
      "description": "",
      "message": "Vis \"Søg overalt\" valgmulighed inden for grupper."
   },
   "o_sort": {
      "description": "",
      "message": "Sortér"
   },
   "o_sortBy": {
      "description": "",
      "message": "Sortér efter:"
   },
   "o_supportMe": {
      "description": "",
      "message": "Støt mig :)"
   },
   "o_sureYouWantToDelete": {
      "description": "",
      "message": "Sikker på du vil slette denne række?"
   },
   "o_tabs": {
      "description": "",
      "message": "Faner"
   },
   "o_thankYou": {
      "description": "",
      "message": "Tak!"
   },
   "o_trackSearchEngines": {
      "description": "",
      "message": " Registrér brug af søgemaskiner."
   },
   "o_type": {
      "description": "",
      "message": "Type"
   },
   "o_ungrouped": {
      "description": "",
      "message": "Uden gruppe"
   },
   "undoLastImport": {
      "description": "",
      "message": "Fortryd sidste import"
   }
}
