00:00:00.356108 VirtualBox GUI VM Selector Window 6.1.38_Ubuntu r153438 linux.amd64 (Sep  7 2022 11:18:57) release log
00:00:00.356109 Log opened 2022-10-04T01:02:14.068265000Z
00:00:00.356110 Build Type: release
00:00:00.356113 OS Product: Linux
00:00:00.356113 OS Release: 5.15.0-48-generic
00:00:00.356114 OS Version: #54-Ubuntu SMP Fri Aug 26 13:26:29 UTC 2022
00:00:00.356132 DMI Product Name: 20VK001SUS
00:00:00.356135 DMI Product Version: ThinkPad L13 Yoga Gen 2
00:00:00.356141 Firmware type: UEFI
00:00:00.356492 Secure Boot: Disabled
00:00:00.356520 Host RAM: 15670MB (15.3GB) total, 13043MB (12.7GB) available
00:00:00.356524 Executable: /usr/lib/virtualbox/VirtualBox
00:00:00.356524 Process ID: 51823
00:00:00.356524 Package type: LINUX_64BITS_GENERIC (OSE)
00:00:00.356546 Qt version: 5.15.3
00:00:00.379632 GUI: UIMediumEnumerator: Medium-enumeration started...
00:00:00.636939 GUI: UIDesktopWidgetWatchdog::sltHandleHostScreenAvailableGeometryCalculated: Screen 0 work area is actually resized to: 0x0 x 1920x1040
00:00:00.640106 GUI: UIDesktopWidgetWatchdog::sltHandleHostScreenAvailableGeometryCalculated: Screen 1 work area is actually resized to: 1920x0 x 1920x1080
00:00:00.668346 GUI: UIMediumEnumerator: Medium-enumeration finished!
03:58:36.219250 GUI: UIMediumEnumerator: Medium-enumeration finished!
03:58:36.219276 Log rotated - Log started 2022-10-04T01:02:14.068265000Z
