[2022-09-29 19:35:45.516] [editsessions] [info] Skipping registering edit sessions actions as edit sessions are currently disabled. Set workbench.experimental.editSessions.enabled to enable edit sessions.
[2022-09-29 19:35:45.880] [editsessions] [info] Skipping registering edit sessions actions as edit sessions are currently disabled. Set workbench.experimental.editSessions.enabled to enable edit sessions.
[2022-09-29 19:37:14.124] [editsessions] [info] Skipping registering edit sessions actions as edit sessions are currently disabled. Set workbench.experimental.editSessions.enabled to enable edit sessions.
[2022-09-29 19:37:33.618] [editsessions] [info] Skipping registering edit sessions actions as edit sessions are currently disabled. Set workbench.experimental.editSessions.enabled to enable edit sessions.
[2022-10-01 15:27:10.726] [editsessions] [info] Skipping registering edit sessions actions as edit sessions are currently disabled. Set workbench.experimental.editSessions.enabled to enable edit sessions.
[2022-10-01 19:08:56.984] [editsessions] [info] Skipping registering edit sessions actions as edit sessions are currently disabled. Set workbench.experimental.editSessions.enabled to enable edit sessions.
