71:46:27.009242 nspr-2   Log continuation - Log started 2022-09-29T00:33:41.660603000Z
71:46:27.056429 nspr-8   Saving settings file "/home/ilimilku/.config/VirtualBox/VirtualBox.xml" with version "1.12-linux"
71:46:27.061812 nspr-5   Saving settings file "/home/ilimilku/.config/VirtualBox/VirtualBox.xml" with version "1.12-linux"
71:46:27.065851 nspr-3   Saving settings file "/home/ilimilku/.config/VirtualBox/VirtualBox.xml" with version "1.12-linux"
71:46:33.102251 main     VirtualBox: object deletion starts
71:46:33.103454 main     ERROR [COM]: aRC=VBOX_E_OBJECT_IN_USE (0x80bb000c) aIID={ad47ad09-787b-44ab-b343-a082a3f2dfb1} aComponent={MediumWrap} aText={Medium '/home/ilimilku/VirtualBox VMs/Windows 95/Windows 95.vdi' cannot be closed because it is still attached to 1 virtual machines}, preserve=false aResultDetail=0
71:46:33.107660 main     ERROR [COM]: aRC=VBOX_E_OBJECT_IN_USE (0x80bb000c) aIID={ad47ad09-787b-44ab-b343-a082a3f2dfb1} aComponent={MediumWrap} aText={Medium '/home/ilimilku/VirtualBox VMs/Windows 95 OSR 2.5/Windows 95 OSR 2.5-disk001.vdi' cannot be closed because it is still attached to 1 virtual machines}, preserve=false aResultDetail=0
71:46:33.113118 main     HostDnsMonitor: shutting down ...
71:46:33.128525 main     HostDnsMonitor: shut down
71:46:33.350811 Watcher  ERROR [COM]: aRC=E_ACCESSDENIED (0x80070005) aIID={d0a0163f-e254-4e5b-a1f2-011cf991c38d} aComponent={VirtualBoxWrap} aText={The object is not ready}, preserve=false aResultDetail=0
71:46:38.128717 main     {00007f7c1401a440} HostPowerServiceLinux::~HostPowerServiceLinux: RTThreadWait() for 5000 ms failed with VERR_TIMEOUT
71:46:38.143486 main     VirtualBox: object deleted
