00:00:00.342155 VirtualBox GUI VM Selector Window 6.1.38_Ubuntu r153438 linux.amd64 (Sep  7 2022 11:18:57) release log
00:00:00.342156 Log opened 2022-10-03T23:43:40.771952000Z
00:00:00.342157 Build Type: release
00:00:00.342160 OS Product: Linux
00:00:00.342160 OS Release: 5.15.0-48-generic
00:00:00.342161 OS Version: #54-Ubuntu SMP Fri Aug 26 13:26:29 UTC 2022
00:00:00.342178 DMI Product Name: 20VK001SUS
00:00:00.342181 DMI Product Version: ThinkPad L13 Yoga Gen 2
00:00:00.342186 Firmware type: UEFI
00:00:00.342535 Secure Boot: Disabled
00:00:00.342562 Host RAM: 15670MB (15.3GB) total, 14534MB (14.1GB) available
00:00:00.342566 Executable: /usr/lib/virtualbox/VirtualBox
00:00:00.342566 Process ID: 27857
00:00:00.342566 Package type: LINUX_64BITS_GENERIC (OSE)
00:00:00.342587 Qt version: 5.15.3
00:00:00.358145 GUI: UIMediumEnumerator: Medium-enumeration started...
00:00:00.602606 GUI: UIDesktopWidgetWatchdog::sltHandleHostScreenAvailableGeometryCalculated: Screen 0 work area is actually resized to: 0x0 x 1920x1040
00:00:00.605744 GUI: UIDesktopWidgetWatchdog::sltHandleHostScreenAvailableGeometryCalculated: Screen 1 work area is actually resized to: 1920x0 x 1920x1080
00:00:00.625088 GUI: UIMediumEnumerator: Medium-enumeration finished!
