00:00:00.387027 VirtualBox GUI VM Selector Window 6.1.38_Ubuntu r153438 linux.amd64 (Sep  7 2022 11:18:57) release log
00:00:00.387029 Log opened 2022-10-02T21:14:04.464234000Z
00:00:00.387029 Build Type: release
00:00:00.387032 OS Product: Linux
00:00:00.387032 OS Release: 5.15.0-48-generic
00:00:00.387033 OS Version: #54-Ubuntu SMP Fri Aug 26 13:26:29 UTC 2022
00:00:00.387049 DMI Product Name: 20VK001SUS
00:00:00.387052 DMI Product Version: ThinkPad L13 Yoga Gen 2
00:00:00.387057 Firmware type: UEFI
00:00:00.387417 Secure Boot: Disabled
00:00:00.387441 Host RAM: 15670MB (15.3GB) total, 13762MB (13.4GB) available
00:00:00.387444 Executable: /usr/lib/virtualbox/VirtualBox
00:00:00.387444 Process ID: 11130
00:00:00.387444 Package type: LINUX_64BITS_GENERIC (OSE)
00:00:00.387462 Qt version: 5.15.3
00:00:00.411730 GUI: UIMediumEnumerator: Medium-enumeration started...
00:00:00.715567 GUI: UIDesktopWidgetWatchdog::sltHandleHostScreenAvailableGeometryCalculated: Screen 0 work area is actually resized to: 0x0 x 1920x1040
00:00:00.718732 GUI: UIDesktopWidgetWatchdog::sltHandleHostScreenAvailableGeometryCalculated: Screen 1 work area is actually resized to: 1920x0 x 1920x1080
00:00:00.733930 GUI: UIMediumEnumerator: Medium-enumeration finished!
00:01:03.679951 GUI: UIMediumEnumerator: Medium with key={{e36ad210-369b-4c24-a552-bb0d68ac9a09}} created
00:01:03.736452 GUI: UIMediumEnumerator: Medium-enumeration finished!
00:01:37.320588 GUI: UIMediumEnumerator: Medium with key={{6febc8e3-adf4-493e-9fd6-28776e4f777c}} created
00:01:37.337568 GUI: UIMediumEnumerator: Medium-enumeration finished!
00:01:38.790909 GUI: UIMediumEnumerator: Medium-enumeration finished!
00:01:38.798864 GUI: UIMediumEnumerator: Medium-enumeration finished!
00:16:05.570754 GUI: UIMediumEnumerator: Medium-enumeration finished!
00:16:06.311737 GUI: UIMediumEnumerator: Medium-enumeration finished!
00:16:34.311884 GUI: UIMediumEnumerator: Medium-enumeration finished!
00:16:34.317907 GUI: UIMediumEnumerator: Medium-enumeration finished!
24:43:32.307279 GUI: UIMediumEnumerator: Medium-enumeration finished!
24:43:32.307298 Log rotated - Log started 2022-10-02T21:14:04.464234000Z
