{
    "workbench.colorTheme": "Material Theme",
    "workbench.startupEditor": "none",
    "workbench.editor.enablePreview": false,
    "editor.fontFamily": "Fira Code, Menlo, 'monospace', monospace",
    "editor.fontLigatures": true,
    "editor.bracketPairColorization.enabled": true,
    "haskell.manageHLS": "GHCup"
}