[Info  - 22:48:59.670] Reading sessions from secret storage...
[Info  - 22:48:59.678] Got 0 stored sessions
[Info  - 22:48:59.682] Getting sessions for the following scopes: email offline_access openid profile
[Trace  - 22:48:59.682] No session found with idtoken scopes... Using fallback scope list of: email offline_access openid profile
[Info  - 22:48:59.682] Got 0 sessions for scopes: email offline_access openid profile
