00:00:00.129796 VirtualBox GUI VM Selector Window 6.1.38_Ubuntu r153438 linux.amd64 (Sep  7 2022 11:18:57) release log
00:00:00.129798 Log opened 2022-10-04T00:07:41.476280000Z
00:00:00.129798 Build Type: release
00:00:00.129801 OS Product: Linux
00:00:00.129801 OS Release: 5.15.0-48-generic
00:00:00.129802 OS Version: #54-Ubuntu SMP Fri Aug 26 13:26:29 UTC 2022
00:00:00.129819 DMI Product Name: 20VK001SUS
00:00:00.129822 DMI Product Version: ThinkPad L13 Yoga Gen 2
00:00:00.129828 Firmware type: UEFI
00:00:00.130181 Secure Boot: Disabled
00:00:00.130207 Host RAM: 15670MB (15.3GB) total, 12228MB (11.9GB) available
00:00:00.130210 Executable: /usr/lib/virtualbox/VirtualBox
00:00:00.130211 Process ID: 32791
00:00:00.130211 Package type: LINUX_64BITS_GENERIC (OSE)
00:00:00.130234 Qt version: 5.15.3
00:00:00.154112 GUI: UIMediumEnumerator: Medium-enumeration started...
00:00:00.419006 GUI: UIDesktopWidgetWatchdog::sltHandleHostScreenAvailableGeometryCalculated: Screen 0 work area is actually resized to: 0x0 x 1920x1040
00:00:00.421802 GUI: UIDesktopWidgetWatchdog::sltHandleHostScreenAvailableGeometryCalculated: Screen 1 work area is actually resized to: 1920x0 x 1920x1080
00:00:00.438128 GUI: UIMediumEnumerator: Medium-enumeration finished!
00:33:13.076642 GUI: UIMediumEnumerator: Medium-enumeration finished!
00:33:17.663250 GUI: UICommon::sltHandleCommitDataRequest: Emergency shutdown initiated
