{
   "appDesc": {
      "description": "The description of the application, as shown on the web store.",
      "message": "Re-implimentuje tlačítka \"Zobrazit obrázek\" and \"Vyhledat podle obrázku\" na vyhledávači Google."
   },
   "appName": {
      "description": "Title of the application, displayed on the web store.",
      "message": "View image"
   },
   "optionsButton": {
      "description": "Text displayed on the link to options button.",
      "message": "Možnosti"
   },
   "resetButton": {
      "description": "Text displayed on reset button.",
      "message": "Resetovat"
   },
   "searchImage": {
      "description": "Button leads to google, search by image page.",
      "message": "Vyhledat podle obrázku"
   },
   "settingsToggle_NewTab_viewImage": {
      "description": "Settings toggle which causes images to open in new tab.",
      "message": "Otevřít obrázek na nové záložce:"
   },
   "viewImage": {
      "description": "Button for viewing image.",
      "message": "Zobrazit obrázek"
   }
}
