00:00:00.365414 VirtualBox GUI VM Selector Window 6.1.38_Ubuntu r153438 linux.amd64 (Sep  7 2022 11:18:57) release log
00:00:00.365415 Log opened 2022-09-29T00:33:41.902720000Z
00:00:00.365416 Build Type: release
00:00:00.365419 OS Product: Linux
00:00:00.365419 OS Release: 5.15.0-48-generic
00:00:00.365419 OS Version: #54-Ubuntu SMP Fri Aug 26 13:26:29 UTC 2022
00:00:00.365435 DMI Product Name: 20VK001SUS
00:00:00.365438 DMI Product Version: ThinkPad L13 Yoga Gen 2
00:00:00.365443 Firmware type: UEFI
00:00:00.365833 Secure Boot: Disabled
00:00:00.365858 Host RAM: 15670MB (15.3GB) total, 14739MB (14.3GB) available
00:00:00.365861 Executable: /usr/lib/virtualbox/VirtualBox
00:00:00.365861 Process ID: 2427
00:00:00.365862 Package type: LINUX_64BITS_GENERIC (OSE)
00:00:00.365879 Qt version: 5.15.3
00:00:00.382565 GUI: UIMediumEnumerator: Medium-enumeration started...
00:00:00.695993 GUI: UIDesktopWidgetWatchdog::sltHandleHostScreenAvailableGeometryCalculated: Screen 0 work area is actually resized to: 0x0 x 1920x1040
00:00:00.698935 GUI: UIDesktopWidgetWatchdog::sltHandleHostScreenAvailableGeometryCalculated: Screen 1 work area is actually resized to: 1920x0 x 1920x1080
00:00:00.718116 GUI: UIMediumEnumerator: Medium-enumeration finished!
00:05:58.653702 GUI: UIDesktopWidgetWatchdog::sltHandleHostScreenResized: Screen 1 is formally resized to: 3840x0 x 1920x1080
00:05:58.656910 GUI: UIDesktopWidgetWatchdog::sltHandleHostScreenWorkAreaResized: Screen 1 work area is formally resized to: 0x0 x 0x0
00:05:58.659354 GUI: UIDesktopWidgetWatchdog::sltHandleHostScreenWorkAreaResized: Screen 0 work area is formally resized to: 0x0 x 1920x1040
00:05:58.662088 GUI: UIDesktopWidgetWatchdog::sltHandleHostScreenWorkAreaResized: Screen 2 work area is formally resized to: 1920x0 x 1920x1040
00:05:58.899001 GUI: UIDesktopWidgetWatchdog::sltHandleHostScreenAvailableGeometryCalculated: Screen 1 work area is actually resized to: 3840x0 x 1920x1080
00:05:58.908312 GUI: UIDesktopWidgetWatchdog::sltHandleHostScreenAvailableGeometryCalculated: Screen 0 work area is actually resized to: 0x0 x 1920x1040
00:05:58.915779 GUI: UIDesktopWidgetWatchdog::sltHandleHostScreenAvailableGeometryCalculated: Screen 2 work area is actually resized to: 1920x0 x 1920x1080
00:05:58.920422 GUI: UIDesktopWidgetWatchdog::sltHandleHostScreenWorkAreaResized: Screen 1 work area is formally resized to: 3840x0 x 1920x1040
00:05:58.971534 GUI: UIDesktopWidgetWatchdog::sltHandleHostScreenAvailableGeometryCalculated: Screen 1 work area is actually resized to: 3840x0 x 1920x1080
00:06:10.321855 GUI: UIDesktopWidgetWatchdog::sltHandleHostScreenResized: Screen 0 is formally resized to: 0x0 x 1920x1080
00:06:10.325411 GUI: UIDesktopWidgetWatchdog::sltHandleHostScreenWorkAreaResized: Screen 0 work area is formally resized to: 0x0 x 1920x1040
00:06:10.488876 GUI: UIDesktopWidgetWatchdog::sltHandleHostScreenAvailableGeometryCalculated: Screen 1 work area is actually resized to: 1920x0 x 1920x1080
00:06:10.498241 GUI: UIDesktopWidgetWatchdog::sltHandleHostScreenAvailableGeometryCalculated: Screen 0 work area is actually resized to: 0x0 x 1920x1040
00:06:16.017768 GUI: UIDesktopWidgetWatchdog::sltHandleHostScreenResized: Screen 1 is formally resized to: 3840x0 x 1920x1080
00:06:16.020875 GUI: UIDesktopWidgetWatchdog::sltHandleHostScreenWorkAreaResized: Screen 1 work area is formally resized to: 0x0 x 0x0
00:06:16.023808 GUI: UIDesktopWidgetWatchdog::sltHandleHostScreenWorkAreaResized: Screen 0 work area is formally resized to: 0x0 x 1920x1040
00:06:16.254123 GUI: UIDesktopWidgetWatchdog::sltHandleHostScreenAvailableGeometryCalculated: Screen 2 work area is actually resized to: 1920x0 x 1920x1080
00:06:16.262049 GUI: UIDesktopWidgetWatchdog::sltHandleHostScreenAvailableGeometryCalculated: Screen 1 work area is actually resized to: 3840x0 x 1920x1080
00:06:16.268083 GUI: UIDesktopWidgetWatchdog::sltHandleHostScreenAvailableGeometryCalculated: Screen 0 work area is actually resized to: 0x0 x 1920x1040
00:06:16.275268 GUI: UIDesktopWidgetWatchdog::sltHandleHostScreenWorkAreaResized: Screen 1 work area is formally resized to: 3840x0 x 1920x1040
00:06:16.324180 GUI: UIDesktopWidgetWatchdog::sltHandleHostScreenAvailableGeometryCalculated: Screen 1 work area is actually resized to: 3840x0 x 1920x1080
00:10:47.752086 GUI: UIMediumEnumerator: Medium-enumeration finished!
00:10:47.775295 GUI: UIMediumEnumerator: Medium-enumeration finished!
00:11:59.493431 GUI: UIMediumEnumerator: Medium-enumeration finished!
00:12:00.041011 GUI: UIMediumEnumerator: Medium-enumeration finished!
00:18:10.837002 GUI: UIMediumEnumerator: Medium-enumeration finished!
00:19:34.571474 GUI: UIMediumEnumerator: Medium with key={{d40b6d7f-f84c-4eed-9724-ad21f1a73d7f}} created
00:19:34.587598 GUI: UIMediumEnumerator: Medium-enumeration finished!
00:19:36.402805 GUI: UIMediumEnumerator: Medium-enumeration finished!
00:19:36.437570 GUI: UIMediumEnumerator: Medium-enumeration finished!
00:20:32.424057 GUI: UIMediumEnumerator: Medium-enumeration finished!
00:20:32.499328 GUI: UIMediumEnumerator: Medium-enumeration finished!
00:21:23.035319 GUI: UIMediumEnumerator: Medium-enumeration finished!
00:21:23.172678 GUI: UIMediumEnumerator: Medium-enumeration finished!
00:23:36.716590 GUI: UIMediumEnumerator: Medium-enumeration finished!
00:23:36.775566 GUI: UIMediumEnumerator: Medium-enumeration finished!
00:24:51.229407 GUI: UIMediumEnumerator: Medium-enumeration finished!
00:25:48.610692 GUI: UIMediumEnumerator: Medium-enumeration finished!
00:34:02.424237 GUI: UIMediumEnumerator: Medium-enumeration started...
00:34:02.426528 GUI: UIMediumEnumerator: Medium-enumeration finished!
00:34:30.094063 GUI: UIMediumEnumerator: Medium with key={{3b39060c-e3ee-4e75-94cd-14ad9fdb62e6}} created
00:34:30.110593 GUI: UIMediumEnumerator: Medium-enumeration finished!
00:34:35.238369 GUI: UIMediumEnumerator: Medium-enumeration finished!
00:34:35.245223 GUI: UIMediumEnumerator: Medium-enumeration finished!
00:39:22.404690 GUI: UIMediumEnumerator: Medium-enumeration finished!
00:39:36.934864 GUI: UIMediumEnumerator: Medium-enumeration finished!
00:39:36.942083 GUI: UIMediumEnumerator: Medium-enumeration finished!
00:40:17.710301 GUI: UIMediumEnumerator: Medium-enumeration finished!
00:41:33.430940 GUI: UIMediumEnumerator: Medium-enumeration finished!
00:41:33.437667 GUI: UIMediumEnumerator: Medium-enumeration finished!
00:42:25.609290 GUI: UIMediumEnumerator: Medium with key={{15f2c334-d42d-4630-88e6-b3d14d277daa}} created
00:42:25.628156 GUI: UIMediumEnumerator: Medium-enumeration finished!
00:43:14.455252 GUI: UIMediumEnumerator: Medium-enumeration finished!
00:43:14.465315 GUI: UIMediumEnumerator: Medium-enumeration finished!
00:44:56.014889 GUI: UIMediumEnumerator: Medium-enumeration finished!
00:44:56.027497 GUI: UIMediumEnumerator: Medium-enumeration finished!
00:53:49.045643 GUI: UIMediumEnumerator: Medium-enumeration finished!
00:53:57.133616 GUI: UIDesktopWidgetWatchdog::sltHandleHostScreenResized: Screen 0 is formally resized to: 0x0 x 1920x1080
00:53:57.137026 GUI: UIDesktopWidgetWatchdog::sltHandleHostScreenWorkAreaResized: Screen 0 work area is formally resized to: 0x0 x 1920x1040
00:53:57.869688 GUI: UIDesktopWidgetWatchdog::sltHandleHostScreenAvailableGeometryCalculated: Screen 1 work area is actually resized to: 1920x0 x 1920x1080
00:53:57.877631 GUI: UIDesktopWidgetWatchdog::sltHandleHostScreenAvailableGeometryCalculated: Screen 0 work area is actually resized to: 0x0 x 1920x1040
67:11:26.071680 GUI: UIDesktopWidgetWatchdog::sltHandleHostScreenResized: Screen 2 is formally resized to: 3840x0 x 1920x1080
67:11:26.073424 Log rotated - Log started 2022-09-29T00:33:41.902720000Z
