module github.com/wunderio/csi-rclone

go 1.19

require (
	github.com/container-storage-interface/spec v1.6.0
	github.com/davecgh/go-spew v1.1.1 // indirect
	github.com/docker/distribution v2.7.1+incompatible // indirect
	github.com/gogo/protobuf v1.2.1 // indirect
	github.com/golang/glog v1.0.0
	github.com/golang/groupcache v0.0.0-20190129154638-5b532d6fd5ef // indirect
	github.com/google/btree v0.0.0-20180813153112-4030bb1f1f0c // indirect
	github.com/google/gofuzz v0.0.0-20170612174753-24818f796faf // indirect
	github.com/googleapis/gnostic v0.2.0 // indirect
	github.com/gregjones/httpcache v0.0.0-20190212212710-3befbb6ad0cc // indirect
	github.com/hashicorp/golang-lru v0.5.0 // indirect
	github.com/imdario/mergo v0.3.7 // indirect
	github.com/json-iterator/go v1.1.5 // indirect
	github.com/kubernetes-csi/csi-lib-utils v0.3.1 // indirect
	github.com/kubernetes-csi/drivers v1.0.2
	github.com/modern-go/concurrent v0.0.0-20180306012644-bacd9c7ef1dd // indirect
	github.com/modern-go/reflect2 v1.0.1 // indirect
	github.com/onsi/ginkgo v1.7.0 // indirect
	github.com/onsi/gomega v1.4.3 // indirect
	github.com/opencontainers/go-digest v1.0.0-rc1 // indirect
	github.com/pborman/uuid v1.2.0 // indirect
	github.com/peterbourgon/diskv v2.0.1+incompatible // indirect
	github.com/prometheus/client_golang v0.9.2 // indirect
	github.com/spf13/afero v1.2.1 // indirect
	github.com/spf13/cobra v1.6.0
	github.com/stretchr/objx v0.1.1 // indirect
	github.com/stretchr/testify v1.3.0 // indirect
	golang.org/x/net v0.1.0
	golang.org/x/time v0.0.0-20181108054448-85acf8d2951c // indirect
	google.golang.org/grpc v1.50.1
	gopkg.in/inf.v0 v0.9.1 // indirect
	gopkg.in/yaml.v2 v2.2.2 // indirect
	k8s.io/api v0.25.3
	k8s.io/apiextensions-apiserver v0.0.0-20190111034747-7d26de67f177 // indirect
	k8s.io/apimachinery v0.25.3
	k8s.io/apiserver v0.0.0-20190111033246-d50e9ac5404f // indirect
	k8s.io/client-go v12.0.0
	k8s.io/cloud-provider v0.0.0-20190223141949-e954a34baf43 // indirect
	k8s.io/csi-api v0.0.0-20190223140843-b4e64dae0b19 // indirect
	k8s.io/klog v1.0.0
	k8s.io/klog/v2 v2.80.1
	k8s.io/kube-openapi v0.0.0-20190222203931-aa8624f5a2df // indirect
	k8s.io/kubernetes v1.25.3
	k8s.io/utils v0.0.0-20190221042446-c2654d5206da // indirect
	sigs.k8s.io/yaml v1.1.0 // indirect
)
