{
    "_cId": "c90ea2f17af6594d9c8a06c0812cef72",
    "links": [
        {
            "href": "https://an-appian-instance.host.net/suite/rest/a/sites/latest/D6JMim/pages/reports/interface",
            "rel": "update",
            "title": "Update"
        },
        {
            "href": "https://an-appian-instance.host.net/suite/rest/a/sites/latest/D6JMim/pages/reports/interface",
            "rel": "self",
            "method": "POST"
        }
    ],
    "actions": [
        {
            "_cId": "8333cdbab40a98c14806ddac91e84583",
            "_actionName": "sail:record-action-trigger",
            "label": "",
            "saveInto": [
                "<<jA0EAwMC4vUltOXyxq4B0nkBPe5t8hoZI/NoMRt9WV63tV8rhHSZAWyac1m1j7oXIGoLHQEloQDY\r\nGh0rIZ8Bl6597kYq2OdBGE6AYCkbea296K926e+UX+nujQcuA4b86wCe8nFsjXiTAIOkENb5aXiX\r\njDAFrJND/kQrYRnXYMvrQaytxxUKGjdU\r\n>>"
            ],
            "tooltip": "",
            "href": "",
            "#t": "DynamicLink"
        },
        {
            "_cId": "4713416ca9ec5e98a7be1d09b03bc84f",
            "_actionName": "sail:update-form-factor",
            "label": "",
            "saveInto": [
                "<<jA0EAwMC4vUltOXyxq4B0n0BPe5t8hoZI/NoMRt9WV63tV8rhHSZAWyaGF6lj7oXIGrZbIkEHWpK\r\nqmAnR1+RR2jx8loec34ZVjTTgtTe2/IqSkPkh7ZEZ75KToWvzXWtP9IyKOyadLAqvBdsgONdsKGK\r\nqEug9OvN0O0c1aQYgfguI2fudaC8RNNyCVX8sA==\r\n>>"
            ],
            "tooltip": "",
            "href": "",
            "#t": "DynamicLink"
        },
        {
            "_cId": "44a7926bb6f6110edd4075eab3f01b36",
            "_actionName": "sail:toggle-sites-xray",
            "label": "",
            "saveInto": [
                "<<jA0EAwMC4vUltOXyxq4B0nkBPe5t8hoZI/NoMRt9WV63tV8rhHSZAWyac1m1j7oXIGoLHQEloQDY\r\nGh0rIZ8Bl6597kYq2OdBGE6AYCkbea296K926e+UX+nujQcuA4b87gfzgRH/kbQrsVYQZlBTc4w4\r\n/OZvu2xArmRhbjzZKIRd/tiWGaSMAEPL\r\n>>"
            ],
            "tooltip": "",
            "href": "",
            "#t": "DynamicLink"
        }
    ],
    "triggers": [],
    "ui": {
        "_cId": "3d40c6df4b1e48bfc9a8745d53bf3362",
        "_dirty": "false",
        "contents": [
            {
                "_cId": "0.07346607135542593",
                "uri": "",
                "#t": "GWTPlaceWidget"
            }
        ],
        "padding": "NONE",
        "topLevelBackgroundColor": "",
        "#t": "ContentLayout"
    },
    "context": {
        "type": "stateful",
        "value": "jA0EAwMC4vUltOXyxq4B0q0B46A0dmnFT/vHP9yjymhwmZbPw4uQpspeaTDIf3nx2KytjZELa4+Y\r\nSgftdAofee5N+JoXFFkhpnNJj1PHVusKWBxyLsIkcB4NJ7ltSNfHSI6VPLCD/WopUP6QUiET0fOS\r\nggf0eB7MBc/6pXOsB4hmPInl0slaBCaXVGxQl5W/1QufaunVM6ZB/hReYhSIYpCq5febjS/DNCrr\r\ns4t78XQIu+aiYGDMDDIRha5nLA==\r\n",
        "#t": "Map"
    },
    "uuid": "90ebb4cc-b528-401a-9eca-2ba32ab10aac",
    "i18nInfo": {
        "locale": "en-US",
        "timezoneId": "US/Eastern",
        "calendarId": "gregorian",
        "decimalSeparator": ".",
        "groupingSeparator": ",",
        "isRtl": false
    },
    "timers": {
        "#t": "Dictionary"
    },
    "formFactors": [],
    "lastEvaluatedFormFactor": "DESKTOP",
    "uiExpression": "",
    "#t": "UiConfig",
    "#s": {
        "#v": [
            {
                "id": 4948,
                "uuid": "{http://www.appian.com/ae/types/2009}DynamicLink",
                "namespace": "http://www.appian.com/ae/types/2009",
                "localPart": "DynamicLink",
                "description": "",
                "base": 4332,
                "foundation": 95,
                "typeof": 4948,
                "list": 4949,
                "flags": 12,
                "instanceProperties": [
                    {
                        "name": "@attributes",
                        "value": {
                            "#t": 4952
                        }
                    },
                    {
                        "name": "label",
                        "value": {
                            "#t": "string"
                        }
                    },
                    {
                        "name": "value",
                        "value": {
                            "#t": "Variant"
                        }
                    },
                    {
                        "name": "saveInto",
                        "value": {
                            "#t": "Save?list"
                        }
                    },
                    {
                        "name": "actions",
                        "value": {
                            "#t": "Variant?list"
                        }
                    },
                    {
                        "name": "tooltip",
                        "value": {
                            "#t": "string"
                        }
                    },
                    {
                        "name": "href",
                        "value": {
                            "#t": "string"
                        }
                    },
                    {
                        "name": "icon",
                        "value": {
                            "#t": "RichTextFontAwesomeIcon"
                        }
                    },
                    {
                        "name": "disabled",
                        "value": {
                            "#t": "boolean"
                        }
                    }
                ],
                "typeProperties": [
                    {
                        "name": "namespaces",
                        "value": {
                            "#v": [
                                "http://www.appian.com/ae/types/internal",
                                "http://www.appian.com/ae/types/2009",
                                "http://www.appian.com/ae/types/2009",
                                "http://www.appian.com/ae/types/2009",
                                "http://www.appian.com/ae/types/2009",
                                "http://www.appian.com/ae/types/2009",
                                "http://www.appian.com/ae/types/2009",
                                "http://www.appian.com/ae/types/2009",
                                "http://www.appian.com/ae/types/2009"
                            ],
                            "#t": "Text?list"
                        }
                    },
                    {
                        "name": "isNillable",
                        "value": {
                            "#v": [
                                false,
                                false,
                                false,
                                true,
                                false,
                                false,
                                false,
                                false,
                                false
                            ],
                            "#t": "Boolean?list"
                        }
                    }
                ],
                "listViewMapping": ""
            },
            {
                "id": 4952,
                "uuid": "{http://www.appian.com/ae/types/2009}",
                "namespace": "http://www.appian.com/ae/types/2009",
                "localPart": "",
                "description": "Attributes record for type 4948 (DynamicLink)",
                "base": 95,
                "foundation": 95,
                "typeof": 4952,
                "list": 4953,
                "flags": 12,
                "instanceProperties": [
                    {
                        "name": "@anyAttribute",
                        "value": {
                            "#t": "Dictionary"
                        }
                    },
                    {
                        "name": "@nil",
                        "value": {
                            "#t": "boolean"
                        }
                    }
                ],
                "typeProperties": [
                    {
                        "name": "namespaces",
                        "value": {
                            "#v": [
                                "http://www.appian.com/ae/types/internal",
                                "http://www.appian.com/ae/types/internal"
                            ],
                            "#t": "Text?list"
                        }
                    },
                    {
                        "name": "autoGenerated",
                        "value": {
                            "#v": true,
                            "#t": "boolean"
                        }
                    }
                ],
                "listViewMapping": ""
            },
            {
                "id": 97,
                "uuid": "{http://www.appian.com/ae/types/2009}Variant",
                "namespace": "http://www.appian.com/ae/types/2009",
                "localPart": "Variant",
                "description": "Any type and value.",
                "base": 97,
                "foundation": 97,
                "typeof": 97,
                "list": 197,
                "flags": 12,
                "instanceProperties": [
                    {
                        "name": "data",
                        "value": {
                            "#t": "Variant"
                        }
                    },
                    {
                        "name": "type",
                        "value": {
                            "#t": "int"
                        }
                    }
                ],
                "typeProperties": [],
                "listViewMapping": ""
            },
            {
                "id": 193,
                "uuid": "{http://www.appian.com/ae/types/2009}Save?list",
                "namespace": "http://www.appian.com/ae/types/2009",
                "localPart": "Save?list",
                "description": "List of Save",
                "base": 93,
                "foundation": 93,
                "typeof": 192,
                "flags": 12,
                "instanceProperties": [],
                "typeProperties": [],
                "listViewMapping": ""
            },
            {
                "id": 197,
                "uuid": "{http://www.appian.com/ae/types/2009}Variant?list",
                "namespace": "http://www.appian.com/ae/types/2009",
                "localPart": "Variant?list",
                "description": "List of Variant",
                "base": 93,
                "foundation": 93,
                "typeof": 97,
                "flags": 12,
                "instanceProperties": [],
                "typeProperties": [],
                "listViewMapping": ""
            },
            {
                "id": 8084,
                "uuid": "{http://www.appian.com/ae/types/2009}RichTextFontAwesomeIcon",
                "namespace": "http://www.appian.com/ae/types/2009",
                "localPart": "RichTextFontAwesomeIcon",
                "description": "",
                "base": 4332,
                "foundation": 95,
                "typeof": 8084,
                "list": 8085,
                "flags": 12,
                "instanceProperties": [
                    {
                        "name": "@attributes",
                        "value": {
                            "#t": 8116
                        }
                    },
                    {
                        "name": "iconId",
                        "value": {
                            "#t": "string"
                        }
                    },
                    {
                        "name": "icon",
                        "value": {
                            "#t": "string"
                        }
                    },
                    {
                        "name": "size",
                        "value": {
                            "#t": "int"
                        }
                    },
                    {
                        "name": "color",
                        "value": {
                            "#t": "string"
                        }
                    },
                    {
                        "name": "flip",
                        "value": {
                            "#t": "boolean"
                        }
                    },
                    {
                        "name": "actions",
                        "value": {
                            "#t": "Variant?list"
                        }
                    }
                ],
                "typeProperties": [
                    {
                        "name": "namespaces",
                        "value": {
                            "#v": [
                                "http://www.appian.com/ae/types/internal",
                                "http://www.appian.com/ae/types/2009",
                                "http://www.appian.com/ae/types/2009",
                                "http://www.appian.com/ae/types/2009",
                                "http://www.appian.com/ae/types/2009",
                                "http://www.appian.com/ae/types/2009",
                                "http://www.appian.com/ae/types/2009"
                            ],
                            "#t": "Text?list"
                        }
                    },
                    {
                        "name": "isNillable",
                        "value": {
                            "#v": [
                                false,
                                false,
                                false,
                                false,
                                false,
                                false,
                                false
                            ],
                            "#t": "Boolean?list"
                        }
                    }
                ],
                "listViewMapping": ""
            },
            {
                "id": 4949,
                "uuid": "{http://www.appian.com/ae/types/2009}DynamicLink?list",
                "namespace": "http://www.appian.com/ae/types/2009",
                "localPart": "DynamicLink?list",
                "description": "List of DynamicLink",
                "base": 93,
                "foundation": 93,
                "typeof": 4948,
                "flags": 8,
                "instanceProperties": [],
                "typeProperties": [
                    {
                        "name": "autoGenerated",
                        "value": {
                            "#v": true,
                            "#t": "boolean"
                        }
                    }
                ],
                "listViewMapping": ""
            },
            {
                "id": 4332,
                "uuid": "{http://www.appian.com/ae/types/2009}Component",
                "namespace": "http://www.appian.com/ae/types/2009",
                "localPart": "Component",
                "description": "",
                "base": 95,
                "foundation": 95,
                "typeof": 4332,
                "list": 4333,
                "flags": 12,
                "instanceProperties": [
                    {
                        "name": "@attributes",
                        "value": {
                            "#t": 4336
                        }
                    }
                ],
                "typeProperties": [
                    {
                        "name": "namespaces",
                        "value": {
                            "#v": [
                                "http://www.appian.com/ae/types/internal"
                            ],
                            "#t": "Text?list"
                        }
                    },
                    {
                        "name": "isNillable",
                        "value": {
                            "#v": [
                                false
                            ],
                            "#t": "Boolean?list"
                        }
                    }
                ],
                "listViewMapping": ""
            },
            {
                "id": 94,
                "uuid": "{http://www.appian.com/ae/types/2009}Dictionary",
                "namespace": "http://www.appian.com/ae/types/2009",
                "localPart": "Dictionary",
                "description": "Dictionary is mapping of keys to values.",
                "base": 94,
                "foundation": 94,
                "typeof": 97,
                "list": 194,
                "flags": 12,
                "instanceProperties": [],
                "typeProperties": [],
                "listViewMapping": ""
            },
            {
                "id": 4953,
                "uuid": "{http://www.appian.com/ae/types/2009}",
                "namespace": "http://www.appian.com/ae/types/2009",
                "localPart": "",
                "description": "List of ",
                "base": 93,
                "foundation": 93,
                "typeof": 4952,
                "flags": 12,
                "instanceProperties": [],
                "typeProperties": [
                    {
                        "name": "autoGenerated",
                        "value": {
                            "#v": true,
                            "#t": "boolean"
                        }
                    }
                ],
                "listViewMapping": ""
            },
            {
                "id": 95,
                "uuid": "{http://www.appian.com/ae/types/2009}Record",
                "namespace": "http://www.appian.com/ae/types/2009",
                "localPart": "Record",
                "description": "Record is a list of named values.",
                "base": 95,
                "foundation": 95,
                "typeof": 0,
                "list": 195,
                "flags": 12,
                "instanceProperties": [],
                "typeProperties": [],
                "listViewMapping": ""
            },
            {
                "id": 103,
                "uuid": "{http://www.appian.com/ae/types/2009}Text?list",
                "namespace": "http://www.appian.com/ae/types/2009",
                "localPart": "Text?list",
                "description": "List of Text String",
                "base": 93,
                "foundation": 93,
                "typeof": 3,
                "flags": 8,
                "instanceProperties": [],
                "typeProperties": [],
                "listViewMapping": ""
            },
            {
                "id": 192,
                "uuid": "{http://www.appian.com/ae/types/2009}Save",
                "namespace": "http://www.appian.com/ae/types/2009",
                "localPart": "Save",
                "description": "A Save specifies the variables where end user values are saved. Values may be modified prior to saving by using the << operator. This applies to SAIL components.",
                "base": 3,
                "foundation": 3,
                "typeof": 192,
                "list": 193,
                "flags": 12,
                "instanceProperties": [],
                "typeProperties": [],
                "listViewMapping": ""
            },
            {
                "id": 8116,
                "uuid": "{http://www.appian.com/ae/types/2009}",
                "namespace": "http://www.appian.com/ae/types/2009",
                "localPart": "",
                "description": "Attributes record for type 8084 (RichTextFontAwesomeIcon)",
                "base": 95,
                "foundation": 95,
                "typeof": 8116,
                "list": 8117,
                "flags": 12,
                "instanceProperties": [
                    {
                        "name": "@anyAttribute",
                        "value": {
                            "#t": "Dictionary"
                        }
                    },
                    {
                        "name": "@nil",
                        "value": {
                            "#t": "boolean"
                        }
                    }
                ],
                "typeProperties": [
                    {
                        "name": "namespaces",
                        "value": {
                            "#v": [
                                "http://www.appian.com/ae/types/internal",
                                "http://www.appian.com/ae/types/internal"
                            ],
                            "#t": "Text?list"
                        }
                    },
                    {
                        "name": "autoGenerated",
                        "value": {
                            "#v": true,
                            "#t": "boolean"
                        }
                    }
                ],
                "listViewMapping": ""
            },
            {
                "id": 8085,
                "uuid": "{http://www.appian.com/ae/types/2009}RichTextFontAwesomeIcon?list",
                "namespace": "http://www.appian.com/ae/types/2009",
                "localPart": "RichTextFontAwesomeIcon?list",
                "description": "List of RichTextFontAwesomeIcon",
                "base": 93,
                "foundation": 93,
                "typeof": 8084,
                "flags": 8,
                "instanceProperties": [],
                "typeProperties": [
                    {
                        "name": "autoGenerated",
                        "value": {
                            "#v": true,
                            "#t": "boolean"
                        }
                    }
                ],
                "listViewMapping": ""
            },
            {
                "id": 126,
                "uuid": "{http://www.appian.com/ae/types/2009}Boolean?list",
                "namespace": "http://www.appian.com/ae/types/2009",
                "localPart": "Boolean?list",
                "description": "List of Boolean",
                "base": 93,
                "foundation": 93,
                "typeof": 26,
                "flags": 8,
                "instanceProperties": [],
                "typeProperties": [],
                "listViewMapping": ""
            },
            {
                "id": 4336,
                "uuid": "{http://www.appian.com/ae/types/2009}",
                "namespace": "http://www.appian.com/ae/types/2009",
                "localPart": "",
                "description": "Attributes record for type 4332 (Component)",
                "base": 95,
                "foundation": 95,
                "typeof": 4336,
                "list": 4337,
                "flags": 12,
                "instanceProperties": [
                    {
                        "name": "@anyAttribute",
                        "value": {
                            "#t": "Dictionary"
                        }
                    },
                    {
                        "name": "@nil",
                        "value": {
                            "#t": "boolean"
                        }
                    }
                ],
                "typeProperties": [
                    {
                        "name": "namespaces",
                        "value": {
                            "#v": [
                                "http://www.appian.com/ae/types/internal",
                                "http://www.appian.com/ae/types/internal"
                            ],
                            "#t": "Text?list"
                        }
                    },
                    {
                        "name": "autoGenerated",
                        "value": {
                            "#v": true,
                            "#t": "boolean"
                        }
                    }
                ],
                "listViewMapping": ""
            },
            {
                "id": 4333,
                "uuid": "{http://www.appian.com/ae/types/2009}Component?list",
                "namespace": "http://www.appian.com/ae/types/2009",
                "localPart": "Component?list",
                "description": "List of Component",
                "base": 93,
                "foundation": 93,
                "typeof": 4332,
                "flags": 8,
                "instanceProperties": [],
                "typeProperties": [
                    {
                        "name": "autoGenerated",
                        "value": {
                            "#v": true,
                            "#t": "boolean"
                        }
                    }
                ],
                "listViewMapping": ""
            },
            {
                "id": 194,
                "uuid": "{http://www.appian.com/ae/types/2009}Dictionary?list",
                "namespace": "http://www.appian.com/ae/types/2009",
                "localPart": "Dictionary?list",
                "description": "List of Dictionary",
                "base": 93,
                "foundation": 93,
                "typeof": 94,
                "flags": 12,
                "instanceProperties": [],
                "typeProperties": [],
                "listViewMapping": ""
            },
            {
                "id": 195,
                "uuid": "{http://www.appian.com/ae/types/2009}Record?list",
                "namespace": "http://www.appian.com/ae/types/2009",
                "localPart": "Record?list",
                "description": "List of Record",
                "base": 93,
                "foundation": 93,
                "typeof": 95,
                "flags": 12,
                "instanceProperties": [],
                "typeProperties": [],
                "listViewMapping": ""
            },
            {
                "id": 101,
                "uuid": "{http://www.appian.com/ae/types/2009}Integer?list",
                "namespace": "http://www.appian.com/ae/types/2009",
                "localPart": "Integer?list",
                "description": "List of Number (Integer)",
                "base": 93,
                "foundation": 93,
                "typeof": 1,
                "flags": 8,
                "instanceProperties": [],
                "typeProperties": [],
                "listViewMapping": ""
            },
            {
                "id": 8117,
                "uuid": "{http://www.appian.com/ae/types/2009}",
                "namespace": "http://www.appian.com/ae/types/2009",
                "localPart": "",
                "description": "List of ",
                "base": 93,
                "foundation": 93,
                "typeof": 8116,
                "flags": 12,
                "instanceProperties": [],
                "typeProperties": [
                    {
                        "name": "autoGenerated",
                        "value": {
                            "#v": true,
                            "#t": "boolean"
                        }
                    }
                ],
                "listViewMapping": ""
            },
            {
                "id": 4337,
                "uuid": "{http://www.appian.com/ae/types/2009}",
                "namespace": "http://www.appian.com/ae/types/2009",
                "localPart": "",
                "description": "List of ",
                "base": 93,
                "foundation": 93,
                "typeof": 4336,
                "flags": 12,
                "instanceProperties": [],
                "typeProperties": [
                    {
                        "name": "autoGenerated",
                        "value": {
                            "#v": true,
                            "#t": "boolean"
                        }
                    }
                ],
                "listViewMapping": ""
            },
            {
                "id": 11676,
                "uuid": "{http://www.appian.com/ae/types/2009}GWTPlaceWidget",
                "namespace": "http://www.appian.com/ae/types/2009",
                "localPart": "GWTPlaceWidget",
                "description": "",
                "base": 4332,
                "foundation": 95,
                "typeof": 11676,
                "list": 11677,
                "flags": 12,
                "instanceProperties": [
                    {
                        "name": "@attributes",
                        "value": {
                            "#t": 11680
                        }
                    },
                    {
                        "name": "uri",
                        "value": {
                            "#t": "string"
                        }
                    },
                    {
                        "name": "actions",
                        "value": {
                            "#t": "Variant?list"
                        }
                    }
                ],
                "typeProperties": [
                    {
                        "name": "namespaces",
                        "value": {
                            "#v": [
                                "http://www.appian.com/ae/types/internal",
                                "http://www.appian.com/ae/types/2009",
                                "http://www.appian.com/ae/types/2009"
                            ],
                            "#t": "Text?list"
                        }
                    },
                    {
                        "name": "isNillable",
                        "value": {
                            "#v": [
                                false,
                                false,
                                false
                            ],
                            "#t": "Boolean?list"
                        }
                    }
                ],
                "listViewMapping": ""
            },
            {
                "id": 11680,
                "uuid": "{http://www.appian.com/ae/types/2009}",
                "namespace": "http://www.appian.com/ae/types/2009",
                "localPart": "",
                "description": "Attributes record for type 11676 (GWTPlaceWidget)",
                "base": 95,
                "foundation": 95,
                "typeof": 11680,
                "list": 11681,
                "flags": 12,
                "instanceProperties": [
                    {
                        "name": "@anyAttribute",
                        "value": {
                            "#t": "Dictionary"
                        }
                    },
                    {
                        "name": "@nil",
                        "value": {
                            "#t": "boolean"
                        }
                    }
                ],
                "typeProperties": [
                    {
                        "name": "namespaces",
                        "value": {
                            "#v": [
                                "http://www.appian.com/ae/types/internal",
                                "http://www.appian.com/ae/types/internal"
                            ],
                            "#t": "Text?list"
                        }
                    },
                    {
                        "name": "autoGenerated",
                        "value": {
                            "#v": true,
                            "#t": "boolean"
                        }
                    }
                ],
                "listViewMapping": ""
            },
            {
                "id": 11677,
                "uuid": "{http://www.appian.com/ae/types/2009}GWTPlaceWidget?list",
                "namespace": "http://www.appian.com/ae/types/2009",
                "localPart": "GWTPlaceWidget?list",
                "description": "List of GWTPlaceWidget",
                "base": 93,
                "foundation": 93,
                "typeof": 11676,
                "flags": 8,
                "instanceProperties": [],
                "typeProperties": [
                    {
                        "name": "autoGenerated",
                        "value": {
                            "#v": true,
                            "#t": "boolean"
                        }
                    }
                ],
                "listViewMapping": ""
            },
            {
                "id": 11681,
                "uuid": "{http://www.appian.com/ae/types/2009}",
                "namespace": "http://www.appian.com/ae/types/2009",
                "localPart": "",
                "description": "List of ",
                "base": 93,
                "foundation": 93,
                "typeof": 11680,
                "flags": 12,
                "instanceProperties": [],
                "typeProperties": [
                    {
                        "name": "autoGenerated",
                        "value": {
                            "#v": true,
                            "#t": "boolean"
                        }
                    }
                ],
                "listViewMapping": ""
            },
            {
                "id": 8320,
                "uuid": "{http://www.appian.com/ae/types/2009}ContentLayout",
                "namespace": "http://www.appian.com/ae/types/2009",
                "localPart": "ContentLayout",
                "description": "",
                "base": 4332,
                "foundation": 95,
                "typeof": 8320,
                "list": 8321,
                "flags": 12,
                "instanceProperties": [
                    {
                        "name": "@attributes",
                        "value": {
                            "#t": 8332
                        }
                    },
                    {
                        "name": "contents",
                        "value": {
                            "#t": "Variant?list"
                        }
                    },
                    {
                        "name": "padding",
                        "value": {
                            "#t": "ContentLayoutPadding"
                        }
                    },
                    {
                        "name": "actions",
                        "value": {
                            "#t": "Variant?list"
                        }
                    },
                    {
                        "name": "isTopLevelComponent",
                        "value": {
                            "#t": "boolean"
                        }
                    },
                    {
                        "name": "topLevelBackgroundColor",
                        "value": {
                            "#t": "string"
                        }
                    }
                ],
                "typeProperties": [
                    {
                        "name": "namespaces",
                        "value": {
                            "#v": [
                                "http://www.appian.com/ae/types/internal",
                                "http://www.appian.com/ae/types/2009",
                                "http://www.appian.com/ae/types/2009",
                                "http://www.appian.com/ae/types/2009",
                                "http://www.appian.com/ae/types/2009",
                                "http://www.appian.com/ae/types/2009"
                            ],
                            "#t": "Text?list"
                        }
                    },
                    {
                        "name": "isNillable",
                        "value": {
                            "#v": [
                                false,
                                false,
                                false,
                                false,
                                false,
                                false
                            ],
                            "#t": "Boolean?list"
                        }
                    }
                ],
                "listViewMapping": ""
            },
            {
                "id": 8332,
                "uuid": "{http://www.appian.com/ae/types/2009}",
                "namespace": "http://www.appian.com/ae/types/2009",
                "localPart": "",
                "description": "Attributes record for type 8320 (ContentLayout)",
                "base": 95,
                "foundation": 95,
                "typeof": 8332,
                "list": 8333,
                "flags": 12,
                "instanceProperties": [
                    {
                        "name": "@anyAttribute",
                        "value": {
                            "#t": "Dictionary"
                        }
                    },
                    {
                        "name": "@nil",
                        "value": {
                            "#t": "boolean"
                        }
                    }
                ],
                "typeProperties": [
                    {
                        "name": "namespaces",
                        "value": {
                            "#v": [
                                "http://www.appian.com/ae/types/internal",
                                "http://www.appian.com/ae/types/internal"
                            ],
                            "#t": "Text?list"
                        }
                    },
                    {
                        "name": "autoGenerated",
                        "value": {
                            "#v": true,
                            "#t": "boolean"
                        }
                    }
                ],
                "listViewMapping": ""
            },
            {
                "id": 8328,
                "uuid": "{http://www.appian.com/ae/types/2009}ContentLayoutPadding",
                "namespace": "http://www.appian.com/ae/types/2009",
                "localPart": "ContentLayoutPadding",
                "description": "",
                "base": 3,
                "foundation": 3,
                "typeof": 3,
                "list": 8329,
                "flags": 12,
                "instanceProperties": [],
                "typeProperties": [],
                "listViewMapping": ""
            },
            {
                "id": 8321,
                "uuid": "{http://www.appian.com/ae/types/2009}ContentLayout?list",
                "namespace": "http://www.appian.com/ae/types/2009",
                "localPart": "ContentLayout?list",
                "description": "List of ContentLayout",
                "base": 93,
                "foundation": 93,
                "typeof": 8320,
                "flags": 8,
                "instanceProperties": [],
                "typeProperties": [
                    {
                        "name": "autoGenerated",
                        "value": {
                            "#v": true,
                            "#t": "boolean"
                        }
                    }
                ],
                "listViewMapping": ""
            },
            {
                "id": 8333,
                "uuid": "{http://www.appian.com/ae/types/2009}",
                "namespace": "http://www.appian.com/ae/types/2009",
                "localPart": "",
                "description": "List of ",
                "base": 93,
                "foundation": 93,
                "typeof": 8332,
                "flags": 12,
                "instanceProperties": [],
                "typeProperties": [
                    {
                        "name": "autoGenerated",
                        "value": {
                            "#v": true,
                            "#t": "boolean"
                        }
                    }
                ],
                "listViewMapping": ""
            },
            {
                "id": 8329,
                "uuid": "{http://www.appian.com/ae/types/2009}ContentLayoutPadding?list",
                "namespace": "http://www.appian.com/ae/types/2009",
                "localPart": "ContentLayoutPadding?list",
                "description": "List of ContentLayoutPadding",
                "base": 93,
                "foundation": 93,
                "typeof": 8328,
                "flags": 12,
                "instanceProperties": [],
                "typeProperties": [
                    {
                        "name": "autoGenerated",
                        "value": {
                            "#v": true,
                            "#t": "boolean"
                        }
                    }
                ],
                "listViewMapping": ""
            },
            {
                "id": 252,
                "uuid": "{http://www.appian.com/ae/types/2009}Map",
                "namespace": "http://www.appian.com/ae/types/2009",
                "localPart": "Map",
                "description": "Map",
                "base": 252,
                "foundation": 252,
                "typeof": 252,
                "list": 253,
                "flags": 8,
                "instanceProperties": [],
                "typeProperties": [],
                "listViewMapping": ""
            },
            {
                "id": 253,
                "uuid": "{http://www.appian.com/ae/types/2009}Map?list",
                "namespace": "http://www.appian.com/ae/types/2009",
                "localPart": "Map?list",
                "description": "List of Map",
                "base": 93,
                "foundation": 93,
                "typeof": 252,
                "flags": 8,
                "instanceProperties": [],
                "typeProperties": [],
                "listViewMapping": ""
            },
            {
                "id": 4728,
                "uuid": "{http://www.appian.com/ae/types/2009}UiConfig",
                "namespace": "http://www.appian.com/ae/types/2009",
                "localPart": "UiConfig",
                "description": "",
                "base": 4332,
                "foundation": 95,
                "typeof": 4728,
                "list": 4729,
                "flags": 12,
                "instanceProperties": [
                    {
                        "name": "@attributes",
                        "value": {
                            "#t": 4740
                        }
                    },
                    {
                        "name": "links",
                        "value": {
                            "#t": "Link?list"
                        }
                    },
                    {
                        "name": "actions",
                        "value": {
                            "#t": "Variant?list"
                        }
                    },
                    {
                        "name": "triggers",
                        "value": {
                            "#t": "Variant?list"
                        }
                    },
                    {
                        "name": "redirect",
                        "value": {
                            "#t": "Variant"
                        }
                    },
                    {
                        "name": "ui",
                        "value": {
                            "#t": "Variant"
                        }
                    },
                    {
                        "name": "context",
                        "value": {
                            "#t": "Variant"
                        }
                    },
                    {
                        "name": "updates",
                        "value": {
                            "#t": "Variant"
                        }
                    },
                    {
                        "name": "identifier",
                        "value": {
                            "#t": "Variant"
                        }
                    },
                    {
                        "name": "uuid",
                        "value": {
                            "#t": "string"
                        }
                    },
                    {
                        "name": "i18nInfo",
                        "value": {
                            "#t": "I18NInfo"
                        }
                    },
                    {
                        "name": "uriInfo",
                        "value": {
                            "#t": "Variant"
                        }
                    },
                    {
                        "name": "shortcuts",
                        "value": {
                            "#t": "Variant?list"
                        }
                    },
                    {
                        "name": "timers",
                        "value": {
                            "#t": "Variant"
                        }
                    },
                    {
                        "name": "formFactors",
                        "value": {
                            "#t": "Text?list"
                        }
                    },
                    {
                        "name": "lastEvaluatedFormFactor",
                        "value": {
                            "#t": "string"
                        }
                    },
                    {
                        "name": "uiExpression",
                        "value": {
                            "#t": "string"
                        }
                    },
                    {
                        "name": "worldState",
                        "value": {
                            "#t": "WorldState"
                        }
                    }
                ],
                "typeProperties": [
                    {
                        "name": "namespaces",
                        "value": {
                            "#v": [
                                "http://www.appian.com/ae/types/internal",
                                "http://www.appian.com/ae/types/2009",
                                "http://www.appian.com/ae/types/2009",
                                "http://www.appian.com/ae/types/2009",
                                "http://www.appian.com/ae/types/2009",
                                "http://www.appian.com/ae/types/2009",
                                "http://www.appian.com/ae/types/2009",
                                "http://www.appian.com/ae/types/2009",
                                "http://www.appian.com/ae/types/2009",
                                "http://www.appian.com/ae/types/2009",
                                "http://www.appian.com/ae/types/2009",
                                "http://www.appian.com/ae/types/2009",
                                "http://www.appian.com/ae/types/2009",
                                "http://www.appian.com/ae/types/2009",
                                "http://www.appian.com/ae/types/2009",
                                "http://www.appian.com/ae/types/2009",
                                "http://www.appian.com/ae/types/2009",
                                "http://www.appian.com/ae/types/2009"
                            ],
                            "#t": "Text?list"
                        }
                    },
                    {
                        "name": "isNillable",
                        "value": {
                            "#v": [
                                false,
                                true,
                                true,
                                false,
                                false,
                                false,
                                false,
                                false,
                                false,
                                false,
                                false,
                                false,
                                false,
                                false,
                                false,
                                false,
                                false,
                                true
                            ],
                            "#t": "Boolean?list"
                        }
                    }
                ],
                "listViewMapping": ""
            },
            {
                "id": 4740,
                "uuid": "{http://www.appian.com/ae/types/2009}",
                "namespace": "http://www.appian.com/ae/types/2009",
                "localPart": "",
                "description": "Attributes record for type 4728 (UiConfig)",
                "base": 95,
                "foundation": 95,
                "typeof": 4740,
                "list": 4741,
                "flags": 12,
                "instanceProperties": [
                    {
                        "name": "@anyAttribute",
                        "value": {
                            "#t": "Dictionary"
                        }
                    },
                    {
                        "name": "@nil",
                        "value": {
                            "#t": "boolean"
                        }
                    }
                ],
                "typeProperties": [
                    {
                        "name": "namespaces",
                        "value": {
                            "#v": [
                                "http://www.appian.com/ae/types/internal",
                                "http://www.appian.com/ae/types/internal"
                            ],
                            "#t": "Text?list"
                        }
                    },
                    {
                        "name": "autoGenerated",
                        "value": {
                            "#v": true,
                            "#t": "boolean"
                        }
                    }
                ],
                "listViewMapping": ""
            },
            {
                "id": 2089,
                "uuid": "{http://www.appian.com/ae/types/2009}Link?list",
                "namespace": "http://www.appian.com/ae/types/2009",
                "localPart": "Link?list",
                "description": "List of Link",
                "base": 93,
                "foundation": 93,
                "typeof": 2088,
                "flags": 8,
                "instanceProperties": [],
                "typeProperties": [
                    {
                        "name": "autoGenerated",
                        "value": {
                            "#v": true,
                            "#t": "boolean"
                        }
                    }
                ],
                "listViewMapping": ""
            },
            {
                "id": 4414,
                "uuid": "{http://www.appian.com/ae/types/2009}I18NInfo",
                "namespace": "http://www.appian.com/ae/types/2009",
                "localPart": "I18NInfo",
                "description": "",
                "base": 4332,
                "foundation": 95,
                "typeof": 4414,
                "list": 4415,
                "flags": 12,
                "instanceProperties": [
                    {
                        "name": "@attributes",
                        "value": {
                            "#t": 4418
                        }
                    },
                    {
                        "name": "locale",
                        "value": {
                            "#t": "string"
                        }
                    },
                    {
                        "name": "timezoneId",
                        "value": {
                            "#t": "string"
                        }
                    },
                    {
                        "name": "calendarId",
                        "value": {
                            "#t": "string"
                        }
                    },
                    {
                        "name": "actions",
                        "value": {
                            "#t": "Variant?list"
                        }
                    },
                    {
                        "name": "decimalSeparator",
                        "value": {
                            "#t": "string"
                        }
                    },
                    {
                        "name": "groupingSeparator",
                        "value": {
                            "#t": "string"
                        }
                    },
                    {
                        "name": "isRtl",
                        "value": {
                            "#t": "boolean"
                        }
                    }
                ],
                "typeProperties": [
                    {
                        "name": "namespaces",
                        "value": {
                            "#v": [
                                "http://www.appian.com/ae/types/internal",
                                "http://www.appian.com/ae/types/2009",
                                "http://www.appian.com/ae/types/2009",
                                "http://www.appian.com/ae/types/2009",
                                "http://www.appian.com/ae/types/2009",
                                "http://www.appian.com/ae/types/2009",
                                "http://www.appian.com/ae/types/2009",
                                "http://www.appian.com/ae/types/2009"
                            ],
                            "#t": "Text?list"
                        }
                    },
                    {
                        "name": "isNillable",
                        "value": {
                            "#v": [
                                false,
                                false,
                                false,
                                false,
                                false,
                                false,
                                false,
                                false
                            ],
                            "#t": "Boolean?list"
                        }
                    }
                ],
                "listViewMapping": ""
            },
            {
                "id": 20160,
                "uuid": "{http://www.appian.com/ae/types/2009}WorldState",
                "namespace": "http://www.appian.com/ae/types/2009",
                "localPart": "WorldState",
                "description": "",
                "base": 95,
                "foundation": 95,
                "typeof": 20160,
                "list": 20161,
                "flags": 12,
                "instanceProperties": [
                    {
                        "name": "clock",
                        "value": {
                            "#t": "dateTime"
                        }
                    }
                ],
                "typeProperties": [
                    {
                        "name": "namespaces",
                        "value": {
                            "#v": [
                                "http://www.appian.com/ae/types/2009"
                            ],
                            "#t": "Text?list"
                        }
                    },
                    {
                        "name": "isNillable",
                        "value": {
                            "#v": [
                                false
                            ],
                            "#t": "Boolean?list"
                        }
                    }
                ],
                "listViewMapping": ""
            },
            {
                "id": 4729,
                "uuid": "{http://www.appian.com/ae/types/2009}UiConfig?list",
                "namespace": "http://www.appian.com/ae/types/2009",
                "localPart": "UiConfig?list",
                "description": "List of UiConfig",
                "base": 93,
                "foundation": 93,
                "typeof": 4728,
                "flags": 8,
                "instanceProperties": [],
                "typeProperties": [
                    {
                        "name": "autoGenerated",
                        "value": {
                            "#v": true,
                            "#t": "boolean"
                        }
                    }
                ],
                "listViewMapping": ""
            },
            {
                "id": 4741,
                "uuid": "{http://www.appian.com/ae/types/2009}",
                "namespace": "http://www.appian.com/ae/types/2009",
                "localPart": "",
                "description": "List of ",
                "base": 93,
                "foundation": 93,
                "typeof": 4740,
                "flags": 12,
                "instanceProperties": [],
                "typeProperties": [
                    {
                        "name": "autoGenerated",
                        "value": {
                            "#v": true,
                            "#t": "boolean"
                        }
                    }
                ],
                "listViewMapping": ""
            },
            {
                "id": 2088,
                "uuid": "{http://www.appian.com/ae/types/2009}Link",
                "namespace": "http://www.appian.com/ae/types/2009",
                "localPart": "Link",
                "description": "",
                "base": 95,
                "foundation": 95,
                "typeof": 2088,
                "list": 2089,
                "flags": 12,
                "instanceProperties": [
                    {
                        "name": "@attributes",
                        "value": {
                            "#t": 2092
                        }
                    }
                ],
                "typeProperties": [
                    {
                        "name": "namespaces",
                        "value": {
                            "#v": [
                                "http://www.appian.com/ae/types/internal"
                            ],
                            "#t": "Text?list"
                        }
                    },
                    {
                        "name": "isNillable",
                        "value": {
                            "#v": [
                                false
                            ],
                            "#t": "Boolean?list"
                        }
                    }
                ],
                "listViewMapping": ""
            },
            {
                "id": 4418,
                "uuid": "{http://www.appian.com/ae/types/2009}",
                "namespace": "http://www.appian.com/ae/types/2009",
                "localPart": "",
                "description": "Attributes record for type 4414 (I18NInfo)",
                "base": 95,
                "foundation": 95,
                "typeof": 4418,
                "list": 4419,
                "flags": 12,
                "instanceProperties": [
                    {
                        "name": "@anyAttribute",
                        "value": {
                            "#t": "Dictionary"
                        }
                    },
                    {
                        "name": "@nil",
                        "value": {
                            "#t": "boolean"
                        }
                    }
                ],
                "typeProperties": [
                    {
                        "name": "namespaces",
                        "value": {
                            "#v": [
                                "http://www.appian.com/ae/types/internal",
                                "http://www.appian.com/ae/types/internal"
                            ],
                            "#t": "Text?list"
                        }
                    },
                    {
                        "name": "autoGenerated",
                        "value": {
                            "#v": true,
                            "#t": "boolean"
                        }
                    }
                ],
                "listViewMapping": ""
            },
            {
                "id": 4415,
                "uuid": "{http://www.appian.com/ae/types/2009}I18NInfo?list",
                "namespace": "http://www.appian.com/ae/types/2009",
                "localPart": "I18NInfo?list",
                "description": "List of I18NInfo",
                "base": 93,
                "foundation": 93,
                "typeof": 4414,
                "flags": 8,
                "instanceProperties": [],
                "typeProperties": [
                    {
                        "name": "autoGenerated",
                        "value": {
                            "#v": true,
                            "#t": "boolean"
                        }
                    }
                ],
                "listViewMapping": ""
            },
            {
                "id": 20161,
                "uuid": "{http://www.appian.com/ae/types/2009}WorldState?list",
                "namespace": "http://www.appian.com/ae/types/2009",
                "localPart": "WorldState?list",
                "description": "List of WorldState",
                "base": 93,
                "foundation": 93,
                "typeof": 20160,
                "flags": 8,
                "instanceProperties": [],
                "typeProperties": [
                    {
                        "name": "autoGenerated",
                        "value": {
                            "#v": true,
                            "#t": "boolean"
                        }
                    }
                ],
                "listViewMapping": ""
            },
            {
                "id": 2092,
                "uuid": "{http://www.appian.com/ae/types/2009}",
                "namespace": "http://www.appian.com/ae/types/2009",
                "localPart": "",
                "description": "Attributes record for type 2088 (Link)",
                "base": 95,
                "foundation": 95,
                "typeof": 2092,
                "list": 2093,
                "flags": 12,
                "instanceProperties": [
                    {
                        "name": "href",
                        "value": {
                            "#t": "string"
                        }
                    },
                    {
                        "name": "rel",
                        "value": {
                            "#t": "string"
                        }
                    },
                    {
                        "name": "title",
                        "value": {
                            "#t": "string"
                        }
                    },
                    {
                        "name": "@anyAttribute",
                        "value": {
                            "#t": "Dictionary"
                        }
                    },
                    {
                        "name": "@nil",
                        "value": {
                            "#t": "boolean"
                        }
                    }
                ],
                "typeProperties": [
                    {
                        "name": "namespaces",
                        "value": {
                            "#v": [
                                "",
                                "",
                                "",
                                "http://www.appian.com/ae/types/internal",
                                "http://www.appian.com/ae/types/internal"
                            ],
                            "#t": "Text?list"
                        }
                    },
                    {
                        "name": "autoGenerated",
                        "value": {
                            "#v": true,
                            "#t": "boolean"
                        }
                    }
                ],
                "listViewMapping": ""
            },
            {
                "id": 4419,
                "uuid": "{http://www.appian.com/ae/types/2009}",
                "namespace": "http://www.appian.com/ae/types/2009",
                "localPart": "",
                "description": "List of ",
                "base": 93,
                "foundation": 93,
                "typeof": 4418,
                "flags": 12,
                "instanceProperties": [],
                "typeProperties": [
                    {
                        "name": "autoGenerated",
                        "value": {
                            "#v": true,
                            "#t": "boolean"
                        }
                    }
                ],
                "listViewMapping": ""
            },
            {
                "id": 109,
                "uuid": "{http://www.appian.com/ae/types/2009}Datetime?list",
                "namespace": "http://www.appian.com/ae/types/2009",
                "localPart": "Datetime?list",
                "description": "List of Timestamp",
                "base": 93,
                "foundation": 93,
                "typeof": 9,
                "flags": 8,
                "instanceProperties": [],
                "typeProperties": [],
                "listViewMapping": ""
            },
            {
                "id": 2093,
                "uuid": "{http://www.appian.com/ae/types/2009}",
                "namespace": "http://www.appian.com/ae/types/2009",
                "localPart": "",
                "description": "List of ",
                "base": 93,
                "foundation": 93,
                "typeof": 2092,
                "flags": 12,
                "instanceProperties": [],
                "typeProperties": [
                    {
                        "name": "autoGenerated",
                        "value": {
                            "#v": true,
                            "#t": "boolean"
                        }
                    }
                ],
                "listViewMapping": ""
            }
        ],
        "#t": "DataType?list"
    },
    "shortcuts": [],
    "#u": "<https://an-appian-instance.host.net/suite/rest/a/applications/latest/legacy/>; rel=\"x-sasa-app\"; dt=\"UiConfig\",<https://an-appian-instance.host.net/suite/components/ping.do>; rel=\"x-resume-session\"; dt=\"UiConfig\",<https://an-appian-instance.host.net/suite/rest/a/applications/latest/app{/appName}{/path*}{?params*}>; rel=\"x-sail-application\"; dt=\"UiConfig\",<https://an-appian-instance.host.net/suite/rest/a/sites/latest/all>; rel=\"x-sites-all\"; dt=\"UiConfig\",<https://an-appian-instance.host.net/suite/sites{/urlStub}/tasks/task/{id}>; rel=\"x-site-task\"; dt=\"UiConfig\",<https://an-appian-instance.host.net/suite/sites{/urlStub}/page/{pageUrlStub}/task/{id}>; rel=\"x-site-task-page\"; dt=\"UiConfig\",<https://an-appian-instance.host.net/suite/rest/a/rpacomponent/latest/editor>; rel=\"x-rpa-expression-editor\"; dt=\"UiConfig\",<https://an-appian-instance.host.net/suite/rest/a/applications/latest/legacy/sites{/urlStub}/page{/pageUrlStub}/nav>; rel=\"x-site-page-navattributes\"; dt=\"UiConfig\",<https://an-appian-instance.host.net/suite/cors>; rel=\"x-cors\"; dt=\"UiConfig\",<https://an-appian-instance.host.net/suite/rest/a/interfacedesigner/latest/evaluateComponentTemplate{/templateId}>; rel=\"x-ifcdesigner-evaluatecomponenttemplate\"; dt=\"UiConfig\",<https://an-appian-instance.host.net/suite/rest/a/sites/latest/{siteUrlStub}/pages/{pageUrlStub}/report>; rel=\"x-sites-report\"; dt=\"UiConfig\",<https://an-appian-instance.host.net/suite/rest/a/applications/latest/legacy/sites{/urlStub}/nav>; rel=\"x-site-navattributes\"; dt=\"UiConfig\",<https://an-appian-instance.host.net/suite/sites>; rel=\"x-site-main\"; dt=\"UiConfig\",<https://an-appian-instance.host.net/suite/rest/a/task/latest/{taskId}/attributes>; rel=\"x-task-attributes\"; dt=\"UiConfig\",<https://an-appian-instance.host.net/suite/internal/webapi/releaselock/{objectUuid}/{uiSourceUuid}>; rel=\"x-data-release-object-lock\"; dt=\"UiConfig\""
}