%YAML 1.1
%TAG !u! tag:unity3d.com,2011:
--- !u!162 &1
EditorUserSettings:
  m_ObjectHideFlags: 0
  serializedVersion: 4
  m_ConfigSettings:
    RecentlyUsedSceneGuid-0:
      value: 025706545c035d035a58547043770d41124f4f2c787d226974701c62b7b93260
      flags: 0
    RecentlyUsedSceneGuid-1:
      value: 515250075c0c595e5f5a5e71122159444e4e4a2f7a7d7f602f284d66b4b76661
      flags: 0
    RecentlyUsedSceneGuid-2:
      value: 5306045e03535e5d095a087514225c44434f40297f2a7e327f2f4c63e4b26c3b
      flags: 0
    RecentlyUsedSceneGuid-3:
      value: 5505550754010802585b0d2711720e44104f1e2e7d2e27657a7b4935e3e6673c
      flags: 0
    RecentlyUsedSceneGuid-4:
      value: 5554040000505b0b0e57097746735c44174f197a752b24602c7f4d62b2b3363b
      flags: 0
    RecentlyUsedSceneGuid-5:
      value: 53530155560d500c5456097a16760d444f4f1b2f2e7c24327f704832b2e4366e
      flags: 0
    RecentlyUsedSceneGuid-6:
      value: 55570c565257510a5a0c0e2440715c4415154a78282a22347a2d4e66bbe1303c
      flags: 0
    RecentlyUsedSceneGuid-7:
      value: 510750005c56080f5d585526157359444e161e7379707f657b7e1b35b1b4306c
      flags: 0
    vcSharedLogLevel:
      value: 0d5e400f0650
      flags: 0
  m_VCAutomaticAdd: 1
  m_VCDebugCom: 0
  m_VCDebugCmd: 0
  m_VCDebugOut: 0
  m_SemanticMergeMode: 2
  m_DesiredImportWorkerCount: 3
  m_StandbyImportWorkerCount: 2
  m_IdleImportWorkerShutdownDelay: 60000
  m_VCShowFailedCheckout: 1
  m_VCOverwriteFailedCheckoutAssets: 1
  m_VCProjectOverlayIcons: 1
  m_VCHierarchyOverlayIcons: 1
  m_VCOtherOverlayIcons: 1
  m_VCAllowAsyncUpdate: 1
  m_ArtifactGarbageCollection: 1
