<svg xmlns="http://www.w3.org/2000/svg" width="18" height="17.54" viewBox="0 0 18 17.54">
  <defs>
    <style>
      .cls-1 {
        fill: #fff;
      }
    </style>
  </defs>
  <path id="ic_volume_up_24px" class="cls-1" d="M3,9v6H7l5,5V4L7,9Zm13.5,3A4.5,4.5,0,0,0,14,7.97v8.05A4.474,4.474,0,0,0,16.5,12ZM14,3.23V5.29a7,7,0,0,1,0,13.42v2.06A8.994,8.994,0,0,0,14,3.23Z" transform="translate(-3 -3.23)"/>
</svg>
