{
    "title" : "Que font les masques à présent ?",
    "subtitle" : "",
    "author" : "Emmanuelle Chérel",
    "keys" : ["Art contemporain africain", "Masques", "Etudes post-coloniales"],
    "authorDescription" : "",
    "type" : "article"
}