{
    "title" : "Le Musée du souffle",
    "subtitle" : "Peupler la solitude des objets, inventer un lieu qui parle",
    "author" : "Olivier Marboeuf",
    "keys" : ["Collecte d'archives", "Archives sonores", "Musée Théodore Monod d’art africain - Dakar Sénégal"],
    "authorDescription" : "Olivier Marboeuf est auteur, conteur, commissaire d’exposition indépendant français et fondateur du centre d’art Espace Khiasma qu’il a dirigé de 2004 à 2018 aux Lilas (Seine-Saint-Denis). Il y a développé un programme centré sur des questions de représentations minoritaires qui associait expositions, projections, débats, performances et projets collaboratifs sur le territoire du Nord-Est parisien. S’intéressant aux différentes modalités de transmission des savoirs, les propositions d’Olivier Marboeuf sont largement traversées par des pratiques de conversation qui tentent de créer des situations éphémères de culture. Son intérêt pour le récit en art l’a amené à développer un travail spécifique d’accompagnement d’artistes impliqués dans les pratiques du film. Il est aujourd’hui producteur au sein de la maison de production Spectre basée à Rennes. Parallèlement, il développe des textes de fiction et des recherches théoriques autour des pratiques décoloniales dans le champs de la culture et du corps comme espace d’archive. Il publie régulièrement ses travaux sur le blog Toujours Debout.",
    "type" : "audio"
}