<svg width="359" height="253" viewBox="0 0 359 253" fill="none" xmlns="http://www.w3.org/2000/svg">
<path d="M0 0H359V253H0V0Z" fill="#A2A2A2" fill-opacity="0.25"/>
<rect x="1.5" y="25.5" width="123" height="157" stroke="black" stroke-width="3"/>
<rect x="148.5" y="35.5" width="161" height="17" stroke="black" stroke-width="3"/>
<rect x="148.5" y="52.5" width="161" height="17" stroke="black" stroke-width="3"/>
<rect x="148.5" y="69.5" width="161" height="17" stroke="black" stroke-width="3"/>
<rect x="148.5" y="86.5" width="161" height="17" stroke="black" stroke-width="3"/>
<rect x="200.5" y="103.5" width="127" height="16" stroke="black" stroke-width="3"/>
<rect x="357.5" y="53.5" width="61" height="26" transform="rotate(90 357.5 53.5)" stroke="black" stroke-width="3"/>
<rect x="357.5" y="114.5" width="61" height="26" transform="rotate(90 357.5 114.5)" stroke="black" stroke-width="3"/>
<rect x="131.5" y="103.5" width="47" height="16" stroke="black" stroke-width="3"/>
</svg>
