<svg width="25" height="25" viewBox="0 0 25 25" fill="none" xmlns="http://www.w3.org/2000/svg">
<g clip-path="url(#clip0_177_1964)">
<path d="M23.9583 11.458H1.04167C0.46637 11.458 0 11.9244 0 12.4997C0 13.075 0.46637 13.5414 1.04167 13.5414H23.9583C24.5336 13.5414 25 13.075 25 12.4997C25 11.9244 24.5336 11.458 23.9583 11.458Z" fill="#211E18"/>
</g>
<defs>
<clipPath id="clip0_177_1964">
<rect width="25" height="25" fill="white"/>
</clipPath>
</defs>
</svg>
