<svg width="24" height="29" viewBox="0 0 24 29" fill="none" xmlns="http://www.w3.org/2000/svg">
<path d="M23.0607 10.9393C23.6464 11.5251 23.6464 12.4749 23.0607 13.0607L13.5147 22.6066C12.9289 23.1924 11.9792 23.1924 11.3934 22.6066C10.8076 22.0208 10.8076 21.0711 11.3934 20.4853L19.8787 12L11.3934 3.51472C10.8076 2.92893 10.8076 1.97918 11.3934 1.3934C11.9792 0.807611 12.9289 0.807611 13.5147 1.3934L23.0607 10.9393ZM22 28.5L7 28.5L7 25.5L22 25.5L22 28.5ZM7 28.5C5.97308 28.5 4.16661 28.4554 2.70438 27.0338C1.26723 25.6366 0.5 23.2515 0.5 19.5L3.5 19.5C3.5 22.9707 4.23277 24.3356 4.79562 24.8828C5.33339 25.4057 6.02692 25.5 7 25.5L7 28.5ZM0.5 19.5C0.5 15.7485 1.26723 13.3634 2.70438 11.9662C4.16661 10.5446 5.97308 10.5 7 10.5L7 13.5C6.02692 13.5 5.33339 13.5943 4.79562 14.1172C4.23277 14.6644 3.5 16.0293 3.5 19.5L0.5 19.5ZM7 10.5L22 10.5L22 13.5L7 13.5L7 10.5Z" fill="black"/>
</svg>
