<svg width="326" height="205" viewBox="0 0 326 205" fill="none" xmlns="http://www.w3.org/2000/svg">
<mask id="mask0_44_4393" style="mask-type:alpha" maskUnits="userSpaceOnUse" x="0" y="0" width="326" height="205">
<rect x="0.483521" width="325.033" height="205" fill="black"/>
</mask>
<g mask="url(#mask0_44_4393)">
<ellipse cx="163" cy="148.355" rx="159.819" ry="95.7566" fill="#211E18"/>
<ellipse cx="47.0131" cy="189.49" rx="46.5296" ry="189.49" fill="#211E18"/>
<ellipse cx="278.987" cy="189.49" rx="46.5296" ry="189.49" fill="#211E18"/>
</g>
<circle cx="78.7072" cy="149.704" r="31.0197" fill="#F2F0EB"/>
<circle cx="78.7072" cy="149.704" r="25.625" fill="#211E18"/>
<circle cx="90.1709" cy="139.589" r="15.5099" fill="#F2F0EB"/>
<circle cx="68.5921" cy="165.214" r="10.1151" fill="#F2F0EB"/>
<circle cx="249.99" cy="149.704" r="31.0197" fill="#F2F0EB"/>
<circle cx="249.99" cy="149.704" r="25.625" fill="#211E18"/>
<circle cx="261.454" cy="139.589" r="15.5099" fill="#F2F0EB"/>
<circle cx="239.875" cy="165.214" r="10.1151" fill="#F2F0EB"/>
<path d="M170.53 156.447C167.811 156.447 165.378 157.375 163.861 158.797C162.343 157.375 159.91 156.447 157.191 156.447C152.579 156.447 148.839 159.081 148.839 162.337C148.839 163.591 149.124 164.75 149.62 165.825C151.993 171.093 159.309 174.243 162.929 175.107C163.44 175.233 164.281 175.233 164.792 175.107C168.412 174.243 175.728 171.093 178.101 165.825C178.597 164.75 178.882 163.591 178.882 162.337C178.882 159.081 175.142 156.447 170.53 156.447Z" fill="#F2F0EB"/>
</svg>
