https://unsplash.it/800/600?image=186 guardada el dia: domingo, 1 de agosto de 2021 13:21
https://unsplash.it/800/600?image=530 guardada el dia: domingo, 1 de agosto de 2021 13:21
https://unsplash.it/800/600?image=216 guardada el dia: domingo, 1 de agosto de 2021 13:21
https://unsplash.it/800/600?image=213 guardada el dia: domingo, 1 de agosto de 2021 13:21
https://unsplash.it/800/600?image=460 guardada el dia: domingo, 1 de agosto de 2021 13:21
https://unsplash.it/800/600?image=54 guardada el dia: domingo, 1 de agosto de 2021 13:21
https://unsplash.it/800/600?image=634 guardada el dia: domingo, 1 de agosto de 2021 13:21
https://unsplash.it/800/600?image=178 guardada el dia: domingo, 1 de agosto de 2021 13:21
https://unsplash.it/800/600?image=923 guardada el dia: domingo, 1 de agosto de 2021 13:21
https://unsplash.it/800/600?image=285 guardada el dia: domingo, 1 de agosto de 2021 13:21
