[
  {
    "anonymous": false,
    "inputs": [
      {
        "indexed": false,
        "internalType": "uint256",
        "name": "coolPoolID",
        "type": "uint256"
      },
      {
        "indexed": false,
        "internalType": "uint64",
        "name": "chainId",
        "type": "uint64"
      },
      {
        "indexed": false,
        "internalType": "address",
        "name": "targetAddress",
        "type": "address"
      },
      {
        "indexed": false,
        "internalType": "uint256",
        "name": "lastCalculatedBlock",
        "type": "uint256"
      },
      {
        "indexed": false,
        "internalType": "uint256",
        "name": "txCount",
        "type": "uint256"
      },
      {
        "indexed": false,
        "internalType": "uint256",
        "name": "emission",
        "type": "uint256"
      }
    ],
    "name": "SubmissionCentralized",
    "type": "event"
  },
  {
    "inputs": [
      {
        "internalType": "uint256",
        "name": "coolPoolID",
        "type": "uint256"
      },
      {
        "components": [
          {
            "internalType": "uint64",
            "name": "chainId",
            "type": "uint64"
          },
          {
            "internalType": "address",
            "name": "address_",
            "type": "address"
          },
          {
            "internalType": "uint256",
            "name": "knownLastCalculatedBlock",
            "type": "uint256"
          },
          {
            "internalType": "uint256",
            "name": "newLastCalculatedBlock",
            "type": "uint256"
          }
        ],
        "internalType": "struct TargetAddressesManager.UpdateTargetAddress[]",
        "name": "updates",
        "type": "tuple[]"
      },
      {
        "internalType": "uint256[]",
        "name": "targetAddressesTxCounts",
        "type": "uint256[]"
      },
      {
        "internalType": "uint256[]",
        "name": "targetAddressesEmissions",
        "type": "uint256[]"
      }
    ],
    "name": "submitEmissionForCoolPool",
    "outputs": [],
    "stateMutability": "nonpayable",
    "type": "function"
  }
]